mediatopic
type: ConceptScheme
pref scheme alias: medtop
authority: http://www.iptc.org
rights holder: IPTC, International Press Telecommunications Council - https://iptc.org
licence link: http://creativecommons.org/licenses/by/4.0/
date released: 2026-07-02T12:00:00+00:00
date submitted: 2026-07-02T12:00:00+00:00
has top concept: artes, cultura, entretenimento e mídia
has top concept: crime, lei e justiça
has top concept: desastres, acidentes e emergências
has top concept: economia, negócios e finanças
has top concept: educação
has top concept: ambiente
has top concept: saúde
has top concept: interesse humano
has top concept: trabalho
has top concept: estilo de vida e lazer
has top concept: política
has top concept: religião e crença
has top concept: ciência e tecnologia
has top concept: sociedade
has top concept: esporte
has top concept: conflito, guerra e paz
has top concept: meteorologia

artes, cultura, entretenimento e mídia
type: Concept
definition: Todas as formas de arte, entretenimento, herança cultural e mídia.
in scheme: mediatopic
created: 2009-10-22T02:00:00+00:00
modified: 2021-02-18T12:00:00+00:00
narrower: arte e entretenimento
narrower: cultura
narrower: mídia de massas

crime, lei e justiça
type: Concept
definition: Estabelecimento e/ou declaração das regras de comportamento em sociedade, aplicação dessas regras, quebra das regras e penas para os infratores. Organizações e pessoas envolvidas nessas atividades.
in scheme: mediatopic
created: 2009-10-22T02:00:00+00:00
modified: 2021-05-05T12:00:00+00:00
narrower: crime
narrower: judiciário (sistema de justiça)
narrower: justiça e direitos
narrower: leis
narrower: forças policiais

desastres, acidentes e emergências
type: Concept
definition: Desastres naturais ou provocados pelo homem, de que resultam perda de vidas ou ferimentos de criaturas e/ou danos a objetos ou propriedades.
in scheme: mediatopic
created: 2009-10-22T02:00:00+00:00
modified: 2021-05-05T12:00:00+00:00
narrower: acidente (geral)
narrower: desastre (geral)
narrower: caso de emergência
narrower: planos de emergência
narrower: resposta de emergência

economia, negócios e finanças
type: Concept
definition: Assuntos relativos à planificação, produção e troca de riqueza.
in scheme: mediatopic
created: 2009-10-22T02:00:00+00:00
modified: 2021-07-12T12:00:00+00:00
narrower: informação sobre empresas
narrower: setor econômico
narrower: economia (geral)
narrower: empresas
narrower: mercado e bolsa

educação
type: Concept
definition: Tudo o que contribui para o alargamento do conhecimento dos indivíduos, desde o nascimento até a morte.
in scheme: mediatopic
created: 2009-10-22T02:00:00+00:00
modified: 2021-09-30T12:00:00+00:00
narrower: associações de pais
narrower: Educação religiosa
narrower: escolas
narrower: aprendizagem social
narrower: ensino/aprendizado
narrower: currículo
narrower: prova
narrower: exame de admissão
narrower: alunos
narrower: professores
narrower: ensino profissional
narrower: classificação
narrower: http://cv.iptc.org/newscodes/mediatopic/20001337

ambiente
type: Concept
definition: Todos os aspetos relativos a proteção, estragos e preservação do ecossistema do planeta Terra e de seu ambiente.
in scheme: mediatopic
created: 2009-10-22T02:00:00+00:00
modified: 2025-10-09T12:00:00+00:00
narrower: alterações climáticas
narrower: conservação
narrower: poluição ambiental
narrower: recursos naturais
narrower: natureza
narrower: http://cv.iptc.org/newscodes/mediatopic/20001374

saúde
type: Concept
definition: Todos os aspectos relativos ao bem-estar físico e mental dos seres humanos.
in scheme: mediatopic
created: 2009-10-22T02:00:00+00:00
modified: 2022-06-14T12:00:00+00:00
narrower: doenças e condições
narrower: estabelecimento de saúde
narrower: organizações de saúde
narrower: tratamento de saúde
narrower: sistema público de saúde
narrower: seguro de saúde
narrower: sistemas privados de saúde
narrower: profissão médica
narrower: doenças não humanas
narrower: http://cv.iptc.org/newscodes/mediatopic/20001358

interesse humano
type: Concept
definition: Temas sobre indivíduos, grupos, animais, plantas ou outros objetos, com foco em aspetos emocionais.
in scheme: mediatopic
created: 2009-10-22T02:00:00+00:00
modified: 2021-05-05T12:00:00+00:00
narrower: feitos
narrower: prêmios e galardões
narrower: recordes e proezas
narrower: cerimônia
narrower: pessoas
narrower: desaires
narrower: alta sociedade
narrower: celebridades
narrower: efeméride
narrower: aniversário

trabalho
type: Concept
definition: Aspectos sociais, organizações, regras e condições que afetam o emprego e a geração de riqueza ou o fornecimento de serviços. Apoio econômico aos desempregados.
in scheme: mediatopic
created: 2009-10-22T02:00:00+00:00
modified: 2021-02-18T12:00:00+00:00
narrower: emprego
narrower: legislação trabalhista
narrower: mercado de trabalho
narrower: relações trabalhistas
narrower: aposentadoria
narrower: desemprego
narrower: sindicatos

estilo de vida e lazer
type: Concept
definition: Atividades realizadas por prazer, para relaxamento ou divertimento, fora do emprego, incluindo comer e viajar.
in scheme: mediatopic
created: 2009-10-22T02:00:00+00:00
modified: 2021-05-05T12:00:00+00:00
narrower: lazer
narrower: estilo de vida
narrower: http://cv.iptc.org/newscodes/mediatopic/20001339

política
type: Concept
definition: Exercício do poder local, regional, nacional e internacional ou luta pelo poder e relações entre governos e estados.
in scheme: mediatopic
created: 2009-10-22T02:00:00+00:00
modified: 2025-03-31T12:00:00+00:00
narrower: eleições
narrower: governo
narrower: política governamental
narrower: relações internacionais
narrower: organização não governamental
narrower: crise política
narrower: dissidência política
narrower: processo político

religião e crença
type: Concept
definition: Todos os aspectos da existência humana que envolvem teologia, filosofia, ética e espiritualidade.
in scheme: mediatopic
created: 2009-10-22T02:00:00+00:00
modified: 2021-12-21T12:00:00+00:00
narrower: crenças religiosas
narrower: diálogo inter-religioso
narrower: conflito religioso
narrower: evento religioso
narrower: festa ou feriado religioso
narrower: ritual
narrower: instalações religiosas
narrower: instituições religiosas e relações com o estado
narrower: líder religioso
narrower: textos religiosos

ciência e tecnologia
type: Concept
definition: Todos os aspetos relacionados com a interpretação humana da natureza e do mundo físico e com o desenvolvimento e aplicação desse conhecimento.
in scheme: mediatopic
created: 2009-10-22T02:00:00+00:00
modified: 2021-02-18T12:00:00+00:00
narrower: ciência biomédica
narrower: matemática
narrower: ciências naturais
narrower: investigação científica
narrower: instituições científicas
narrower: ciências sociais
narrower: normas científicas
narrower: tecnologia e engenharia

sociedade
type: Concept
definition: Questões que afetam os indivíduos em suas vidas diárias, como habitação, comida, educação, relações pessoais.
in scheme: mediatopic
created: 2009-10-22T02:00:00+00:00
modified: 2021-02-18T12:00:00+00:00
narrower: direitos fundamentais
narrower: comunidades
narrower: demografia
narrower: imigração
narrower: emigrantes
narrower: discriminação
narrower: família
narrower: humanidade
narrower: condição social
narrower: problemas sociais
narrower: valores
narrower: assistência social
narrower: http://cv.iptc.org/newscodes/mediatopic/20001373

esporte
type: Concept
definition: Exercício competitivo envolvendo esforço físico. Organizações e corpos envolvidos nessas atividades.
in scheme: mediatopic
created: 2009-10-22T02:00:00+00:00
modified: 2021-02-18T12:00:00+00:00
narrower: disciplina de competição
narrower: medidas disciplinares no esporte
narrower: dopagem (geral)
narrower: eventos esportivos
narrower: indústria do esporte
narrower: organizações esportivas
narrower: instalação esportiva
narrower: transferência
narrower: conquistas esportivas
narrower: http://cv.iptc.org/newscodes/mediatopic/20001323
narrower: http://cv.iptc.org/newscodes/mediatopic/20001324
narrower: http://cv.iptc.org/newscodes/mediatopic/20001325

conflito, guerra e paz
type: Concept
definition: Atos de protesto ou de violência, cujos motivos podem ser sociais ou políticos, atividades militares, conflitos geopolíticos, esforços de resolução de conflitos.
in scheme: mediatopic
created: 2009-10-22T02:00:00+00:00
modified: 2021-02-18T12:00:00+00:00
broad match: http://cv.iptc.org/newscodes/subjectcode/16000000
narrower: terrorismo
narrower: conflito armado
narrower: agitação civil
narrower: golpe de estado
narrower: massacre
narrower: processo de paz
narrower: reconstrução pós-guerra
narrower: http://cv.iptc.org/newscodes/mediatopic/20001361
narrower: http://cv.iptc.org/newscodes/mediatopic/20001377

meteorologia
type: Concept
definition: Estudo, relatório e previsão de fenômenos meteorológicos.
in scheme: mediatopic
created: 2009-10-22T02:00:00+00:00
modified: 2021-02-18T12:00:00+00:00
narrower: previsão meteorológica
narrower: fenômenos climáticos
narrower: estatísticas climáticas
narrower: alerta meteorológico

arte e entretenimento
type: Concept
definition: Todas as formas de arte e entretenimento.
in scheme: mediatopic
created: 2009-10-22T02:00:00+00:00
modified: 2021-02-18T12:00:00+00:00
broad match: http://cv.iptc.org/newscodes/subjectcode/01000000
broader: artes, cultura, entretenimento e mídia
narrower: animação
narrower: cartoon
narrower: cinema
narrower: dança
narrower: moda
narrower: literatura
narrower: música
narrower: teatro
narrower: artes visuais
narrower: série
narrower: festival

animação
type: Concept
definition: Animação, incluindo longas e curtas-metragens, artistas e comercialização de produtos com personagens de animação.
in scheme: mediatopic
created: 2009-10-22T02:00:00+00:00
modified: 2021-03-15T12:00:00+00:00
broader: arte e entretenimento

cartoon
type: Concept
definition: Imagens como caricaturas editoriais e tiras de quadrinhos.
in scheme: mediatopic
created: 2009-10-22T02:00:00+00:00
modified: 2021-02-18T12:00:00+00:00
broader: arte e entretenimento

cinema
type: Concept
definition: Histórias relativas ao cinema como arte e entretenimento.
in scheme: mediatopic
created: 2009-10-22T02:00:00+00:00
modified: 2021-02-18T12:00:00+00:00
broader: arte e entretenimento

festivais de cinema
type: Concept
definition: Todas as formas de festivais de cinema nacionais e internacionais.
in scheme: mediatopic
created: 2009-10-22T02:00:00+00:00
modified: 2021-02-18T12:00:00+00:00
broader: festival

dança
type: Concept
definition: Expressão de emoções ou mensagens através do movimento do corpo.
in scheme: mediatopic
created: 2009-10-22T02:00:00+00:00
modified: 2021-02-18T12:00:00+00:00
broader: arte e entretenimento
narrower: ballet
narrower: dança moderna
narrower: dança tradicional

ballet
type: Concept
definition: Uma forma de dança clássica, baseada em gestos, passos e posturas formais.
in scheme: mediatopic
created: 2009-10-22T02:00:00+00:00
modified: 2021-02-18T12:00:00+00:00
broad match: http://cv.iptc.org/newscodes/subjectcode/01006000
broader: dança

dança moderna
type: Concept
definition: Estilo de dança teatral, baseado na expressão livre em vez de gestos formais.
in scheme: mediatopic
created: 2009-10-22T02:00:00+00:00
modified: 2021-02-18T12:00:00+00:00
broad match: http://cv.iptc.org/newscodes/subjectcode/01006000
broader: dança

dança tradicional
type: Concept
definition: Estilo de dança que reflete a vida e a cultura de um grupo específico ou região, como o folclore ou a dança cerimonial.
in scheme: mediatopic
created: 2009-10-22T02:00:00+00:00
modified: 2021-02-18T12:00:00+00:00
broad match: http://cv.iptc.org/newscodes/subjectcode/01006000
broader: dança

moda
type: Concept
definition: Criação e uso de roupa, de calçado e de acessórios.
in scheme: mediatopic
created: 2009-10-22T02:00:00+00:00
modified: 2021-02-18T12:00:00+00:00
broader: arte e entretenimento
narrower: joias
narrower: cosmética
narrower: penteados

joias
type: Concept
definition: Objetos decorativos usados para expressão pessoal e adorno, como anéis, colares, brincos.
in scheme: mediatopic
created: 2009-10-22T02:00:00+00:00
modified: 2021-02-18T12:00:00+00:00
broader: moda

literatura
type: Concept
definition: Uso de panfletos, livros ou outros materiais impressos para transmitir ideias, histórias ou mensagens ao público.
in scheme: mediatopic
created: 2009-10-22T02:00:00+00:00
modified: 2021-02-18T12:00:00+00:00
broader: arte e entretenimento
narrower: drama (literatura)
narrower: ficção
narrower: não ficção
narrower: poesia

drama (literatura)
type: Concept
definition: Obra escrita para ser representada.
in scheme: mediatopic
created: 2009-10-22T02:00:00+00:00
modified: 2021-02-18T12:00:00+00:00
broad match: http://cv.iptc.org/newscodes/subjectcode/01010000
broader: literatura

ficção
type: Concept
definition: Histórias estruturadas que geralmente não se baseiam em fatos e que são criação da imaginação dos autores.
in scheme: mediatopic
created: 2009-10-22T02:00:00+00:00
modified: 2021-02-18T12:00:00+00:00
broader: literatura

não ficção
type: Concept
definition: Obra escrita baseada em fatos.
in scheme: mediatopic
created: 2009-10-22T02:00:00+00:00
modified: 2021-02-18T12:00:00+00:00
broad match: http://cv.iptc.org/newscodes/subjectcode/01010000
broader: literatura

poesia
type: Concept
definition: Obras escritas que usam as qualidades estéticas e rítmicas da língua para expressar emoções ou uma mensagem.
in scheme: mediatopic
created: 2009-10-22T02:00:00+00:00
modified: 2021-02-18T12:00:00+00:00
broader: literatura

música
type: Concept
definition: Forma de expressão artística que usa instrumentos ou voz, usando diferentes sons, tons e harmonias.
in scheme: mediatopic
created: 2009-10-22T02:00:00+00:00
modified: 2021-02-18T12:00:00+00:00
broader: arte e entretenimento
narrower: instrumento musical
narrower: concerto
narrower: gênero musical

instrumento musical
type: Concept
definition: Objetos usados para tocar música.
in scheme: mediatopic
created: 2009-10-22T02:00:00+00:00
modified: 2021-02-18T12:00:00+00:00
broad match: http://cv.iptc.org/newscodes/subjectcode/01011000
broader: música

concerto
type: Concept
definition: Atuação musical em que os músicos ou cantores atuam perante um público para entretenimento.
in scheme: mediatopic
created: 2009-10-22T02:00:00+00:00
modified: 2021-02-18T12:00:00+00:00
broad match: http://cv.iptc.org/newscodes/subjectcode/01011000
broader: música

gênero musical
type: Concept
definition: Um tipo de música distinguível.
in scheme: mediatopic
created: 2009-10-22T02:00:00+00:00
modified: 2021-02-18T12:00:00+00:00
broad match: http://cv.iptc.org/newscodes/subjectcode/01011000
broader: música
narrower: música clássica
narrower: música country
narrower: música folk
narrower: música jazz
narrower: música popular
narrower: música rock
narrower: hip-hop
narrower: R&B
narrower: heavy metal
narrower: música de banda de dança
narrower: música de dança eletrônica
narrower: música para crianças

música clássica
type: Concept
definition: Música que segue estruturas clássicas de ritmo e harmonia.
in scheme: mediatopic
created: 2009-10-22T02:00:00+00:00
modified: 2021-02-18T12:00:00+00:00
broader: gênero musical

música country
type: Concept
definition: Gênero de música com origem no Sul dos Estados Unidos, que consiste frequentemente em baladas ou músicas dançáveis e que usa instrumentos de corda, como os banjos ou as guitarras.
in scheme: mediatopic
created: 2009-10-22T02:00:00+00:00
modified: 2021-02-18T12:00:00+00:00
broader: gênero musical

música folk
type: Concept
definition: Música que se desenvolveu a partir de culturas populares.
in scheme: mediatopic
created: 2009-10-22T02:00:00+00:00
modified: 2021-02-18T12:00:00+00:00
broader: gênero musical

música jazz
type: Concept
definition: Gênero de música com raízes nos blues e no ragtime, originário das comunidades afro-americanas de Nova Orleães nos Estados Unidos no fim do século XIX e início do século XX.
in scheme: mediatopic
created: 2009-10-22T02:00:00+00:00
modified: 2021-02-18T12:00:00+00:00
broader: gênero musical

música popular
type: Concept
definition: Gênero de música amplamente acessível e criada para agradar a toda a gente.
in scheme: mediatopic
created: 2009-10-22T02:00:00+00:00
modified: 2021-02-18T12:00:00+00:00
broader: gênero musical

música rock
type: Concept
definition: Gênero de música com origem nos Estados Unidos durante as décadas de 1940 e 1950, que evoluiu dos estilos musicais afro-americanos, como o gospel, blues, jazz, boogie woogie e R&B.
in scheme: mediatopic
created: 2009-10-22T02:00:00+00:00
modified: 2021-02-18T12:00:00+00:00
broader: gênero musical

ópera
type: Concept
definition: Forma de arte performativa em que músicos e cantores clássicos representam obras dramáticas e musicais.
in scheme: mediatopic
created: 2009-10-22T02:00:00+00:00
modified: 2021-09-30T12:00:00+00:00
broad match: http://cv.iptc.org/newscodes/subjectcode/01017001
broader: teatro

teatro
type: Concept
definition: Representação de uma história ou ideia através de diálogos, música e expressão física, em espaço ou edifício concebido para o efeito.
in scheme: mediatopic
created: 2009-10-22T02:00:00+00:00
modified: 2021-02-18T12:00:00+00:00
broader: arte e entretenimento
narrower: ópera
narrower: teatro musical
narrower: musical
narrower: opereta
narrower: drama (teatro)
narrower: stand-up
narrower: cabaré

teatro musical
type: Concept
definition: Representação de uma história através de canções, diálogo e ação, como a ópera, a opereta, as revistas musicais, os music halls.
in scheme: mediatopic
created: 2009-10-22T02:00:00+00:00
modified: 2021-09-30T12:00:00+00:00
retired: 2021-09-30T12:00:00+00:00
broader: teatro

artes visuais
type: Concept
definition: Forma de arte que apela sobretudo ao sentido visual, como a cerâmica, desenho, pintura, escultura, impressão, design, artesanato, fotografia, vídeo, cinema e arquitetura.
in scheme: mediatopic
created: 2009-10-22T02:00:00+00:00
modified: 2021-02-18T12:00:00+00:00
broad match: http://cv.iptc.org/newscodes/subjectcode/01000000
broader: arte e entretenimento
narrower: arquitetura
narrower: design
narrower: desenho
narrower: pintura
narrower: fotografia
narrower: escultura
narrower: artes têxteis
narrower: marcenaria
narrower: forjamento

arquitetura
type: Concept
definition: Construção de edifícios, monumentos e espaços envolventes.
in scheme: mediatopic
created: 2009-10-22T02:00:00+00:00
modified: 2021-02-18T12:00:00+00:00
broader: artes visuais

design
type: Concept
definition: Disciplina artística que se foca na comunicação e apresentação visuais, e cujo produto final pode ir da joalheria ao design de interiores.
in scheme: mediatopic
created: 2009-10-22T02:00:00+00:00
modified: 2021-02-18T12:00:00+00:00
broad match: http://cv.iptc.org/newscodes/subjectcode/01000000
broader: artes visuais

desenho
type: Concept
definition: Forma de arte visual que usa materiais como lápis, marcadores, caneta e tinta, carvão.
in scheme: mediatopic
created: 2009-10-22T02:00:00+00:00
modified: 2021-02-18T12:00:00+00:00
broad match: http://cv.iptc.org/newscodes/subjectcode/01000000
broader: artes visuais

pintura
type: Concept
definition: Arte visual que expressa emoções ou mensagens através do uso de óleos, aguarelas, pastéis, lápis, carvão etc., em diversas bases.
in scheme: mediatopic
created: 2009-10-22T02:00:00+00:00
modified: 2021-02-18T12:00:00+00:00
broader: artes visuais

fotografia
type: Concept
definition: Meio mecânico de criar imagens mediante o uso da luz e de materiais sensíveis à luz, com químicos ou mediante meios digitais.
in scheme: mediatopic
created: 2009-10-22T02:00:00+00:00
modified: 2021-02-18T12:00:00+00:00
broader: artes visuais

escultura
type: Concept
definition: Representação de formas em barro, pedra, madeira, metal ou outros materiais.
in scheme: mediatopic
created: 2009-10-22T02:00:00+00:00
modified: 2021-05-05T12:00:00+00:00
broader: artes visuais

cultura
type: Concept
definition: Ideias, costumes, artes, tradições de um grupo em particular.
in scheme: mediatopic
created: 2009-10-22T02:00:00+00:00
modified: 2021-02-18T12:00:00+00:00
broader: artes, cultura, entretenimento e mídia
narrower: desenvolvimento cultural
narrower: costumes e tradições
narrower: festividades (cultura)
narrower: língua
narrower: bibliotecas e museus
narrower: monumentos e patrimônio
narrower: exposição artística

desenvolvimento cultural
type: Concept
definition: História do desenvolvimento de artes e culturas, tais como pinturas rupestres, arte pré-colombiana, confecção de papel chinês.
in scheme: mediatopic
created: 2009-10-22T02:00:00+00:00
modified: 2021-02-18T12:00:00+00:00
broader: cultura

costumes e tradições
type: Concept
definition: Comportamentos ou atitudes que se desenvolveram ao longo do tempo entre um grupo de pessoas.
in scheme: mediatopic
created: 2009-10-22T02:00:00+00:00
modified: 2021-02-18T12:00:00+00:00
broader: cultura

festividades (cultura)
type: Concept
definition: Um evento geralmente celebrado por uma comunidade e centrado em algum aspeto dessa comunidade ou em sua religião e tradições.
in scheme: mediatopic
created: 2009-10-22T02:00:00+00:00
modified: 2021-02-18T12:00:00+00:00
broader: cultura

língua
type: Concept
definition: Meio através do qual as pessoas comunicam umas com as outras.
in scheme: mediatopic
created: 2009-10-22T02:00:00+00:00
modified: 2021-02-18T12:00:00+00:00
broader: cultura

bibliotecas e museus
type: Concept
definition: Edifícios utilizados para albergar coleções de livros, música, arte ou objetos do passado e do presente para uso público e exibição.
in scheme: mediatopic
created: 2009-10-22T02:00:00+00:00
modified: 2021-05-05T12:00:00+00:00
broader: cultura

monumentos e patrimônio
type: Concept
definition: Áreas que contêm objetos comemorativos da história, de um povo ou de eventos.
in scheme: mediatopic
created: 2009-10-22T02:00:00+00:00
modified: 2021-05-05T12:00:00+00:00
broader: cultura
narrower: obras de renovação

mídia de massas
type: Concept
definition: Meios de comunicação que se destinam a um grande público, como a televisão, o rádio, as revistas, os jornais etc.
in scheme: mediatopic
created: 2009-10-22T02:00:00+00:00
modified: 2021-02-18T12:00:00+00:00
broader: artes, cultura, entretenimento e mídia
narrower: mídia noticiosa
narrower: jornais
narrower: mídia online
narrower: periódicos
narrower: rádio
narrower: televisão
narrower: mídias sociais
narrower: desinformação e informação errada

mídia noticiosa
type: Concept
definition: Televisão, rádio, serviços de notícias que recolhem fatos sobre incidentes, desenvolvendo e fazendo sua apresentação ao público como uma história completa.
in scheme: mediatopic
created: 2009-10-22T02:00:00+00:00
modified: 2021-02-18T12:00:00+00:00
broader: mídia de massas

jornais
type: Concept
definition: Publicações diárias ou semanais que apresentam em geral notícias e informações atualizadas, locais, nacionais e internacionais, assim como artigos de opinião, artigos de fundo, quadrinhos e outros conteúdos.
in scheme: mediatopic
created: 2009-10-22T02:00:00+00:00
modified: 2021-02-18T12:00:00+00:00
broader: mídia de massas

mídia online
type: Concept
definition: Conteúdos publicados na Internet, como artigos, blogues, fotos, vídeo e música.
in scheme: mediatopic
created: 2009-10-22T02:00:00+00:00
modified: 2021-05-05T12:00:00+00:00
broad match: http://cv.iptc.org/newscodes/subjectcode/01026000
broader: mídia de massas

periódicos
type: Concept
definition: Material escrito que se publica semanal, quinzenal, mensal ou anualmente.
in scheme: mediatopic
created: 2009-10-22T02:00:00+00:00
modified: 2021-02-18T12:00:00+00:00
broader: mídia de massas

rádio
type: Concept
definition: Histórias relativas à rádio como difusora de conteúdo noticioso e meio de entretenimento.
in scheme: mediatopic
created: 2009-10-22T02:00:00+00:00
modified: 2021-02-18T12:00:00+00:00
broader: mídia de massas

televisão
type: Concept
definition: Histórias relativas à televisão como difusora de conteúdo informativo e meio de entretenimento.
in scheme: mediatopic
created: 2009-10-22T02:00:00+00:00
modified: 2021-02-18T12:00:00+00:00
broader: mídia de massas

terrorismo
type: Concept
definition: Ato de violência, por vezes mortal, para fazer crescer o medo e a ansiedade de uma população.
in scheme: mediatopic
created: 2009-10-22T02:00:00+00:00
modified: 2021-02-18T12:00:00+00:00
broader: conflito, guerra e paz
narrower: atos de bioterrorismo
narrower: atentados à bomba

atos de bioterrorismo
type: Concept
definition: Ataques com utilização de substâncias biológicas ou químicas para aumentar o nível de medo da população, com ou sem mortes.
in scheme: mediatopic
created: 2009-10-22T02:00:00+00:00
modified: 2021-02-18T12:00:00+00:00
broader: terrorismo

atentados à bomba
type: Concept
definition: Uso de dispositivos explosivos contras pessoas, edifícios ou estruturas.
in scheme: mediatopic
created: 2009-10-22T02:00:00+00:00
modified: 2023-03-31T12:00:00+00:00
broader: terrorismo

conflito armado
type: Concept
definition: Disputas entre grupos opostos, envolvendo o uso de armas, mas não sendo guerra declarada.
in scheme: mediatopic
created: 2009-10-22T02:00:00+00:00
modified: 2021-02-18T12:00:00+00:00
broader: conflito, guerra e paz
narrower: guerrilha
narrower: intervenção militar internacional
narrower: ocupação militar
narrower: guerra

guerrilha
type: Concept
definition: Ações antigovernamentais de grupos clandestinos armados, mediante ataques súbitos, sabotagem, sequestro etc.
in scheme: mediatopic
created: 2009-10-22T02:00:00+00:00
modified: 2021-02-18T12:00:00+00:00
broader: conflito armado

intervenção militar internacional
type: Concept
definition: Uso temporário de forças internacionais, seja por convite ou por decisão de órgão estrangeiro, num país ou numa região com intenção de resolver uma crise.
in scheme: mediatopic
created: 2009-10-22T02:00:00+00:00
modified: 2021-02-18T12:00:00+00:00
broader: conflito armado

força de paz
type: Concept
definition: Forças militares de diferentes nacionalidades agrupadas sob comando internacional para manter a ordem em áreas de conflito.
in scheme: mediatopic
created: 2009-10-22T02:00:00+00:00
modified: 2024-03-28T12:00:00+00:00
broader: processo de paz

ocupação militar
type: Concept
definition: A invasão forçada temporária de um país ou região por forças militares.
in scheme: mediatopic
created: 2009-10-22T02:00:00+00:00
modified: 2021-02-18T12:00:00+00:00
broad match: http://cv.iptc.org/newscodes/subjectcode/16000000
broader: conflito armado

desaparecidos em combate
type: Concept
definition: Pessoas, civis e militares, desaparecidas durante ou após conflitos, guerras ou hostilidades.
in scheme: mediatopic
created: 2009-10-22T02:00:00+00:00
modified: 2024-07-01T12:00:00+00:00
broader: http://cv.iptc.org/newscodes/mediatopic/20001377

guerra
type: Concept
definition: Declaração formal de hostilidades de um país a outro.
in scheme: mediatopic
created: 2009-10-22T02:00:00+00:00
modified: 2021-02-18T12:00:00+00:00
broader: conflito armado
narrower: guerra civil
narrower: crimes de guerra

guerra civil
type: Concept
definition: Conflito armado entre membros de um país ou de uma região geográfica, em alguns casos com intenção de causar a divisão do país ou da região.
in scheme: mediatopic
created: 2009-10-22T02:00:00+00:00
modified: 2021-02-18T12:00:00+00:00
broader: guerra

crimes de guerra
type: Concept
definition: Crimes cometidos durante uma guerra ou conflito armado, geralmente contra civis ou prisioneiros de guerra.
in scheme: mediatopic
created: 2009-10-22T02:00:00+00:00
modified: 2021-05-05T12:00:00+00:00
retired: 2016-04-05T12:00:00+00:00
broader: guerra

agitação civil
type: Concept
definition: Insatisfação entre a população geral, conforme comprovado por comícios, greves, manifestações ou sabotagens.
in scheme: mediatopic
created: 2009-10-22T02:00:00+00:00
modified: 2021-02-18T12:00:00+00:00
broader: conflito, guerra e paz
narrower: manifestação
narrower: rebeliões
narrower: revoluções
narrower: motins

manifestação
type: Concept
definition: Demonstração pública de sentimentos ou opiniões através de concentrações ou marchas de caráter político e/ou social.
in scheme: mediatopic
created: 2009-10-22T02:00:00+00:00
modified: 2026-07-02T12:00:00+00:00
broader: agitação civil

rebeliões
type: Concept
definition: Ações organizadas de oposição a um governo ou partido governante pelos cidadãos de um país, muitas vezes com violência e com a intenção de derrubar o governo.
in scheme: mediatopic
created: 2009-10-22T02:00:00+00:00
modified: 2021-02-18T12:00:00+00:00
broader: agitação civil

revoluções
type: Concept
definition: Alteração por vezes violenta do sistema governativo de um país, feita por forças internas que provocam mudanças sociais sistemáticas.
in scheme: mediatopic
created: 2009-10-22T02:00:00+00:00
modified: 2021-02-18T12:00:00+00:00
broader: agitação civil

motins
type: Concept
definition: Manifestações violentas e destrutivas de desordem civil, frequentemente envolvendo feridos e destruição de propriedade.
in scheme: mediatopic
created: 2009-10-22T02:00:00+00:00
modified: 2021-02-18T12:00:00+00:00
broader: agitação civil

golpe de estado
type: Concept
definition: Derrube de um governo estabelecido, feito por um grupo organizado, geralmente militar ou político.
in scheme: mediatopic
created: 2009-10-22T02:00:00+00:00
modified: 2021-02-18T12:00:00+00:00
broader: conflito, guerra e paz

massacre
type: Concept
definition: Morte de um grande grupo de pessoas em um curto período de tempo.
in scheme: mediatopic
created: 2009-10-22T02:00:00+00:00
modified: 2021-02-18T12:00:00+00:00
broader: conflito, guerra e paz

genocídio
type: Concept
definition: Morte sistemática de clã, tribo ou grupo étnico por outro.
in scheme: mediatopic
created: 2009-10-22T02:00:00+00:00
modified: 2024-03-28T12:00:00+00:00
broader: crime

processo de paz
type: Concept
definition: Ações organizadas para pôr fim a uma guerra ou conflito, que envolvem geralmente negociações de paz e acordos.
in scheme: mediatopic
created: 2009-10-22T02:00:00+00:00
modified: 2021-02-18T12:00:00+00:00
broad match: http://cv.iptc.org/newscodes/subjectcode/11002003
broader: conflito, guerra e paz
narrower: força de paz
narrower: enviado de paz
narrower: plano de paz
narrower: conversações de paz
narrower: desarmamento

enviado de paz
type: Concept
definition: Pessoa ou organização que inicia ou desenvolve um processo de paz.
in scheme: mediatopic
created: 2009-10-22T02:00:00+00:00
modified: 2021-07-12T12:00:00+00:00
broad match: http://cv.iptc.org/newscodes/subjectcode/11002003
broader: processo de paz

plano de paz
type: Concept
definition: Uma estratégia para atingir a paz numa nação em guerra ou área em conflito.
in scheme: mediatopic
created: 2009-10-22T02:00:00+00:00
modified: 2021-02-18T12:00:00+00:00
broad match: http://cv.iptc.org/newscodes/subjectcode/11002003
broader: processo de paz

conversações de paz
type: Concept
definition: Discussões entre países, regiões ou entidades geopolíticas em conflito ou em guerra, muitas vezes com um mediador, com o objetivo de chegar a uma solução para a paz.
in scheme: mediatopic
created: 2009-10-22T02:00:00+00:00
modified: 2021-05-05T12:00:00+00:00
broad match: http://cv.iptc.org/newscodes/subjectcode/11002003
broader: processo de paz

reconstrução pós-guerra
type: Concept
definition: Ações para reconstruir uma sociedade, economia ou sistema político numa área afetada pela guerra.
in scheme: mediatopic
created: 2009-10-22T02:00:00+00:00
modified: 2021-02-18T12:00:00+00:00
broad match: http://cv.iptc.org/newscodes/subjectcode/11002000
broader: conflito, guerra e paz
narrower: neutralização de material bélico

desarmamento
type: Concept
definition: A abolição ou redução da provisão de armas militares de um país.
in scheme: mediatopic
created: 2009-10-22T02:00:00+00:00
modified: 2024-03-28T12:00:00+00:00
broad match: http://cv.iptc.org/newscodes/subjectcode/11002000
broader: processo de paz

neutralização de material bélico
type: Concept
definition: Remoção ou neutralização de elementos que permanecem ativos após o fim de guerras ou conflitos armados, como minas terrestres ou bombas de fragmentação.
in scheme: mediatopic
created: 2009-10-22T02:00:00+00:00
modified: 2021-02-18T12:00:00+00:00
broader: reconstrução pós-guerra

prisioneiros de guerra
type: Concept
definition: As pessoas capturadas e presas pelo inimigo durante guerras e conflitos armados.
in scheme: mediatopic
created: 2009-10-22T02:00:00+00:00
modified: 2024-03-28T12:00:00+00:00
broader: http://cv.iptc.org/newscodes/mediatopic/20001377

crime
type: Concept
definition: Violação das leis por indivíduos, empresas ou organizações.
in scheme: mediatopic
created: 2009-10-22T02:00:00+00:00
modified: 2021-02-18T12:00:00+00:00
broader: crime, lei e justiça
narrower: genocídio
narrower: incêndio criminoso
narrower: assalto
narrower: cibercrime
narrower: crime econômico
narrower: corrupção
narrower: crimes relacionados com drogas
narrower: fraude
narrower: hijacking
narrower: homicídio
narrower: rapto
narrower: crime organizado
narrower: terrorismo
narrower: roubo
narrower: crime de guerra
narrower: infração de trânsito
narrower: contrabando e tráfico de pessoas
narrower: vandalismo
narrower: tiroteios
narrower: maus-tratos a animais
narrower: http://cv.iptc.org/newscodes/mediatopic/20001320

incêndio criminoso
type: Concept
definition: Incêndio intencional, de origem criminosa.
in scheme: mediatopic
created: 2009-10-22T02:00:00+00:00
modified: 2021-02-18T12:00:00+00:00
broader: crime

assalto
type: Concept
definition: Agressão física, briga, rixa e comportamento ameaçador.
in scheme: mediatopic
created: 2009-10-22T02:00:00+00:00
modified: 2021-02-18T12:00:00+00:00
broader: crime
narrower: crimes sexuais

crimes sexuais
type: Concept
definition: Agressão de natureza sexual cometida contra outra pessoa, como violação, assédio ou molestamento.
in scheme: mediatopic
created: 2009-10-22T02:00:00+00:00
modified: 2021-02-18T12:00:00+00:00
broader: assalto

cibercrime
type: Concept
definition: Atividades criminosas cometidas através de computadores ou através da Internet, como hacking, roubo de entidade ou phishing.
in scheme: mediatopic
created: 2009-10-22T02:00:00+00:00
modified: 2023-03-31T12:00:00+00:00
broader: crime

crime econômico
type: Concept
definition: Delitos cometidos por empresas e por seus responsáveis.
in scheme: mediatopic
created: 2009-10-22T02:00:00+00:00
modified: 2021-02-18T12:00:00+00:00
broader: crime
narrower: crime antitruste
narrower: quebra de contrato
narrower: peculato
narrower: abuso de informação privilegiada
narrower: restrição ao comércio
narrower: fraude contábil

crime antitruste
type: Concept
definition: Violação das leis contra monopólios.
in scheme: mediatopic
created: 2009-10-22T02:00:00+00:00
modified: 2021-05-05T12:00:00+00:00
broader: crime econômico

quebra de contrato
type: Concept
definition: Quebra de contratos legais entre companhias ou com clientes.
in scheme: mediatopic
created: 2009-10-22T02:00:00+00:00
modified: 2021-02-18T12:00:00+00:00
broader: crime econômico

peculato
type: Concept
definition: Roubo intencional de dinheiro deixado a cargo de alguém.
in scheme: mediatopic
created: 2009-10-22T02:00:00+00:00
modified: 2021-02-18T12:00:00+00:00
broader: crime econômico

abuso de informação privilegiada
type: Concept
definition: Compra ou venda de ações por pessoas com acesso a informação interna não divulgada ao público na altura da transação.
in scheme: mediatopic
created: 2009-10-22T02:00:00+00:00
modified: 2021-02-18T12:00:00+00:00
broader: crime econômico

restrição ao comércio
type: Concept
definition: Entrave à livre concorrência nos negócios e no comércio.
in scheme: mediatopic
created: 2009-10-22T02:00:00+00:00
modified: 2021-02-18T12:00:00+00:00
broader: crime econômico

corrupção
type: Concept
definition: Comportamento desonesto por alguém no poder em troca de ganho pecuniário ou pessoal.
in scheme: mediatopic
created: 2009-10-22T02:00:00+00:00
modified: 2021-02-18T12:00:00+00:00
broader: crime
narrower: suborno

suborno
type: Concept
definition: Dinheiro ou benefícios com que se pretende influenciar o juízo ou conduta de uma pessoa em uma posição de poder.
in scheme: mediatopic
created: 2009-10-22T02:00:00+00:00
modified: 2021-02-18T12:00:00+00:00
broader: corrupção

crimes relacionados com drogas
type: Concept
definition: Atividades ilegais que envolvem substâncias ilícitas, incluindo a compra, a distribuição, a venda e o tráfego.
in scheme: mediatopic
created: 2009-10-22T02:00:00+00:00
modified: 2021-02-18T12:00:00+00:00
broad match: http://cv.iptc.org/newscodes/subjectcode/02001000
broader: crime
narrower: tráfico de droga

tráfico de droga
type: Concept
definition: Tráfico de substâncias ilegais.
in scheme: mediatopic
created: 2009-10-22T02:00:00+00:00
modified: 2021-02-18T12:00:00+00:00
broader: crimes relacionados com drogas

fraude
type: Concept
definition: Engano intencional para ganho pessoa ou financeiro.
in scheme: mediatopic
created: 2009-10-22T02:00:00+00:00
modified: 2021-02-18T12:00:00+00:00
broader: crime
narrower: sonegação fiscal

hijacking
type: Concept
definition: Captura forçada de um veículo de transporte.
in scheme: mediatopic
created: 2009-10-22T02:00:00+00:00
modified: 2021-02-18T12:00:00+00:00
broad match: http://cv.iptc.org/newscodes/subjectcode/02001000
broader: crime

homicídio
type: Concept
definition: Morte de uma pessoa cometida por outra(s).
in scheme: mediatopic
created: 2009-10-22T02:00:00+00:00
modified: 2021-03-31T12:00:00+00:00
broader: crime

rapto
type: Concept
definition: Levar ou capturar e deter alguém contra sua vontade, mediante ameaças ilegais, força ou fraude.
in scheme: mediatopic
created: 2009-10-22T02:00:00+00:00
modified: 2021-02-18T12:00:00+00:00
broader: crime

crime organizado
type: Concept
definition: Crimes cometidos por gangues ou grupos criminosos, como a máfia.
in scheme: mediatopic
created: 2009-10-22T02:00:00+00:00
modified: 2021-02-18T12:00:00+00:00
broader: crime
narrower: gangues

gangues
type: Concept
definition: Atividades criminosas cometidas por grupos de indivíduos, ligados por territórios, línguas ou origens étnicas comuns, e que se identificam por um identidade de grupo comum, usando um nome, tatuagens, gestos, estilo de roupa ou símbolos partilhados.
in scheme: mediatopic
created: 2009-10-22T02:00:00+00:00
modified: 2021-05-05T12:00:00+00:00
broader: crime organizado

terrorismo
type: Concept
definition: Violência contra as pessoas para criar medo e alcançar objetivos políticos ou ideológicos.
in scheme: mediatopic
created: 2009-10-22T02:00:00+00:00
modified: 2021-02-18T12:00:00+00:00
broader: crime

roubo
type: Concept
definition: Apropriação ilegal.
in scheme: mediatopic
created: 2009-10-22T02:00:00+00:00
modified: 2021-05-05T12:00:00+00:00
broader: crime

crime de guerra
type: Concept
definition: Crimes cometidos durante uma guerra ou conflito armado, geralmente contra civis ou prisioneiros de guerra, incluindo o julgamento desses crimes.
in scheme: mediatopic
created: 2009-10-22T02:00:00+00:00
modified: 2024-03-28T12:00:00+00:00
broader: crime

judiciário (sistema de justiça)
type: Concept
definition: Sistema estabelecido para administrar as leis e aqueles que as infringem.
in scheme: mediatopic
created: 2009-10-22T02:00:00+00:00
modified: 2021-02-18T12:00:00+00:00
broader: crime, lei e justiça
narrower: tribunal
narrower: procedimentos judiciais fora do tribunal
narrower: acusação

tribunal
type: Concept
definition: O órgão jurisdicional onde são ouvidos os casos legais.
in scheme: mediatopic
created: 2009-10-22T02:00:00+00:00
modified: 2021-02-18T12:00:00+00:00
broad match: http://cv.iptc.org/newscodes/subjectcode/02007000
broader: judiciário (sistema de justiça)
narrower: recurso (tribunal)
narrower: serviços de tribunal
narrower: juiz
narrower: julgamentos
narrower: supremo tribunal e tribunal superior

recurso (tribunal)
type: Concept
definition: Ações realizadas quando o veredicto não é aceite.
in scheme: mediatopic
created: 2009-10-22T02:00:00+00:00
modified: 2021-02-18T12:00:00+00:00
broad match: http://cv.iptc.org/newscodes/subjectcode/02000000
broader: tribunal

serviços de tribunal
type: Concept
definition: Auxiliares de justiça.
in scheme: mediatopic
created: 2009-10-22T02:00:00+00:00
modified: 2021-05-05T12:00:00+00:00
retired: 2019-10-07T12:00:00+00:00
broader: tribunal

juiz
type: Concept
definition: Membro do poder judiciário que tem autoridade para julgar
in scheme: mediatopic
created: 2009-10-22T02:00:00+00:00
modified: 2024-03-28T12:00:00+00:00
broader: tribunal

julgamentos
type: Concept
definition: Processo mediante o qual culpado ou inocente, certo ou errado é determinado e julgado.
in scheme: mediatopic
created: 2009-10-22T02:00:00+00:00
modified: 2021-02-18T12:00:00+00:00
broader: tribunal
narrower: processos preliminares
narrower: réu
narrower: litígio
narrower: testemunha
narrower: pena/sentença

processos preliminares
type: Concept
definition: Eventos preliminares que incluem arguições, fianças, moções, descobertas, depoimentos.
in scheme: mediatopic
created: 2009-10-22T02:00:00+00:00
modified: 2021-05-05T12:00:00+00:00
broader: julgamentos

réu
type: Concept
definition: Indivíduo que está sendo julgado em tribunal.
in scheme: mediatopic
created: 2009-10-22T02:00:00+00:00
modified: 2021-02-18T12:00:00+00:00
retired: 2019-10-07T12:00:00+00:00
broader: julgamentos

litígio
type: Concept
definition: Levar a tribunal assuntos que se disputam para resolução por meio de juiz e/ou júri.
in scheme: mediatopic
created: 2009-10-22T02:00:00+00:00
modified: 2021-05-05T12:00:00+00:00
broader: julgamentos

testemunha
type: Concept
definition: Indivíduo que testemunha.
in scheme: mediatopic
created: 2009-10-22T02:00:00+00:00
modified: 2021-02-18T12:00:00+00:00
retired: 2019-10-07T12:00:00+00:00
broader: julgamentos

procedimentos judiciais fora do tribunal
type: Concept
definition: Questões legais que são resolvidas fora do tribunal.
in scheme: mediatopic
created: 2009-10-22T02:00:00+00:00
modified: 2021-05-05T12:00:00+00:00
broad match: http://cv.iptc.org/newscodes/subjectcode/02000000
broader: judiciário (sistema de justiça)
narrower: arbitragem

arbitragem
type: Concept
definition: Resolução de disputas por meio de tribunal arbitral.
in scheme: mediatopic
created: 2009-10-22T02:00:00+00:00
modified: 2021-12-21T12:00:00+00:00
broader: procedimentos judiciais fora do tribunal

acusação
type: Concept
definition: Processo de realizar um julgamento contra uma pessoa acusada de um crime para determinar a sua culpa e os advogados e a equipe legal que defendem que o acusado é culpado.
in scheme: mediatopic
created: 2009-10-22T02:00:00+00:00
modified: 2021-03-31T12:00:00+00:00
broader: judiciário (sistema de justiça)

justiça e direitos
type: Concept
definition: Administração equitativa de leis e regulamentos.
in scheme: mediatopic
created: 2009-10-22T02:00:00+00:00
modified: 2023-10-02T12:00:00+00:00
retired: 2023-10-02T12:00:00+00:00
broader: crime, lei e justiça

direitos civis
type: Concept
definition: Direitos dos indivíduos no plano civil.
in scheme: mediatopic
created: 2009-10-22T02:00:00+00:00
modified: 2021-02-18T12:00:00+00:00
broader: direitos fundamentais

leis
type: Concept
definition: Codificação de regras de conduta em sociedade.
in scheme: mediatopic
created: 2009-10-22T02:00:00+00:00
modified: 2021-02-18T12:00:00+00:00
broader: crime, lei e justiça
narrower: lei civil
narrower: lei criminal
narrower: lei internacional
narrower: direito administrativo

lei civil
type: Concept
definition: Sistema do código civil.
in scheme: mediatopic
created: 2009-10-22T02:00:00+00:00
modified: 2021-03-31T12:00:00+00:00
broader: leis
narrower: regulação

antitruste
type: Concept
definition: Histórias relativas a atividades antitruste, regulações de monopólio etc.
in scheme: mediatopic
created: 2009-10-22T02:00:00+00:00
modified: 2021-02-18T12:00:00+00:00
broader: regulação

regulação
type: Concept
definition: Regras que derivam do direito empresarial.
in scheme: mediatopic
created: 2009-10-22T02:00:00+00:00
modified: 2021-03-31T12:00:00+00:00
broad match: http://cv.iptc.org/newscodes/subjectcode/02006002
broader: lei civil
narrower: antitruste

lei criminal
type: Concept
definition: Sistema do código criminal.
in scheme: mediatopic
created: 2009-10-22T02:00:00+00:00
modified: 2021-02-18T12:00:00+00:00
broader: leis

lei internacional
type: Concept
definition: Sistema de leis adotadas internacionalmente, como a convenção de Genebra, o direito do mar etc.
in scheme: mediatopic
created: 2009-10-22T02:00:00+00:00
modified: 2021-02-18T12:00:00+00:00
broader: leis
narrower: extradição (processos)
narrower: tribunal internacional

extradição (processos)
type: Concept
definition: Transferência legal de criminosos ou suspeitos de crimes entre países.
in scheme: mediatopic
created: 2009-10-22T02:00:00+00:00
modified: 2021-02-18T12:00:00+00:00
broader: lei internacional

tribunal internacional
type: Concept
definition: Atividades de tribunais internacionais como o Tribunal Europeu dos Direitos do Homem, o Tribunal de Haia, o Tribunal Internacional de Justiça etc.
in scheme: mediatopic
created: 2009-10-22T02:00:00+00:00
modified: 2021-12-17T12:00:00+00:00
broader: lei internacional

forças policiais
type: Concept
definition: Agências envolvidas na prevenção da desobediência às leis estabelecidas e em levar a tribunal os que desobedecem a essas leis.
in scheme: mediatopic
created: 2009-10-22T02:00:00+00:00
modified: 2021-02-18T12:00:00+00:00
broader: crime, lei e justiça
narrower: detenção
narrower: investigação (criminal)
narrower: polícia
narrower: vigilância

detenção
type: Concept
definition: Detenção de um suspeito de um crime.
in scheme: mediatopic
created: 2009-10-22T02:00:00+00:00
modified: 2021-02-18T12:00:00+00:00
broader: forças policiais

investigação (criminal)
type: Concept
definition: Processo de investigação sobre um eventual crime.
in scheme: mediatopic
created: 2009-10-22T02:00:00+00:00
modified: 2021-02-18T12:00:00+00:00
broader: forças policiais
narrower: desaparecidos
narrower: investigação criminal arquivada

desaparecidos
type: Concept
definition: Pessoa que não está no lugar esperado, onde deveria estar, há um certo período de tempo.
in scheme: mediatopic
created: 2009-10-22T02:00:00+00:00
modified: 2021-02-18T12:00:00+00:00
broader: investigação (criminal)

polícia
type: Concept
definition: Agentes do sistema legal cuja missão é a aplicação das leis para a manutenção da ordem.
in scheme: mediatopic
created: 2009-10-22T02:00:00+00:00
modified: 2021-03-31T12:00:00+00:00
broader: forças policiais

pena/sentença
type: Concept
definition: Sentenças impostas àqueles que infringem as leis.
in scheme: mediatopic
created: 2009-10-22T02:00:00+00:00
modified: 2021-02-18T12:00:00+00:00
broader: julgamentos
narrower: pena de morte
narrower: multa
narrower: prisão
narrower: tratamento psiquiátrico por ordem judicial
narrower: suspensão da pena

pena de morte
type: Concept
definition: Pena de morte.
in scheme: mediatopic
created: 2009-10-22T02:00:00+00:00
modified: 2021-02-18T12:00:00+00:00
broad match: http://cv.iptc.org/newscodes/subjectcode/14025005
broader: pena/sentença

multa
type: Concept
definition: Punição monetária.
in scheme: mediatopic
created: 2009-10-22T02:00:00+00:00
modified: 2021-02-18T12:00:00+00:00
broader: pena/sentença

prisão
type: Concept
definition: Prisão, casa de detenção, presídio onde são encarcerados os infratores condenados pela justiça.
in scheme: mediatopic
created: 2009-10-22T02:00:00+00:00
modified: 2021-03-31T12:00:00+00:00
broader: pena/sentença

acidente (geral)
type: Concept
definition: Qualquer evento inesperado e repentino com consequências indesejadas e que requer medidas imediatas para evitar consequências sérias.
in scheme: mediatopic
created: 2009-10-22T02:00:00+00:00
modified: 2021-02-18T12:00:00+00:00
broader: desastres, acidentes e emergências
narrower: explosão
narrower: acidente industrial
narrower: acidentes de transporte
narrower: falhas estruturais
narrower: http://cv.iptc.org/newscodes/mediatopic/20001321

explosão
type: Concept
definition: Súbita fragmentação de um corpo, devido à dilatação de gases ou à conflagração de matérias.
in scheme: mediatopic
created: 2009-10-22T02:00:00+00:00
modified: 2021-05-05T12:00:00+00:00
broader: acidente (geral)

acidente industrial
type: Concept
definition: Acidente em fábrica, loja ou oficina, potencialmente perigoso.
in scheme: mediatopic
created: 2009-10-22T02:00:00+00:00
modified: 2021-05-05T12:00:00+00:00
broader: acidente (geral)
narrower: acidente nuclear

acidente nuclear
type: Concept
definition: Acidente envolvendo materiais radioativos.
in scheme: mediatopic
created: 2009-10-22T02:00:00+00:00
modified: 2021-02-18T12:00:00+00:00
broader: acidente industrial

acidentes de transporte
type: Concept
definition: Acidente envolvendo um ou mais veículos.
in scheme: mediatopic
created: 2009-10-22T02:00:00+00:00
modified: 2021-05-05T12:00:00+00:00
broader: acidente (geral)
narrower: acidente aéreo
narrower: acidente marítimo
narrower: acidente ferroviário
narrower: acidente rodoviário

acidente aéreo
type: Concept
definition: Acidente envolvendo aviões ou naves espaciais.
in scheme: mediatopic
created: 2009-10-22T02:00:00+00:00
modified: 2021-02-18T12:00:00+00:00
broader: acidentes de transporte

acidente marítimo
type: Concept
definition: Acidente envolvendo embarcações.
in scheme: mediatopic
created: 2009-10-22T02:00:00+00:00
modified: 2021-02-18T12:00:00+00:00
broader: acidentes de transporte

acidente ferroviário
type: Concept
definition: Acidente envolvendo trens.
in scheme: mediatopic
created: 2009-10-22T02:00:00+00:00
modified: 2021-02-18T12:00:00+00:00
broader: acidentes de transporte

acidente rodoviário
type: Concept
definition: Acidente envolvendo veículos terrestres.
in scheme: mediatopic
created: 2009-10-22T02:00:00+00:00
modified: 2021-02-18T12:00:00+00:00
broader: acidentes de transporte
narrower: atropelamento de animais selvagens

desastre (geral)
type: Concept
definition: Azar sério ou súbito.
in scheme: mediatopic
created: 2009-10-22T02:00:00+00:00
modified: 2021-02-18T12:00:00+00:00
broader: desastres, acidentes e emergências
narrower: fome
narrower: incêndios
narrower: desastre natural

fome
type: Concept
definition: Grave falta de comida para a população.
in scheme: mediatopic
created: 2009-10-22T02:00:00+00:00
modified: 2021-02-18T12:00:00+00:00
broader: desastre (geral)

incêndios
type: Concept
definition: Queima e combustão de materiais, mediante a combinação de calor elevado e oxigênio.
in scheme: mediatopic
created: 2009-10-22T02:00:00+00:00
modified: 2021-02-18T12:00:00+00:00
broader: desastre (geral)
narrower: incêndio florestal

desastre natural
type: Concept
definition: Incidentes destrutivos causados pela natureza - furacões, sismos, inundações etc.
in scheme: mediatopic
created: 2009-10-22T02:00:00+00:00
modified: 2021-02-18T12:00:00+00:00
broader: desastre (geral)
narrower: seca
narrower: terremoto
narrower: inundações
narrower: deslizamento de terra
narrower: desastre meteorológico
narrower: erupção vulcânica
narrower: http://cv.iptc.org/newscodes/mediatopic/20001353

seca
type: Concept
definition: Grave falta de água durante determinado período de tempo.
in scheme: mediatopic
created: 2009-10-22T02:00:00+00:00
modified: 2021-02-18T12:00:00+00:00
broader: desastre natural

terremoto
type: Concept
definition: Movimentos das placas tectônicas da crosta terrestre, que, em alguns casos, provocam danos nas estruturas.
in scheme: mediatopic
created: 2009-10-22T02:00:00+00:00
modified: 2021-02-18T12:00:00+00:00
broader: desastre natural

inundações
type: Concept
definition: Excesso de água, causado por chuvas intensas ou por neve derretida.
in scheme: mediatopic
created: 2009-10-22T02:00:00+00:00
modified: 2021-02-18T12:00:00+00:00
broader: desastre natural

deslizamento de terra
type: Concept
definition: A deslocação repentina de quantidades massivas de neve e terra.
in scheme: mediatopic
created: 2009-10-22T02:00:00+00:00
modified: 2021-02-18T12:00:00+00:00
broad match: http://cv.iptc.org/newscodes/subjectcode/03015002
broader: desastre natural
narrower: avalancha

avalancha
type: Concept
definition: A queda repentina de neve, gelo, rochas ou lama de uma montanha.
in scheme: mediatopic
created: 2009-10-22T02:00:00+00:00
modified: 2021-02-18T12:00:00+00:00
broad match: http://cv.iptc.org/newscodes/subjectcode/03015002
broader: deslizamento de terra

desastre meteorológico
type: Concept
definition: Desastre relacionado ao clima.
in scheme: mediatopic
created: 2009-10-22T02:00:00+00:00
modified: 2021-02-18T12:00:00+00:00
broader: desastre natural
narrower: tempestade ciclônica
narrower: furacão

tempestade ciclônica
type: Concept
definition: Tempestade de grande velocidade mas sem furacões e com pouca chuva ou granizo. Altamente destrutiva.
in scheme: mediatopic
created: 2009-10-22T02:00:00+00:00
modified: 2021-05-05T12:00:00+00:00
broader: desastre meteorológico

erupção vulcânica
type: Concept
definition: Ruptura da crosta terrestre que permite a emissão de material derretido para a superfície.
in scheme: mediatopic
created: 2009-10-22T02:00:00+00:00
modified: 2021-07-12T12:00:00+00:00
broader: desastre natural

caso de emergência
type: Concept
definition: Evento súbito, inesperado que requer ação imediata.
in scheme: mediatopic
created: 2009-10-22T02:00:00+00:00
modified: 2021-12-21T12:00:00+00:00
retired: 2015-08-27T12:00:00+00:00
broader: desastres, acidentes e emergências
narrower: acidente de transporte

falhas estruturais
type: Concept
definition: Defeitos de um edifício, ponte ou outra estrutura que podem provocar a sua queda.
in scheme: mediatopic
created: 2009-10-22T02:00:00+00:00
modified: 2021-02-18T12:00:00+00:00
broader: acidente (geral)

acidente de transporte
type: Concept
definition: Um acidente que envolve um ou mais veículos.
in scheme: mediatopic
created: 2009-10-22T02:00:00+00:00
modified: 2021-12-21T12:00:00+00:00
retired: 2015-08-27T12:00:00+00:00
broad match: http://cv.iptc.org/newscodes/subjectcode/03010000
broader: caso de emergência
narrower: acidente aéreo e espacial
narrower: acidente marítimo
narrower: acidente ferroviário
narrower: acidente rodoviário

acidente aéreo e espacial
type: Concept
definition: Um acidente que envolve uma nave aérea ou espacial.
in scheme: mediatopic
created: 2009-10-22T02:00:00+00:00
modified: 2021-12-21T12:00:00+00:00
retired: 2015-08-27T12:00:00+00:00
broad match: http://cv.iptc.org/newscodes/subjectcode/03010003
broader: acidente de transporte

acidente marítimo
type: Concept
definition: Acidente que envolve embarcações marítimas.
in scheme: mediatopic
created: 2009-10-22T02:00:00+00:00
modified: 2021-12-21T12:00:00+00:00
retired: 2015-08-27T12:00:00+00:00
broad match: http://cv.iptc.org/newscodes/subjectcode/03010004
broader: acidente de transporte

acidente ferroviário
type: Concept
definition: Acidente que envolve comboios.
in scheme: mediatopic
created: 2009-10-22T02:00:00+00:00
modified: 2021-12-21T12:00:00+00:00
retired: 2015-08-27T12:00:00+00:00
broad match: http://cv.iptc.org/newscodes/subjectcode/03010002
broader: acidente de transporte

acidente rodoviário
type: Concept
definition: Acidente que envolve veículos terrestres.
in scheme: mediatopic
created: 2009-10-22T02:00:00+00:00
modified: 2021-12-21T12:00:00+00:00
retired: 2015-08-27T12:00:00+00:00
broad match: http://cv.iptc.org/newscodes/subjectcode/03010001
broader: acidente de transporte

planos de emergência
type: Concept
definition: Planos de ação para lidar com eventos súbitos e inesperados.
in scheme: mediatopic
created: 2009-10-22T02:00:00+00:00
modified: 2021-02-18T12:00:00+00:00
retired: 2019-12-11T12:00:00+00:00
broader: desastres, acidentes e emergências

resposta de emergência
type: Concept
definition: Organizações criadas para fornecer ajuda a quem tem falta de comida, água ou abrigo.
in scheme: mediatopic
created: 2009-10-22T02:00:00+00:00
modified: 2021-02-18T12:00:00+00:00
broad match: http://cv.iptc.org/newscodes/subjectcode/03012000
broader: desastres, acidentes e emergências

informação sobre empresas
type: Concept
definition: Informação sobre empresas individuais ou companhias de negócios.
in scheme: mediatopic
created: 2009-10-22T02:00:00+00:00
modified: 2021-05-05T12:00:00+00:00
broader: economia, negócios e finanças
narrower: finanças empresariais
narrower: financiamento e oferta de ações
narrower: recursos humanos
narrower: estratégia e marketing
narrower: gestão empresarial
narrower: http://cv.iptc.org/newscodes/mediatopic/20001365
narrower: http://cv.iptc.org/newscodes/mediatopic/20001366

finanças empresariais
type: Concept
definition: As finanças de uma entidade empresarial.
in scheme: mediatopic
created: 2009-10-22T02:00:00+00:00
modified: 2023-03-31T12:00:00+00:00
retired: 2023-03-31T12:00:00+00:00
broad match: http://cv.iptc.org/newscodes/subjectcode/04000000
broader: informação sobre empresas
narrower: comentários de analistas

contabilidade e auditoria
type: Concept
definition: Alterações relativas aos princípios contábeis geralmente aceites e à auditoria de contabilidade.
in scheme: mediatopic
created: 2009-10-22T02:00:00+00:00
modified: 2023-03-31T12:00:00+00:00
retired: 2023-03-31T12:00:00+00:00
broader: http://cv.iptc.org/newscodes/mediatopic/20001365

comentários de analistas
type: Concept
definition: Comentários de analistas da bolsa, análises e recomendações.
in scheme: mediatopic
created: 2009-10-22T02:00:00+00:00
modified: 2023-03-31T12:00:00+00:00
retired: 2023-03-31T12:00:00+00:00
broader: finanças empresariais

falência
type: Concept
definition: Notícias sobre declarações de bancarrota.
in scheme: mediatopic
created: 2009-10-22T02:00:00+00:00
modified: 2023-03-31T12:00:00+00:00
broader: financiamento e oferta de ações

recompra
type: Concept
definition: Notícias sobre programas de recompra de ações. Deve ser mantido distinto de atividade bolsista (ver abaixo).
in scheme: mediatopic
created: 2009-10-22T02:00:00+00:00
modified: 2023-03-31T12:00:00+00:00
broader: ações

notação de risco
type: Concept
definition: Declarações formais feitas por certas agências, como a Standard & Poor's, sobre o risco de investimento de uma companhia, país ou empresa.
in scheme: mediatopic
created: 2009-10-22T02:00:00+00:00
modified: 2023-03-31T12:00:00+00:00
broader: http://cv.iptc.org/newscodes/mediatopic/20001365

anúncio de dividendos
type: Concept
definition: Anúncios relativos à distribuição de dividendos.
in scheme: mediatopic
created: 2009-10-22T02:00:00+00:00
modified: 2023-03-31T12:00:00+00:00
broader: ações

lucros
type: Concept
definition: Todo comunicado sobre os lucros de uma empresa.
in scheme: mediatopic
created: 2009-10-22T02:00:00+00:00
modified: 2023-03-31T12:00:00+00:00
broader: http://cv.iptc.org/newscodes/mediatopic/20001365

previsão de lucros
type: Concept
definition: Previsões dos analistas sobre os lucros de empresas.
in scheme: mediatopic
created: 2009-10-22T02:00:00+00:00
modified: 2023-03-31T12:00:00+00:00
retired: 2023-03-31T12:00:00+00:00
broader: http://cv.iptc.org/newscodes/mediatopic/20001365

demonstração financeira
type: Concept
definition: Relatórios formais sobre o estado financeiro da empresa, apresentados geralmente anual ou trimestralmente.
in scheme: mediatopic
created: 2009-10-22T02:00:00+00:00
modified: 2023-03-31T12:00:00+00:00
broader: http://cv.iptc.org/newscodes/mediatopic/20001365

procurações
type: Concept
definition: Declarações de procurações junto de agências reguladoras para futuras votações de acionistas.
in scheme: mediatopic
created: 2009-10-22T02:00:00+00:00
modified: 2023-03-31T12:00:00+00:00
broader: gestão empresarial

empresa com dificuldades financeiras
type: Concept
definition: Notícias sobre empresas com dificuldades financeiras mas que ainda não declararam falência.
in scheme: mediatopic
created: 2009-10-22T02:00:00+00:00
modified: 2023-03-31T12:00:00+00:00
broader: financiamento e oferta de ações

financiamento e oferta de ações
type: Concept
definition: Novas oferta de ações, incluindo ofertas públicas iniciais.
in scheme: mediatopic
created: 2009-10-22T02:00:00+00:00
modified: 2023-03-31T12:00:00+00:00
broader: informação sobre empresas
narrower: falência
narrower: empresa com dificuldades financeiras
narrower: reestruturação e recapitalização
narrower: títulos
narrower: ações
narrower: crowdfunding
narrower: http://cv.iptc.org/newscodes/mediatopic/20001376

reestruturação e recapitalização
type: Concept
definition: Venda de unidades de negócio, separação de empresas existentes em unidades de negócio de holdings etc.
in scheme: mediatopic
created: 2009-10-22T02:00:00+00:00
modified: 2023-10-02T12:00:00+00:00
retired: 2023-10-02T12:00:00+00:00
broader: financiamento e oferta de ações

acionista
type: Concept
definition: Todo titular de documento emitido por uma empresa, que tem valor variável e que lhe dá direito a dividendos consoante o desempenho da empresa.
in scheme: mediatopic
created: 2009-10-22T02:00:00+00:00
modified: 2023-03-31T12:00:00+00:00
broader: gestão empresarial

atividade bolsista
type: Concept
definition: Anúncios de eventos bolsistas importantes: divisões, grandes transações, novos máximos e mínimos etc.
in scheme: mediatopic
created: 2009-10-22T02:00:00+00:00
modified: 2023-03-31T12:00:00+00:00
broader: ações

oferta pública inicial
type: Concept
definition: Uma empresa emite ações ao público pela primeira vez.
in scheme: mediatopic
created: 2009-10-22T02:00:00+00:00
modified: 2021-02-18T12:00:00+00:00
broad match: http://cv.iptc.org/newscodes/subjectcode/04016019
broader: ações

recursos humanos
type: Concept
definition: As pessoas que trabalham para uma empresa e a maneira como são geridas.
in scheme: mediatopic
created: 2009-10-22T02:00:00+00:00
modified: 2021-02-18T12:00:00+00:00
broad match: http://cv.iptc.org/newscodes/subjectcode/09000000
broader: informação sobre empresas
narrower: redução de efetivos
narrower: administração

redução de efetivos
type: Concept
definition: Reduções reais ou previstas da força de trabalho de uma empresa.
in scheme: mediatopic
created: 2009-10-22T02:00:00+00:00
modified: 2021-05-05T12:00:00+00:00
broader: recursos humanos

administração
type: Concept
definition: Administradores de empresas, incluindo compromissos e mudanças.
in scheme: mediatopic
created: 2009-10-22T02:00:00+00:00
modified: 2023-03-31T12:00:00+00:00
broad match: http://cv.iptc.org/newscodes/subjectcode/04016028
broader: recursos humanos

opções de compra de ações
type: Concept
definition: Acordo para compra ou venda de uma ação quando atinge determinado preço, que se aplica apenas a empregados ou dirigentes dessa companhia.
in scheme: mediatopic
created: 2009-10-22T02:00:00+00:00
modified: 2023-03-31T12:00:00+00:00
retired: 2023-03-31T12:00:00+00:00
broader: títulos

estratégia e marketing
type: Concept
definition: Planejamento da direção de uma empresa e venda dos seus produtos e serviços para cumprir a estratégia.
in scheme: mediatopic
created: 2009-10-22T02:00:00+00:00
modified: 2023-03-31T12:00:00+00:00
broad match: http://cv.iptc.org/newscodes/subjectcode/04016029
broader: informação sobre empresas
narrower: contrato comercial
narrower: globalização econômica
narrower: contrato de licença
narrower: novo produto ou serviço
narrower: patente, direitos de autor e marca registrada
narrower: recolha de produtos
narrower: pesquisa e desenvolvimento
narrower: estudos de mercado
narrower: indicadores de consumo
narrower: contrato público
narrower: gestão de relacionamento com o cliente
narrower: terceirização

reuniões corporativas anuais e especiais
type: Concept
definition: Anúncios de reuniões agendadas. Relatórios das reuniões.
in scheme: mediatopic
created: 2009-10-22T02:00:00+00:00
modified: 2023-03-31T12:00:00+00:00
broader: gestão empresarial

relatório anual
type: Concept
definition: Disponibilidade ou conteúdos de relatórios anuais de empresas.
in scheme: mediatopic
created: 2009-10-22T02:00:00+00:00
modified: 2023-03-31T12:00:00+00:00
broader: gestão empresarial

conselho de administração
type: Concept
definition: Nomeações ou mudanças no conselho de administração de uma companhia.
in scheme: mediatopic
created: 2009-10-22T02:00:00+00:00
modified: 2023-03-31T12:00:00+00:00
broader: gestão empresarial

contrato comercial
type: Concept
definition: Contratos relativos a atividades comerciais.
in scheme: mediatopic
created: 2009-10-22T02:00:00+00:00
modified: 2021-02-18T12:00:00+00:00
broader: estratégia e marketing

spin-off
type: Concept
definition: Criação de empresas novas a partir de divisões de empresas existentes.
in scheme: mediatopic
created: 2009-10-22T02:00:00+00:00
modified: 2023-03-31T12:00:00+00:00
broader: http://cv.iptc.org/newscodes/mediatopic/20001366

globalização econômica
type: Concept
definition: Fazer negócios pelo mundo inteiro.
in scheme: mediatopic
created: 2009-10-22T02:00:00+00:00
modified: 2021-02-18T12:00:00+00:00
broader: estratégia e marketing

gestão empresarial
type: Concept
definition: O modo como funciona uma empresa e quaisquer regras a que esteja obrigada.
in scheme: mediatopic
created: 2009-10-22T02:00:00+00:00
modified: 2023-03-31T12:00:00+00:00
broad match: http://cv.iptc.org/newscodes/subjectcode/04016027
broader: informação sobre empresas
narrower: procurações
narrower: acionista
narrower: reuniões corporativas anuais e especiais
narrower: relatório anual
narrower: conselho de administração
narrower: responsabilidade social corporativa

joint venture
type: Concept
definition: Notícias sobre joint ventures entre companhias.
in scheme: mediatopic
created: 2009-10-22T02:00:00+00:00
modified: 2023-03-31T12:00:00+00:00
broader: http://cv.iptc.org/newscodes/mediatopic/20001366

aquisição alavancada
type: Concept
definition: Operações de compra de ações de uma empresa, financiadas por empréstimos.
in scheme: mediatopic
created: 2009-10-22T02:00:00+00:00
modified: 2023-03-31T12:00:00+00:00
broader: http://cv.iptc.org/newscodes/mediatopic/20001366

contrato de licença
type: Concept
definition: O documento que define os termos para licenciar propriedade intelectual.
in scheme: mediatopic
created: 2009-10-22T02:00:00+00:00
modified: 2023-03-31T12:00:00+00:00
retired: 2023-03-31T12:00:00+00:00
broader: estratégia e marketing

operação de compra
type: Concept
definition: Adquirir controle sobre uma empresa através da compra das suas ações.
in scheme: mediatopic
created: 2009-10-22T02:00:00+00:00
modified: 2023-03-31T12:00:00+00:00
broad match: http://cv.iptc.org/newscodes/subjectcode/04000000
broader: http://cv.iptc.org/newscodes/mediatopic/20001366

fusão e aquisição
type: Concept
definition: Duas ou mais empresas que formam uma nova empresa.
in scheme: mediatopic
created: 2009-10-22T02:00:00+00:00
modified: 2023-03-31T12:00:00+00:00
broader: http://cv.iptc.org/newscodes/mediatopic/20001366

novo produto ou serviço
type: Concept
definition: A introdução de novos produtos ou serviços no mercado.
in scheme: mediatopic
created: 2009-10-22T02:00:00+00:00
modified: 2023-03-31T12:00:00+00:00
broad match: http://cv.iptc.org/newscodes/subjectcode/04016030
broader: estratégia e marketing

patente, direitos de autor e marca registrada
type: Concept
definition: Propriedades intelectuais enquanto patentes, direitos de autor e marcas registradas.
in scheme: mediatopic
created: 2009-10-22T02:00:00+00:00
modified: 2023-03-31T12:00:00+00:00
broader: estratégia e marketing

recolha de produtos
type: Concept
definition: Decisão de uma empresa de recolher ou reparar um produto com defeito.
in scheme: mediatopic
created: 2009-10-22T02:00:00+00:00
modified: 2021-02-18T12:00:00+00:00
broader: estratégia e marketing

pesquisa e desenvolvimento
type: Concept
definition: Investigação e despesas relativas ao desenvolvimento de novos produtos.
in scheme: mediatopic
created: 2009-10-22T02:00:00+00:00
modified: 2021-02-18T12:00:00+00:00
broader: estratégia e marketing

setor econômico
type: Concept
definition: Agrupamento de atividades econômicas por produtos ou serviços.
in scheme: mediatopic
created: 2009-10-22T02:00:00+00:00
modified: 2023-03-31T12:00:00+00:00
broad match: http://cv.iptc.org/newscodes/subjectcode/04000000
broader: economia, negócios e finanças
narrower: agricultura e pescas
narrower: pesca
narrower: exploração florestal e silvicultura
narrower: produtos químicos
narrower: químicos sintéticos e plásticos
narrower: informática e tecnologias de informação
narrower: construção e propriedades
narrower: bens de consumo
narrower: energia e recursos
narrower: serviços financeiros
narrower: indústria metalomecânica e engenharia
narrower: mídia
narrower: minérios e metais
narrower: indústria transformadora
narrower: indústria do turismo e lazer
narrower: transportes
narrower: serviços públicos
narrower: canais de vendas
narrower: http://cv.iptc.org/newscodes/mediatopic/20001354
narrower: http://cv.iptc.org/newscodes/mediatopic/20001370
narrower: http://cv.iptc.org/newscodes/mediatopic/20001371

agricultura e pescas
type: Concept
definition: Produção de bens naturais para consumo.
in scheme: mediatopic
created: 2009-10-22T02:00:00+00:00
modified: 2023-03-31T12:00:00+00:00
broader: setor econômico
narrower: aquacultura
narrower: agricultura
narrower: pecuária
narrower: vinicultura

aquacultura
type: Concept
definition: Produção de plantas ou animais em água para consumo humano.
in scheme: mediatopic
created: 2009-10-22T02:00:00+00:00
modified: 2023-03-31T12:00:00+00:00
retired: 2023-03-31T12:00:00+00:00
broader: agricultura e pescas

agricultura
type: Concept
definition: Produção de alimentos no solo.
in scheme: mediatopic
created: 2009-10-22T02:00:00+00:00
modified: 2023-03-31T12:00:00+00:00
retired: 2023-03-31T12:00:00+00:00
broader: agricultura e pescas

pesca
type: Concept
definition: Criação ou recolha de peixe.
in scheme: mediatopic
created: 2009-10-22T02:00:00+00:00
modified: 2023-03-31T12:00:00+00:00
broader: setor econômico

exploração florestal e silvicultura
type: Concept
definition: Produção, recolha e preparação de produtos de madeira para uso futuro.
in scheme: mediatopic
created: 2009-10-22T02:00:00+00:00
modified: 2023-03-31T12:00:00+00:00
broader: setor econômico

pecuária
type: Concept
definition: Criação de animais para consumo alimentar.
in scheme: mediatopic
created: 2009-10-22T02:00:00+00:00
modified: 2023-03-31T12:00:00+00:00
retired: 2023-03-31T12:00:00+00:00
broader: agricultura e pescas

vinicultura
type: Concept
definition: Produção de vinhos, desde as vinhas até ao produto final.
in scheme: mediatopic
created: 2009-10-22T02:00:00+00:00
modified: 2023-03-31T12:00:00+00:00
retired: 2023-03-31T12:00:00+00:00
broader: agricultura e pescas

produtos químicos
type: Concept
definition: Materiais naturais ou feitos pelo homem para produzir outros materiais.
in scheme: mediatopic
created: 2009-10-22T02:00:00+00:00
modified: 2021-02-18T12:00:00+00:00
broader: setor econômico
narrower: fertilizantes
narrower: produtos de saúde e beleza
narrower: químicos inorgânicos
narrower: químicos orgânicos
narrower: http://cv.iptc.org/newscodes/mediatopic/20001395

biotecnologia
type: Concept
definition: Uso de engenharia tecnológica para estudar e resolver problemas dos organismos vivos.
in scheme: mediatopic
created: 2009-10-22T02:00:00+00:00
modified: 2022-06-14T12:00:00+00:00
broader: http://cv.iptc.org/newscodes/mediatopic/20001354

fertilizantes
type: Concept
definition: Materiais naturais ou feitos pelo homem para estimular o crescimento de plantas.
in scheme: mediatopic
created: 2009-10-22T02:00:00+00:00
modified: 2023-03-31T12:00:00+00:00
retired: 2023-03-31T12:00:00+00:00
broader: produtos químicos

produtos de saúde e beleza
type: Concept
definition: Produtos químicos e outras substâncias usados para embelezamento físico.
in scheme: mediatopic
created: 2009-10-22T02:00:00+00:00
modified: 2023-03-31T12:00:00+00:00
retired: 2023-03-31T12:00:00+00:00
broader: produtos químicos

químicos inorgânicos
type: Concept
definition: Ramo da química que estuda minerais e metais.
in scheme: mediatopic
created: 2009-10-22T02:00:00+00:00
modified: 2023-03-31T12:00:00+00:00
retired: 2023-03-31T12:00:00+00:00
broader: produtos químicos

químicos orgânicos
type: Concept
definition: Ramo da química que estuda substâncias humanas, animais ou à base de carbono.
in scheme: mediatopic
created: 2009-10-22T02:00:00+00:00
modified: 2023-03-31T12:00:00+00:00
retired: 2023-03-31T12:00:00+00:00
broader: produtos químicos

indústria farmacêutica
type: Concept
definition: Produção de medicamentos a partir de substâncias químicas ou naturais.
in scheme: mediatopic
created: 2009-10-22T02:00:00+00:00
modified: 2023-03-31T12:00:00+00:00
broader: http://cv.iptc.org/newscodes/mediatopic/20001354

químicos sintéticos e plásticos
type: Concept
definition: Químicos usados para produzir plásticos e outras substâncias artificiais.
in scheme: mediatopic
created: 2009-10-22T02:00:00+00:00
modified: 2023-03-31T12:00:00+00:00
broader: setor econômico

informática e tecnologias de informação
type: Concept
definition: Tudo o que diz respeito à computação e à transmissão de informação de um ponto para outro.
in scheme: mediatopic
created: 2009-10-22T02:00:00+00:00
modified: 2023-03-31T12:00:00+00:00
broader: setor econômico
narrower: hardware
narrower: conexão em rede
narrower: tecnologia de satélite
narrower: segurança informática
narrower: semicondutores e componentes ativos
narrower: software
narrower: equipamentos de telecomunicação
narrower: serviços de telecomunicações
narrower: tecnologia sem fio
narrower: internet das coisas

hardware
type: Concept
definition: Componentes físicos usados para fornecer serviços computacionais, tais como tela, disco rígido, teclado etc. e que também incluem roteadores, servidores e outros dispositivos de rede.
in scheme: mediatopic
created: 2009-10-22T02:00:00+00:00
modified: 2023-03-31T12:00:00+00:00
broader: informática e tecnologias de informação

conexão em rede
type: Concept
definition: Interconexão entre os componentes de hardware que estabelece um meio de transmissão de dados.
in scheme: mediatopic
created: 2009-10-22T02:00:00+00:00
modified: 2023-03-31T12:00:00+00:00
retired: 2023-03-31T12:00:00+00:00
broader: informática e tecnologias de informação

tecnologia de satélite
type: Concept
definition: Hardware e software que permite que aparelhos em terra enviem sinais entre si, através de satélites em órbita.
in scheme: mediatopic
created: 2009-10-22T02:00:00+00:00
modified: 2021-05-05T12:00:00+00:00
broader: informática e tecnologias de informação

segurança informática
type: Concept
definition: Tudo o que diz respeito a desenvolvimentos técnicos em hardware e software, investigação básica e áreas relacionadas, como cibersegurança.
in scheme: mediatopic
created: 2009-10-22T02:00:00+00:00
modified: 2023-03-31T12:00:00+00:00
retired: 2023-03-31T12:00:00+00:00
broader: informática e tecnologias de informação

semicondutores e componentes ativos
type: Concept
definition: Os componentes básicos que, juntos, permitem o funcionamento de dispositivos eletrônicos, como os computadores.
in scheme: mediatopic
created: 2009-10-22T02:00:00+00:00
modified: 2023-03-31T12:00:00+00:00
broader: informática e tecnologias de informação

software
type: Concept
definition: Conjunto de programas que, quando instalados em computadores, realizam funções específicas.
in scheme: mediatopic
created: 2009-10-22T02:00:00+00:00
modified: 2023-03-31T12:00:00+00:00
broader: informática e tecnologias de informação

equipamentos de telecomunicação
type: Concept
definition: Aparelhos como telefones, comutadores de integração voz/dados, modems etc., que facilitam a transmissão voz/dados de um ponto para outro.
in scheme: mediatopic
created: 2009-10-22T02:00:00+00:00
modified: 2023-03-31T12:00:00+00:00
retired: 2023-03-31T12:00:00+00:00
broader: informática e tecnologias de informação

serviços de telecomunicações
type: Concept
definition: Serviços fornecidos por empresas que facilitam ligações entre telefones, pagers ou computadores.
in scheme: mediatopic
created: 2009-10-22T02:00:00+00:00
modified: 2023-03-31T12:00:00+00:00
broader: informática e tecnologias de informação

tecnologia sem fio
type: Concept
definition: Transmissão de informação sem utilizar fios ou cabos conectados.
in scheme: mediatopic
created: 2009-10-22T02:00:00+00:00
modified: 2024-07-01T12:00:00+00:00
broader: informática e tecnologias de informação

construção e propriedades
type: Concept
definition: Elementos relativos à construção e venda de propriedades.
in scheme: mediatopic
created: 2009-10-22T02:00:00+00:00
modified: 2021-02-18T12:00:00+00:00
broader: setor econômico
narrower: design e engenharia
narrower: propriedade agrícola
narrower: obras públicas
narrower: construção civil
narrower: preço do terreno
narrower: imobiliário
narrower: material de construção
narrower: projetos de infraestrutura
narrower: construção comercial
narrower: http://cv.iptc.org/newscodes/mediatopic/20001367
narrower: http://cv.iptc.org/newscodes/mediatopic/20001368

design e engenharia
type: Concept
definition: Concepção e planejamento, por engenheiros, arquitetos, de estradas, escritórios, fábricas, represas etc.
in scheme: mediatopic
created: 2009-10-22T02:00:00+00:00
modified: 2023-03-31T12:00:00+00:00
retired: 2023-03-31T12:00:00+00:00
broader: construção e propriedades

propriedade agrícola
type: Concept
definition: Áreas agrícolas para a produção alimentar, incluindo laticínios, frutos, gado e peixe.
in scheme: mediatopic
created: 2009-10-22T02:00:00+00:00
modified: 2023-03-31T12:00:00+00:00
retired: 2019-10-07T12:00:00+00:00
broader: construção e propriedades

obras públicas
type: Concept
definition: Projetos de construção de grande escala: estradas, represas, edifícios de escritórios, fábricas, estádios etc.
in scheme: mediatopic
created: 2009-10-22T02:00:00+00:00
modified: 2023-03-31T12:00:00+00:00
retired: 2019-07-25T12:00:00+00:00
broader: construção e propriedades

construção civil
type: Concept
definition: Construção de residências, para uso privado.
in scheme: mediatopic
created: 2009-10-22T02:00:00+00:00
modified: 2023-03-31T12:00:00+00:00
retired: 2023-03-31T12:00:00+00:00
broader: construção e propriedades

preço do terreno
type: Concept
definition: Preço da terra em áreas específicas como zonas comerciais, residenciais ou cultiváveis e que é determinado por uma entidade responsável.
in scheme: mediatopic
created: 2009-10-22T02:00:00+00:00
modified: 2023-03-31T12:00:00+00:00
retired: 2023-03-31T12:00:00+00:00
broader: construção e propriedades

imobiliário
type: Concept
definition: Compra, venda e arrendamento de todo tipo de propriedades.
in scheme: mediatopic
created: 2009-10-22T02:00:00+00:00
modified: 2023-03-31T12:00:00+00:00
retired: 2023-03-31T12:00:00+00:00
broader: construção e propriedades

obras de renovação
type: Concept
definition: Recuperação de propriedades ou estruturas, mediante limpeza, reparação ou reconstrução.
in scheme: mediatopic
created: 2009-10-22T02:00:00+00:00
modified: 2023-03-31T12:00:00+00:00
broader: monumentos e patrimônio

bens de consumo
type: Concept
definition: Artigos produzidos para serem vendidos.
in scheme: mediatopic
created: 2009-10-22T02:00:00+00:00
modified: 2021-02-18T12:00:00+00:00
broader: setor econômico
narrower: bebidas
narrower: vestuário
narrower: alimentação
narrower: bens de luxo
narrower: bens não duráveis
narrower: brinquedos
narrower: indústria da alimentação
narrower: mobiliário e decoração
narrower: tabaco
narrower: artesanato
narrower: produtos e serviços para animais de estimação
narrower: eletrônica de consumo

bebidas
type: Concept
definition: Consumíveis líquidos, alcoólicos e não alcoólicos.
in scheme: mediatopic
created: 2009-10-22T02:00:00+00:00
modified: 2023-03-31T12:00:00+00:00
retired: 2023-03-31T12:00:00+00:00
broader: bens de consumo

vestuário
type: Concept
definition: Artigos de vestuário.
in scheme: mediatopic
created: 2009-10-22T02:00:00+00:00
modified: 2023-03-31T12:00:00+00:00
broader: bens de consumo

lojas de departamento
type: Concept
definition: Grandes superfícies destinadas à venda ao público.
in scheme: mediatopic
created: 2009-10-22T02:00:00+00:00
modified: 2021-02-18T12:00:00+00:00
broader: varejo

comércio eletrônico
type: Concept
definition: Compra e venda de produtos pela Internet.
in scheme: mediatopic
created: 2009-10-22T02:00:00+00:00
modified: 2023-03-31T12:00:00+00:00
broader: varejo

alimentação
type: Concept
definition: Venda de bens para consumo humano ao consumidor final.
in scheme: mediatopic
created: 2009-10-22T02:00:00+00:00
modified: 2023-03-31T12:00:00+00:00
retired: 2023-03-31T12:00:00+00:00
broader: bens de consumo

bens de luxo
type: Concept
definition: Bolsa de couro, joias, alta-costura, acessórios etc.
in scheme: mediatopic
created: 2009-10-22T02:00:00+00:00
modified: 2023-03-31T12:00:00+00:00
broader: bens de consumo

vendas por correio
type: Concept
definition: Artigos vendidos e entregues por correio.
in scheme: mediatopic
created: 2009-10-22T02:00:00+00:00
modified: 2023-03-31T12:00:00+00:00
retired: 2023-03-31T12:00:00+00:00
broader: varejo

bens não duráveis
type: Concept
definition: Produtos para serem usados por um breve período de tempo.
in scheme: mediatopic
created: 2009-10-22T02:00:00+00:00
modified: 2023-03-31T12:00:00+00:00
retired: 2023-03-31T12:00:00+00:00
broader: bens de consumo

varejo
type: Concept
definition: A última etapa da cadeia comercial.
in scheme: mediatopic
created: 2009-10-22T02:00:00+00:00
modified: 2023-03-31T12:00:00+00:00
broader: canais de vendas
narrower: lojas de departamento
narrower: comércio eletrônico
narrower: vendas por correio
narrower: lojas especializadas
narrower: centro comercial
narrower: zona comercial

lojas especializadas
type: Concept
definition: Lojas que se especializaram na venda de produtos específicos como sapatos, casacos, ferramentas etc.
in scheme: mediatopic
created: 2009-10-22T02:00:00+00:00
modified: 2021-05-05T12:00:00+00:00
broader: varejo

brinquedos
type: Concept
definition: Objetos com os quais as crianças brincam.
in scheme: mediatopic
created: 2009-10-22T02:00:00+00:00
modified: 2023-03-31T12:00:00+00:00
broader: bens de consumo

mercado atacadista
type: Concept
definition: Primeiro elo da cadeia comercial após a produção.
in scheme: mediatopic
created: 2009-10-22T02:00:00+00:00
modified: 2023-03-31T12:00:00+00:00
broader: canais de vendas

energia e recursos
type: Concept
definition: O uso de recursos naturais para gerar energia para fins comerciais.
in scheme: mediatopic
created: 2009-10-22T02:00:00+00:00
modified: 2023-03-31T12:00:00+00:00
broader: setor econômico
narrower: energias alternativas
narrower: carvão
narrower: indústria da energia
narrower: energia nuclear
narrower: petróleo e gás (distribuição)
narrower: petróleo e gás (extração)
narrower: biocombustível
narrower: indústria do petróleo e do gás

energias alternativas
type: Concept
definition: Negócio das energias alternativas.
in scheme: mediatopic
created: 2009-10-22T02:00:00+00:00
modified: 2023-03-31T12:00:00+00:00
broader: energia e recursos
narrower: energia geotérmica
narrower: energia solar
narrower: energia hidrelétrica
narrower: energia eólica

carvão
type: Concept
definition: Produção e extração de antracite e de produtos betuminosos para usar na produção de energia.
in scheme: mediatopic
created: 2009-10-22T02:00:00+00:00
modified: 2021-02-18T12:00:00+00:00
broader: energia e recursos

gasóleo
type: Concept
definition: Produto petrolífero destilado, mais pesado do que a gasolina, utilizado para caminhões, motores de barcos e certos sistemas de calefação.
in scheme: mediatopic
created: 2009-10-22T02:00:00+00:00
modified: 2023-03-31T12:00:00+00:00
broader: indústria do petróleo e do gás

produção e distribuição de eletricidade
type: Concept
definition: Tudo o que diz respeito ao sistema de distribuição de energia, mas também à venda de energia elétrica por atacado e no varejo.
in scheme: mediatopic
created: 2009-10-22T02:00:00+00:00
modified: 2023-03-31T12:00:00+00:00
broader: serviços públicos

indústria da energia
type: Concept
definition: A indústria da energia, não focada num setor específico.
in scheme: mediatopic
created: 2009-10-22T02:00:00+00:00
modified: 2021-07-12T12:00:00+00:00
retired: 2019-07-25T12:00:00+00:00
broader: energia e recursos

querosene/parafina
type: Concept
definition: Produto derivado do petróleo, usado como combustível para cozinhas, motores de aviões, candeeiros, calefação e limpeza.
in scheme: mediatopic
created: 2009-10-22T02:00:00+00:00
modified: 2023-03-31T12:00:00+00:00
retired: 2023-03-31T12:00:00+00:00
broader: indústria do petróleo e do gás

gás natural
type: Concept
definition: Recurso natural, sobretudo metano em estado gasoso inflamável.
in scheme: mediatopic
created: 2009-10-22T02:00:00+00:00
modified: 2023-03-31T12:00:00+00:00
broader: indústria do petróleo e do gás

energia nuclear
type: Concept
definition: Uso de materiais radioativos na produção de energia.
in scheme: mediatopic
created: 2009-10-22T02:00:00+00:00
modified: 2021-07-12T12:00:00+00:00
broader: energia e recursos

petróleo e gás (distribuição)
type: Concept
definition: Assuntos relativos ao petróleo e ao gás, tipicamente atividades de refinaria e de distribuição.
in scheme: mediatopic
created: 2009-10-22T02:00:00+00:00
modified: 2021-05-05T12:00:00+00:00
retired: 2019-07-25T12:00:00+00:00
broader: energia e recursos

petróleo e gás (extração)
type: Concept
definition: Assuntos relativos ao petróleo e ao gás, tipicamente atividades da cadeia de abastecimento desde a reserva até o portão da refinaria.
in scheme: mediatopic
created: 2009-10-22T02:00:00+00:00
modified: 2021-05-05T12:00:00+00:00
retired: 2019-07-25T12:00:00+00:00
broader: energia e recursos

gasolina
type: Concept
definition: Produto petrolífero destilado, usado para combustível automóvel, com ou sem aditivos.
in scheme: mediatopic
created: 2009-10-22T02:00:00+00:00
modified: 2021-02-18T12:00:00+00:00
broader: indústria do petróleo e do gás

indústria de gestão de resíduos
type: Concept
definition: O negócio da gestão de resíduos e do controle da poluição.
in scheme: mediatopic
created: 2009-10-22T02:00:00+00:00
modified: 2023-03-31T12:00:00+00:00
broader: serviços públicos

abastecimento de água
type: Concept
definition: O negócio do fornecimento de água para uso humano.
in scheme: mediatopic
created: 2009-10-22T02:00:00+00:00
modified: 2023-03-31T12:00:00+00:00
broader: serviços públicos

serviços financeiros
type: Concept
definition: Serviços que transmitem, protegem, acompanham o dinheiro ou fornecem apoio a empresas comerciais.
in scheme: mediatopic
created: 2009-10-22T02:00:00+00:00
modified: 2023-03-31T12:00:00+00:00
retired: 2023-03-31T12:00:00+00:00
broader: setor econômico
narrower: agência funerária e crematório
narrower: finanças pessoais
narrower: rendimento individual
narrower: serviços promocionais e de impressão

serviços de contabilidade e auditoria
type: Concept
definition: Serviços que fornecem balancetes, conciliações orçamentais e verificam a exatidão de relatórios financeiros.
in scheme: mediatopic
created: 2009-10-22T02:00:00+00:00
modified: 2023-03-31T12:00:00+00:00
broader: http://cv.iptc.org/newscodes/mediatopic/20001370

venda por leilão
type: Concept
definition: Vendas por leilão.
in scheme: mediatopic
created: 2009-10-22T02:00:00+00:00
modified: 2023-03-31T12:00:00+00:00
broader: canais de vendas

banca
type: Concept
definition: Serviços de guarda, transmissão, recepção e entrega de dinheiro.
in scheme: mediatopic
created: 2009-10-22T02:00:00+00:00
modified: 2023-03-31T12:00:00+00:00
broader: http://cv.iptc.org/newscodes/mediatopic/20001370

serviço de consultoria
type: Concept
definition: Fornecedores de conhecimentos especializados em vários domínios, geralmente com base em contratos temporários.
in scheme: mediatopic
created: 2009-10-22T02:00:00+00:00
modified: 2023-03-31T12:00:00+00:00
broader: http://cv.iptc.org/newscodes/mediatopic/20001371

agência de emprego
type: Concept
definition: Serviço que ajuda as pessoas a encontrar emprego e as empresas a encontrar empregados.
in scheme: mediatopic
created: 2009-10-22T02:00:00+00:00
modified: 2023-03-31T12:00:00+00:00
broader: http://cv.iptc.org/newscodes/mediatopic/20001371

agência funerária e crematório
type: Concept
definition: Empresas que fornecem serviços funerários.
in scheme: mediatopic
created: 2009-10-22T02:00:00+00:00
modified: 2023-03-31T12:00:00+00:00
retired: 2023-03-31T12:00:00+00:00
broader: serviços financeiros

prestador de serviços de saúde
type: Concept
definition: Fornecedores de serviços médicos a todos os níveis, incluindo médicos, hospitais etc.
in scheme: mediatopic
created: 2009-10-22T02:00:00+00:00
modified: 2022-06-14T12:00:00+00:00
broader: http://cv.iptc.org/newscodes/mediatopic/20001354

seguros
type: Concept
definition: Contrato de assunção de risco que pressupõe que os indivíduos paguem periodicamente uma quantia para ficarem protegidos financeiramente contra eventos inesperados.
in scheme: mediatopic
created: 2009-10-22T02:00:00+00:00
modified: 2023-03-31T12:00:00+00:00
broader: http://cv.iptc.org/newscodes/mediatopic/20001370

serviços de investimento
type: Concept
definition: Conselheiros financeiros.
in scheme: mediatopic
created: 2009-10-22T02:00:00+00:00
modified: 2023-03-31T12:00:00+00:00
broader: http://cv.iptc.org/newscodes/mediatopic/20001370

serviços de limpeza
type: Concept
definition: Empresas que fornecem serviços de limpeza e similares.
in scheme: mediatopic
created: 2009-10-22T02:00:00+00:00
modified: 2023-03-31T12:00:00+00:00
retired: 2023-03-31T12:00:00+00:00
broader: http://cv.iptc.org/newscodes/mediatopic/20001371

serviços jurídicos
type: Concept
definition: Advogados, notários e outros que ajudam empresas e indivíduos a lidar com leis.
in scheme: mediatopic
created: 2009-10-22T02:00:00+00:00
modified: 2023-03-31T12:00:00+00:00
broader: http://cv.iptc.org/newscodes/mediatopic/20001371

estudos de mercado
type: Concept
definition: Serviço que tenta determinar o que as pessoas pretendem comprar.
in scheme: mediatopic
created: 2009-10-22T02:00:00+00:00
modified: 2023-03-31T12:00:00+00:00
broader: estratégia e marketing

indicadores de consumo
type: Concept
definition: Comportamento estatisticamente significativo dos consumidores.
in scheme: mediatopic
created: 2009-10-22T02:00:00+00:00
modified: 2023-03-31T12:00:00+00:00
broader: estratégia e marketing

finanças pessoais
type: Concept
definition: Gastos e receitas individuais.
in scheme: mediatopic
created: 2009-10-22T02:00:00+00:00
modified: 2023-03-31T12:00:00+00:00
retired: 2023-03-31T12:00:00+00:00
broader: serviços financeiros

rendimento individual
type: Concept
definition: Dinheiro que uma pessoa ganha.
in scheme: mediatopic
created: 2009-10-22T02:00:00+00:00
modified: 2023-03-31T12:00:00+00:00
retired: 2023-03-31T12:00:00+00:00
broader: serviços financeiros

investimentos pessoais
type: Concept
definition: Finanças e investimentos pessoais.
in scheme: mediatopic
created: 2009-10-22T02:00:00+00:00
modified: 2023-03-31T12:00:00+00:00
broader: http://cv.iptc.org/newscodes/mediatopic/20001370

serviços pessoais
type: Concept
definition: Serviço ao consumidor que é intangível, como cuidados de beleza ou cabeleireiro.
in scheme: mediatopic
created: 2009-10-22T02:00:00+00:00
modified: 2023-03-31T12:00:00+00:00
retired: 2023-03-31T12:00:00+00:00
broader: http://cv.iptc.org/newscodes/mediatopic/20001371

serviços promocionais e de impressão
type: Concept
definition: Produção de material impresso como panfletos, anúncios, letreiros etc.
in scheme: mediatopic
created: 2009-10-22T02:00:00+00:00
modified: 2023-03-31T12:00:00+00:00
retired: 2023-03-31T12:00:00+00:00
broader: serviços financeiros

serviços de locação
type: Concept
definition: Empresas que fornecem serviços de locação, incluindo veículos, smokings, ferramentas, equipamento pesado e outros bens.
in scheme: mediatopic
created: 2009-10-22T02:00:00+00:00
modified: 2023-03-31T12:00:00+00:00
broader: http://cv.iptc.org/newscodes/mediatopic/20001371

serviços de expedição
type: Concept
definition: Empresas que preparam e transportam embalagens e documentos por vários meios, incluindo serviços postais.
in scheme: mediatopic
created: 2009-10-22T02:00:00+00:00
modified: 2023-03-31T12:00:00+00:00
broader: http://cv.iptc.org/newscodes/mediatopic/20001371

corretagem
type: Concept
definition: Compra e venda de ações de uma companhia, em representação de indivíduos ou entidades.
in scheme: mediatopic
created: 2009-10-22T02:00:00+00:00
modified: 2023-03-31T12:00:00+00:00
broader: http://cv.iptc.org/newscodes/mediatopic/20001370

serviços de casamento
type: Concept
definition: Serviços e produtos relacionados à indústria do casamento.
in scheme: mediatopic
created: 2009-10-22T02:00:00+00:00
modified: 2023-03-31T12:00:00+00:00
retired: 2023-03-31T12:00:00+00:00
broader: http://cv.iptc.org/newscodes/mediatopic/20001371

indústria metalomecânica e engenharia
type: Concept
definition: Fabricantes de equipamento elétrico, eletrônico ou mecânico; não inclui engenharia civil.
in scheme: mediatopic
created: 2009-10-22T02:00:00+00:00
modified: 2021-02-18T12:00:00+00:00
broader: setor econômico
narrower: indústria aeroespacial
narrower: automóvel
narrower: indústria da defesa
narrower: material elétrico
narrower: equipamentos pesados
narrower: equipamentos metalomecânicos
narrower: engenharia de instrumentação
narrower: engenharia de máquinas
narrower: construção naval
narrower: bens de produção
narrower: construção ferroviária

indústria aeroespacial
type: Concept
definition: Companhias que montam ou fabricam componentes para aviões e naves espaciais.
in scheme: mediatopic
created: 2009-10-22T02:00:00+00:00
modified: 2021-02-18T12:00:00+00:00
broader: indústria metalomecânica e engenharia

automóvel
type: Concept
definition: Companhias que fabricam peças para automóveis e que os montam.
in scheme: mediatopic
created: 2009-10-22T02:00:00+00:00
modified: 2021-02-18T12:00:00+00:00
broader: indústria metalomecânica e engenharia

indústria da defesa
type: Concept
definition: Fabricantes de armas, tanques, canhões, barcos etc. para os serviços de proteção militar e não militar.
in scheme: mediatopic
created: 2009-10-22T02:00:00+00:00
modified: 2023-03-31T12:00:00+00:00
broader: indústria metalomecânica e engenharia

material elétrico
type: Concept
definition: Fabricantes de produtos elétricos para uso doméstico ou industrial.
in scheme: mediatopic
created: 2009-10-22T02:00:00+00:00
modified: 2021-02-18T12:00:00+00:00
broader: indústria metalomecânica e engenharia

equipamentos pesados
type: Concept
definition: Fabricantes de gruas, buldôzeres e equipamento similar para uso em grandes projetos de construção.
in scheme: mediatopic
created: 2009-10-22T02:00:00+00:00
modified: 2023-03-31T12:00:00+00:00
broader: indústria metalomecânica e engenharia

equipamentos metalomecânicos
type: Concept
definition: Fabricantes de artigos mecânicos, elétricos e eletrônicos, necessários na produção de outros equipamentos.
in scheme: mediatopic
created: 2009-10-22T02:00:00+00:00
modified: 2023-03-31T12:00:00+00:00
retired: 2023-03-31T12:00:00+00:00
broader: indústria metalomecânica e engenharia

engenharia de instrumentação
type: Concept
definition: Fabricantes de instrumentos de calibração ou de medição de coisas como velocidade, pressão, distância etc.
in scheme: mediatopic
created: 2009-10-22T02:00:00+00:00
modified: 2023-03-31T12:00:00+00:00
retired: 2023-03-31T12:00:00+00:00
broader: indústria metalomecânica e engenharia

engenharia de máquinas
type: Concept
definition: Fabricantes de turbinas, motores, ventiladores, bombas e componentes para equipamentos elétricos.
in scheme: mediatopic
created: 2009-10-22T02:00:00+00:00
modified: 2023-03-31T12:00:00+00:00
broader: indústria metalomecânica e engenharia

construção naval
type: Concept
definition: Fabricantes de navios, submarinos, barcaças.
in scheme: mediatopic
created: 2009-10-22T02:00:00+00:00
modified: 2023-03-31T12:00:00+00:00
broader: indústria metalomecânica e engenharia

mídia
type: Concept
definition: Os vários meios que transmitem notícias e informações ao público.
in scheme: mediatopic
created: 2009-10-22T02:00:00+00:00
modified: 2023-03-31T12:00:00+00:00
broader: setor econômico
narrower: publicidade
narrower: mercado livreiro
narrower: indústria cinematográfica
narrower: indústria musical
narrower: agências noticiosas
narrower: imprensa
narrower: mídia online
narrower: relações públicas
narrower: rádio
narrower: serviços de satélite e de cabo
narrower: televisão
narrower: serviço de streaming
narrower: http://cv.iptc.org/newscodes/mediatopic/20001369
narrower: http://cv.iptc.org/newscodes/mediatopic/20001372

publicidade
type: Concept
definition: Métodos de promoção de bens e serviços junto do consumidor, através de vídeos, imagens, textos etc.
in scheme: mediatopic
created: 2009-10-22T02:00:00+00:00
modified: 2023-03-31T12:00:00+00:00
broader: mídia

mercado livreiro
type: Concept
definition: Negócio de produção e venda de publicações, seja de ficção ou de não ficção.
in scheme: mediatopic
created: 2009-10-22T02:00:00+00:00
modified: 2023-03-31T12:00:00+00:00
broader: mídia

indústria cinematográfica
type: Concept
definition: Histórias relativas ao negócio do cinema.
in scheme: mediatopic
created: 2009-10-22T02:00:00+00:00
modified: 2023-03-31T12:00:00+00:00
broader: mídia

indústria musical
type: Concept
definition: Gravação, produção e marketing de música.
in scheme: mediatopic
created: 2009-10-22T02:00:00+00:00
modified: 2023-03-31T12:00:00+00:00
broader: mídia

agências noticiosas
type: Concept
definition: Agências comerciais que produzem e distribuem eventos noticiosos por escrito, por rádio ou televisão, por vídeo ou por meios eletrônicos.
in scheme: mediatopic
created: 2009-10-22T02:00:00+00:00
modified: 2023-03-31T12:00:00+00:00
retired: 2023-03-31T12:00:00+00:00
broader: mídia

imprensa
type: Concept
definition: Negócio de produção de meios escritos ou gráficos impressos para a distribuição periódica de notícias.
in scheme: mediatopic
created: 2009-10-22T02:00:00+00:00
modified: 2023-03-31T12:00:00+00:00
retired: 2023-03-31T12:00:00+00:00
broader: mídia

mídia online
type: Concept
definition: Negócio de distribuição de notícias e informação através de redes de computadores, para consumo público.
in scheme: mediatopic
created: 2009-10-22T02:00:00+00:00
modified: 2023-03-31T12:00:00+00:00
retired: 2023-03-31T12:00:00+00:00
broader: mídia

relações públicas
type: Concept
definition: Promoção de produtos e serviços através de campanhas publicitárias e/ou pessoa a pessoa, ou através de releases.
in scheme: mediatopic
created: 2009-10-22T02:00:00+00:00
modified: 2023-03-31T12:00:00+00:00
broader: mídia

rádio
type: Concept
definition: Histórias relativas ao negócio da rádio.
in scheme: mediatopic
created: 2009-10-22T02:00:00+00:00
modified: 2023-03-31T12:00:00+00:00
broader: mídia

serviços de satélite e de cabo
type: Concept
definition: Transmissão de notícias, entretenimento e informação via satélite ou serviços de televisão a cabo.
in scheme: mediatopic
created: 2009-10-22T02:00:00+00:00
modified: 2021-05-05T12:00:00+00:00
broader: mídia

televisão
type: Concept
definition: Histórias relativas ao negócio da televisão.
in scheme: mediatopic
created: 2009-10-22T02:00:00+00:00
modified: 2023-03-31T12:00:00+00:00
broader: mídia

minérios e metais
type: Concept
definition: Produção e refinação de minerais em metais.
in scheme: mediatopic
created: 2009-10-22T02:00:00+00:00
modified: 2023-03-31T12:00:00+00:00
broader: setor econômico
narrower: ouro e metais preciosos
narrower: ferro e aço
narrower: minas
narrower: metais não ferrosos

material de construção
type: Concept
definition: Fabrico de materiais para a indústria da construção.
in scheme: mediatopic
created: 2009-10-22T02:00:00+00:00
modified: 2023-03-31T12:00:00+00:00
broader: construção e propriedades

ouro e metais preciosos
type: Concept
definition: Mineração, refinação e venda de ouro e de outros metais preciosos.
in scheme: mediatopic
created: 2009-10-22T02:00:00+00:00
modified: 2023-03-31T12:00:00+00:00
broader: minérios e metais

ferro e aço
type: Concept
definition: Mineração, refinação e venda de metais ferrosos.
in scheme: mediatopic
created: 2009-10-22T02:00:00+00:00
modified: 2023-03-31T12:00:00+00:00
retired: 2023-03-31T12:00:00+00:00
broader: minérios e metais

minas
type: Concept
definition: Indústria da extração de metais, de matérias-primas como o carvão, ou de pedras preciosas como os diamantes.
in scheme: mediatopic
created: 2009-10-22T02:00:00+00:00
modified: 2023-03-31T12:00:00+00:00
retired: 2023-03-31T12:00:00+00:00
broader: minérios e metais

metais não ferrosos
type: Concept
definition: Mineração, refinação e venda de cobre, zinco, alumínio e de outros metais não ferrosos.
in scheme: mediatopic
created: 2009-10-22T02:00:00+00:00
modified: 2023-03-31T12:00:00+00:00
retired: 2023-03-31T12:00:00+00:00
broader: minérios e metais

indústria transformadora
type: Concept
definition: Negócio da transformação de matéria-prima em produtos utilizáveis.
in scheme: mediatopic
created: 2009-10-22T02:00:00+00:00
modified: 2023-03-31T12:00:00+00:00
retired: 2023-03-31T12:00:00+00:00
broader: setor econômico
narrower: destilação e bebidas
narrower: papel e embalagem
narrower: borracha
narrower: refrigerantes
narrower: têxtil e vestuário
narrower: cigarro eletrônico

destilação e bebidas
type: Concept
definition: Fabrico de bebidas alcoólicas.
in scheme: mediatopic
created: 2009-10-22T02:00:00+00:00
modified: 2023-03-31T12:00:00+00:00
retired: 2023-03-31T12:00:00+00:00
broader: indústria transformadora

indústria da alimentação
type: Concept
definition: Negócio do processamento, distribuição e venda de produtos básicos para o consumo humano.
in scheme: mediatopic
created: 2009-10-22T02:00:00+00:00
modified: 2023-03-31T12:00:00+00:00
broader: bens de consumo

mobiliário e decoração
type: Concept
definition: Fabrico de móveis, papéis de parede, tintas e tecidos para decoração interior.
in scheme: mediatopic
created: 2009-10-22T02:00:00+00:00
modified: 2023-03-31T12:00:00+00:00
broader: bens de consumo

papel e embalagem
type: Concept
definition: Produção de papel para escrever, embrulhar, imprimir ou embalar.
in scheme: mediatopic
created: 2009-10-22T02:00:00+00:00
modified: 2023-03-31T12:00:00+00:00
retired: 2023-03-31T12:00:00+00:00
broader: indústria transformadora

borracha
type: Concept
definition: Produção de materiais de borracha para o fabrico de luvas, revestimentos protetores, mangueiras etc.
in scheme: mediatopic
created: 2009-10-22T02:00:00+00:00
modified: 2023-03-31T12:00:00+00:00
retired: 2023-03-31T12:00:00+00:00
broader: indústria transformadora

refrigerantes
type: Concept
definition: Fabrico de bebidas não alcoólicas.
in scheme: mediatopic
created: 2009-10-22T02:00:00+00:00
modified: 2023-03-31T12:00:00+00:00
retired: 2023-03-31T12:00:00+00:00
broader: indústria transformadora

têxtil e vestuário
type: Concept
definition: Fabrico de tecidos para móveis, abajures e vestuário de vários tipos.
in scheme: mediatopic
created: 2009-10-22T02:00:00+00:00
modified: 2023-03-31T12:00:00+00:00
retired: 2023-03-31T12:00:00+00:00
broader: indústria transformadora

tabaco
type: Concept
definition: Cultivo, produção e venda de produtos do tabaco.
in scheme: mediatopic
created: 2009-10-22T02:00:00+00:00
modified: 2023-03-31T12:00:00+00:00
broader: bens de consumo

indústria do turismo e lazer
type: Concept
definition: Organizações e operações comerciais que lidam com férias, visitas a locais de interesse e atividades recreativas.
in scheme: mediatopic
created: 2009-10-22T02:00:00+00:00
modified: 2023-03-31T12:00:00+00:00
broader: setor econômico
narrower: cassinos e jogo
narrower: hotelaria e alojamentos
narrower: produtos para esporte e lazer
narrower: restaurantes e catering
narrower: operadores turísticos

cassinos e jogo
type: Concept
definition: Negócio do jogo, desde as instalações para vários jogos de azar, usando cartas, dados, roletas, até apostas em corridas de animais.
in scheme: mediatopic
created: 2009-10-22T02:00:00+00:00
modified: 2023-03-31T12:00:00+00:00
broader: indústria do turismo e lazer

hotelaria e alojamentos
type: Concept
definition: Negócio que fornece comida e alojamento a viajantes.
in scheme: mediatopic
created: 2009-10-22T02:00:00+00:00
modified: 2023-03-31T12:00:00+00:00
broader: indústria do turismo e lazer

produtos para esporte e lazer
type: Concept
definition: Fabrico de bens para atividades de lazer.
in scheme: mediatopic
created: 2009-10-22T02:00:00+00:00
modified: 2021-02-18T12:00:00+00:00
broader: indústria do turismo e lazer

restaurantes e catering
type: Concept
definition: Negócio do fornecimento de comida preparada para clientes em grupos grandes ou pequenos.
in scheme: mediatopic
created: 2009-10-22T02:00:00+00:00
modified: 2023-03-31T12:00:00+00:00
broader: indústria do turismo e lazer

operadores turísticos
type: Concept
definition: Operadores de viagens, seja localmente, seja em outros países.
in scheme: mediatopic
created: 2009-10-22T02:00:00+00:00
modified: 2023-03-31T12:00:00+00:00
broader: indústria do turismo e lazer

transportes
type: Concept
definition: Meios que permitem chegar de um lugar a outro sem caminhar.
in scheme: mediatopic
created: 2009-10-22T02:00:00+00:00
modified: 2023-03-31T12:00:00+00:00
broader: setor econômico
narrower: aviação
narrower: transporte ferroviário
narrower: transporte rodoviário
narrower: trânsito
narrower: transporte marítimo e fluvial
narrower: logística
narrower: http://cv.iptc.org/newscodes/mediatopic/20001362
narrower: http://cv.iptc.org/newscodes/mediatopic/20001363
narrower: http://cv.iptc.org/newscodes/mediatopic/20001364

aviação
type: Concept
definition: Operações de aviões e de aeroportos.
in scheme: mediatopic
created: 2009-10-22T02:00:00+00:00
modified: 2023-03-31T12:00:00+00:00
broader: transportes

migração pendular
type: Concept
definition: O processo de chegar ao ou vir do trabalho, incluindo opções de transporte, redes de transporte e partilha de carro.
in scheme: mediatopic
created: 2009-10-22T02:00:00+00:00
modified: 2021-02-18T12:00:00+00:00
broad match: http://cv.iptc.org/newscodes/subjectcode/10007000
broader: emprego

transporte ferroviário
type: Concept
definition: Negócio do transporte de pessoas ou carga por trem.
in scheme: mediatopic
created: 2009-10-22T02:00:00+00:00
modified: 2023-03-31T12:00:00+00:00
broader: transportes

transporte rodoviário
type: Concept
definition: Negócio do transporte de mercadorias por caminhão e rodovia.
in scheme: mediatopic
created: 2009-10-22T02:00:00+00:00
modified: 2023-03-31T12:00:00+00:00
broader: transportes

trânsito
type: Concept
definition: Informações e/ou alertas sobre o trânsito.
in scheme: mediatopic
created: 2009-10-22T02:00:00+00:00
modified: 2023-03-31T12:00:00+00:00
retired: 2023-03-31T12:00:00+00:00
broader: transportes

transporte marítimo e fluvial
type: Concept
definition: Movimento comercial de pessoas ou bens através de barcos, navios e água.
in scheme: mediatopic
created: 2009-10-22T02:00:00+00:00
modified: 2021-02-18T12:00:00+00:00
broader: transportes

economia (geral)
type: Concept
definition: Conteúdo geral sobre comércio e economia.
in scheme: mediatopic
created: 2009-10-22T02:00:00+00:00
modified: 2024-03-28T12:00:00+00:00
broader: economia, negócios e finanças
narrower: macroeconomia
narrower: banco central
narrower: valor cambial
narrower: associações empresariais
narrower: mercados emergentes
narrower: instituições econômicas internacionais
narrower: comércio externo
narrower: política monetária
narrower: fundos de investimento
narrower: economia colaborativa

política econômica
type: Concept
definition: Política governamental relativamente à produção, impostos, tarifas e outros assuntos que afetem a direção e saúde da economia.
in scheme: mediatopic
created: 2009-10-22T02:00:00+00:00
modified: 2025-03-31T12:00:00+00:00
broader: política governamental
narrower: nacionalização
narrower: privatização
narrower: empresa estatal
narrower: incentivo ao desenvolvimento econômico

macroeconomia
type: Concept
definition: Economia em grande escala, a nível mundial ou nacional.
in scheme: mediatopic
created: 2009-10-22T02:00:00+00:00
modified: 2024-03-28T12:00:00+00:00
broader: economia (geral)
narrower: obrigações
narrower: orçamento
narrower: consumidores
narrower: confiança do consumidor
narrower: crédito e dívida
narrower: deflação
narrower: crescimento econômico
narrower: indicadores econômicos
narrower: produto interno bruto
narrower: produção industrial
narrower: inventários
narrower: produtividade
narrower: estatísticas de emprego
narrower: exportações
narrower: ajuda governamental
narrower: dívida pública
narrower: importações
narrower: inflação
narrower: investimentos
narrower: hipotecas
narrower: preços
narrower: recessão

obrigações
type: Concept
definition: Documento empresarial ou governamental que representa o empréstimo de dinheiro, a uma taxa de juro fixa e por determinado período de tempo, a uma empresa ou governo.
in scheme: mediatopic
created: 2009-10-22T02:00:00+00:00
modified: 2024-03-28T12:00:00+00:00
retired: 2024-03-28T12:00:00+00:00
broader: macroeconomia

orçamento
type: Concept
definition: Método de equilibrar receitas e despesas.
in scheme: mediatopic
created: 2009-10-22T02:00:00+00:00
modified: 2024-03-28T12:00:00+00:00
retired: 2024-03-28T12:00:00+00:00
broader: macroeconomia

empresas
type: Concept
definition: Organizações estabelecidas com fins lucrativos, mediante a criação e venda de um produto ou serviço.
in scheme: mediatopic
created: 2009-10-22T02:00:00+00:00
modified: 2024-03-28T12:00:00+00:00
broader: economia, negócios e finanças
narrower: empreendedorismo
narrower: pequena e média empresa
narrower: cooperativa

banco central
type: Concept
definition: O principal banco de um país, que fixa taxas de juro e transfere fundos entre bancos comerciais.
in scheme: mediatopic
created: 2009-10-22T02:00:00+00:00
modified: 2024-03-28T12:00:00+00:00
broader: economia (geral)

consumidores
type: Concept
definition: Comprador de bens e serviços.
in scheme: mediatopic
created: 2009-10-22T02:00:00+00:00
modified: 2024-03-28T12:00:00+00:00
retired: 2024-03-28T12:00:00+00:00
broader: macroeconomia
narrower: questão de consumo

confiança do consumidor
type: Concept
definition: A confiança do consumidor na economia.
in scheme: mediatopic
created: 2009-10-22T02:00:00+00:00
modified: 2024-03-28T12:00:00+00:00
broader: macroeconomia

questão de consumo
type: Concept
definition: Assuntos como preços, inflação/deflação, qualidade dos bens, a nível da venda no varejo.
in scheme: mediatopic
created: 2009-10-22T02:00:00+00:00
modified: 2024-03-28T12:00:00+00:00
retired: 2024-03-28T12:00:00+00:00
broader: consumidores

crédito e dívida
type: Concept
definition: Crédito: dinheiro disponível, geralmente por empréstimo. Dívida: dinheiro devido.
in scheme: mediatopic
created: 2009-10-22T02:00:00+00:00
modified: 2024-03-28T12:00:00+00:00
retired: 2024-03-28T12:00:00+00:00
broader: macroeconomia

valor cambial
type: Concept
definition: Valor de uma moeda em comparação com outra.
in scheme: mediatopic
created: 2009-10-22T02:00:00+00:00
modified: 2024-03-28T12:00:00+00:00
broader: economia (geral)
narrower: criptomoeda

deflação
type: Concept
definition: Queda dos preços.
in scheme: mediatopic
created: 2009-10-22T02:00:00+00:00
modified: 2024-03-28T12:00:00+00:00
broad match: http://cv.iptc.org/newscodes/subjectcode/04008016
broader: macroeconomia

crescimento econômico
type: Concept
definition: Aumento do PIB.
in scheme: mediatopic
created: 2009-10-22T02:00:00+00:00
modified: 2024-03-28T12:00:00+00:00
broad match: http://cv.iptc.org/newscodes/subjectcode/04000000
broader: macroeconomia

indicadores econômicos
type: Concept
definition: Certos índices, tais como inventários, movimento dos preços, que indicam se a economia melhora ou piora.
in scheme: mediatopic
created: 2009-10-22T02:00:00+00:00
modified: 2024-03-28T12:00:00+00:00
retired: 2024-03-28T12:00:00+00:00
broader: macroeconomia

produto interno bruto
type: Concept
definition: Indicador econômico do valor monetário da produção em um território, comumente abreviado como PIB.
in scheme: mediatopic
created: 2009-10-22T02:00:00+00:00
modified: 2024-03-28T12:00:00+00:00
broad match: http://cv.iptc.org/newscodes/subjectcode/04000000
broader: macroeconomia

produção industrial
type: Concept
definition: Fabrico de bens duráveis e não duráveis.
in scheme: mediatopic
created: 2009-10-22T02:00:00+00:00
modified: 2024-03-28T12:00:00+00:00
broader: macroeconomia

inventários
type: Concept
definition: Bens que não foram vendidos e que permanecem no produtor, atacadista ou varejista.
in scheme: mediatopic
created: 2009-10-22T02:00:00+00:00
modified: 2024-03-28T12:00:00+00:00
broader: macroeconomia

produtividade
type: Concept
definition: Custo de produção de um item de valor, geralmente medido como o rendimento por hora e por pessoa.
in scheme: mediatopic
created: 2009-10-22T02:00:00+00:00
modified: 2024-03-28T12:00:00+00:00
broader: macroeconomia

associações empresariais
type: Concept
definition: Associações empresariais, industriais e comerciais, sociedades e outros grupos do setor privado.
in scheme: mediatopic
created: 2009-10-22T02:00:00+00:00
modified: 2024-03-28T12:00:00+00:00
broader: economia (geral)

mercados emergentes
type: Concept
definition: Mercados que lutam para entrar nas economias mundiais e aqueles que requerem ajuda financeira de credores internacionais.
in scheme: mediatopic
created: 2009-10-22T02:00:00+00:00
modified: 2024-03-28T12:00:00+00:00
broader: economia (geral)

estatísticas de emprego
type: Concept
definition: Estatísticas sobre o emprego.
in scheme: mediatopic
created: 2009-10-22T02:00:00+00:00
modified: 2024-03-28T12:00:00+00:00
broad match: http://cv.iptc.org/newscodes/subjectcode/04008000
broader: macroeconomia

exportações
type: Concept
definition: Aquilo que é produzido ou manufaturado em um país e é enviado para fora para ser vendido.
in scheme: mediatopic
created: 2009-10-22T02:00:00+00:00
modified: 2024-03-28T12:00:00+00:00
broader: macroeconomia

ajuda governamental
type: Concept
definition: Fornecimento de ajuda financeira ou de outro tipo de um governo, geralmente a outro governo.
in scheme: mediatopic
created: 2009-10-22T02:00:00+00:00
modified: 2024-03-28T12:00:00+00:00
retired: 2024-03-28T12:00:00+00:00
broader: macroeconomia

dívida pública
type: Concept
definition: Quantia que um governo deve em obrigações, serviços ou bens pelos quais não existe dinheiro efetivo.
in scheme: mediatopic
created: 2009-10-22T02:00:00+00:00
modified: 2024-03-28T12:00:00+00:00
broader: macroeconomia

importações
type: Concept
definition: Aquilo que é comprado no estrangeiro e que é trazido para um país para ser revendido.
in scheme: mediatopic
created: 2009-10-22T02:00:00+00:00
modified: 2024-03-28T12:00:00+00:00
broader: macroeconomia

inflação
type: Concept
definition: Subida dos preços.
in scheme: mediatopic
created: 2009-10-22T02:00:00+00:00
modified: 2024-03-28T12:00:00+00:00
broad match: http://cv.iptc.org/newscodes/subjectcode/04008016
broader: macroeconomia

juros
type: Concept
definition: Montante de dinheiro que alguém deve pagar quando pede dinheiro emprestado.
in scheme: mediatopic
created: 2009-10-22T02:00:00+00:00
modified: 2024-03-28T12:00:00+00:00
broader: política monetária

instituições econômicas internacionais
type: Concept
definition: Entidades como a Organização das Nações Unidas para o Desenvolvimento Industrial, o Banco Mundial, a Organização Mundial de Comércio, o Import-Export Bank etc.
in scheme: mediatopic
created: 2009-10-22T02:00:00+00:00
modified: 2024-07-01T12:00:00+00:00
broader: economia (geral)

comércio externo
type: Concept
definition: Comércio de bens e serviços entre nações.
in scheme: mediatopic
created: 2009-10-22T02:00:00+00:00
modified: 2024-03-28T12:00:00+00:00
broader: economia (geral)
narrower: acordos comerciais
narrower: balança comercial
narrower: disputa comercial
narrower: política comercial
narrower: tarifas

acordos comerciais
type: Concept
definition: Acordo governamental entre países para a compra e venda de bens e serviços.
in scheme: mediatopic
created: 2009-10-22T02:00:00+00:00
modified: 2024-03-28T12:00:00+00:00
broader: comércio externo

balança comercial
type: Concept
definition: Diferença entre o valor financeiro de importações e exportações.
in scheme: mediatopic
created: 2009-10-22T02:00:00+00:00
modified: 2024-03-28T12:00:00+00:00
broader: comércio externo

disputa comercial
type: Concept
definition: Disputas internacionais sobre barreiras ao comércio, cartéis e dumping.
in scheme: mediatopic
created: 2009-10-22T02:00:00+00:00
modified: 2024-03-28T12:00:00+00:00
broader: comércio externo

política comercial
type: Concept
definition: Decisões governamentais em relação a tarifas, embarque, embargos e os tipos de bens e serviços que são importados e exportados.
in scheme: mediatopic
created: 2009-10-22T02:00:00+00:00
modified: 2024-03-28T12:00:00+00:00
broader: comércio externo

investimentos
type: Concept
definition: Compra especulativa de instrumentos corporativos, matérias-primas, divisas etc.
in scheme: mediatopic
created: 2009-10-22T02:00:00+00:00
modified: 2024-03-28T12:00:00+00:00
retired: 2024-03-28T12:00:00+00:00
broader: macroeconomia

política monetária
type: Concept
definition: Política monetária governamental sobre a quantidade de dinheiro em circulação e a taxa de juro a que pode ser emprestado.
in scheme: mediatopic
created: 2009-10-22T02:00:00+00:00
modified: 2024-03-28T12:00:00+00:00
broader: economia (geral)
narrower: juros

hipotecas
type: Concept
definition: Empréstimo de dinheiro com o objetivo de comprar uma propriedade, terreno ou edifício, ou, para proprietários, de reparar ou fazer a manutenção de propriedades.
in scheme: mediatopic
created: 2009-10-22T02:00:00+00:00
modified: 2024-03-28T12:00:00+00:00
broader: macroeconomia

fundos de investimento
type: Concept
definition: Fundo de ações ou obrigações para venda agrupadas por intenção de investimento, tal como crescimento de rendimento ou segurança.
in scheme: mediatopic
created: 2009-10-22T02:00:00+00:00
modified: 2024-03-28T12:00:00+00:00
broader: economia (geral)

preços
type: Concept
definition: Valor monetário de bens e serviços ou de ações e obrigações.
in scheme: mediatopic
created: 2009-10-22T02:00:00+00:00
modified: 2024-03-28T12:00:00+00:00
retired: 2024-03-28T12:00:00+00:00
broader: macroeconomia

recessão
type: Concept
definition: Descida do PIB em um período de dois trimestres contínuos.
in scheme: mediatopic
created: 2009-10-22T02:00:00+00:00
modified: 2024-03-28T12:00:00+00:00
broad match: http://cv.iptc.org/newscodes/subjectcode/04000000
broader: macroeconomia

tarifas
type: Concept
definition: Taxas impostas a bens importados ou exportados, muitas vezes punitivas.
in scheme: mediatopic
created: 2009-10-22T02:00:00+00:00
modified: 2024-03-28T12:00:00+00:00
broader: comércio externo

mercado e bolsa
type: Concept
definition: Entidades organizadas para a compra e venda de ações, divisas, matérias-primas e outros bens.
in scheme: mediatopic
created: 2009-10-22T02:00:00+00:00
modified: 2024-03-28T12:00:00+00:00
broader: economia, negócios e finanças
narrower: mercados de produtos de base
narrower: mercado de dívida
narrower: mercado cambial
narrower: mercado de empréstimos

mercados de produtos de base
type: Concept
definition: Troca ou comercialização de matérias-primas como algodão, petróleo, carvão, metais etc.
in scheme: mediatopic
created: 2009-10-22T02:00:00+00:00
modified: 2024-03-28T12:00:00+00:00
broader: mercado e bolsa
narrower: mercado da energia
narrower: metal
narrower: produtos agrícolas

mercado da energia
type: Concept
definition: Comércio e mercados energéticos.
in scheme: mediatopic
created: 2009-10-22T02:00:00+00:00
modified: 2024-03-28T12:00:00+00:00
broader: mercados de produtos de base

metal
type: Concept
definition: Mercados para comercializar metais básicos como cobre, alumínio, aço, zinco etc.
in scheme: mediatopic
created: 2009-10-22T02:00:00+00:00
modified: 2021-02-18T12:00:00+00:00
broader: mercados de produtos de base

produtos agrícolas
type: Concept
definition: Transação de matérias-primas como algodão, açúcar, sorgo, soja etc.
in scheme: mediatopic
created: 2009-10-22T02:00:00+00:00
modified: 2024-03-28T12:00:00+00:00
retired: 2023-10-02T12:00:00+00:00
broader: mercados de produtos de base

mercado de dívida
type: Concept
definition: Mercado para negociar instrumentos de dívida como obrigações, certificados de depósito, aprovações bancárias, obrigações do tesouro, notas, promissórias etc.
in scheme: mediatopic
created: 2009-10-22T02:00:00+00:00
modified: 2024-03-28T12:00:00+00:00
broader: mercado e bolsa

mercado cambial
type: Concept
definition: Troca de divisas em todo o mundo, através de mercados regulados.
in scheme: mediatopic
created: 2009-10-22T02:00:00+00:00
modified: 2024-03-28T12:00:00+00:00
broader: mercado e bolsa

mercado de empréstimos
type: Concept
definition: Mercado onde o dinheiro está disponível para empréstimos, a determinadas taxas de juro.
in scheme: mediatopic
created: 2009-10-22T02:00:00+00:00
modified: 2024-03-28T12:00:00+00:00
broader: mercado e bolsa

empréstimos
type: Concept
definition: Acordo por meio do qual um indivíduo ou uma instituição emprestam dinheiro a outro, mediante uma taxa de juro e um período para sua devolução.
in scheme: mediatopic
created: 2009-10-22T02:00:00+00:00
modified: 2024-03-28T12:00:00+00:00
broader: http://cv.iptc.org/newscodes/mediatopic/20001370

títulos
type: Concept
definition: Mercados para comercializar tipos de documentos como ações e obrigações.
in scheme: mediatopic
created: 2009-10-22T02:00:00+00:00
modified: 2023-03-31T12:00:00+00:00
retired: 2023-03-31T12:00:00+00:00
broader: financiamento e oferta de ações
narrower: opções de compra de ações

derivados financeiros
type: Concept
definition: Instrumentos financeiros como futuros, intercâmbios e opções, usados na gestão de investimentos de risco, e cujas características e valor dependem das características e valor de um instrumento subjacente, como uma matéria-prima, obrigação ou moeda.
in scheme: mediatopic
created: 2009-10-22T02:00:00+00:00
modified: 2023-03-31T12:00:00+00:00
broader: ações

ações
type: Concept
definition: Documento empresarial que outorga a um indivíduo os direitos de propriedade de uma determinada parte dos ganhos de uma empresa.
in scheme: mediatopic
created: 2009-10-22T02:00:00+00:00
modified: 2024-07-01T12:00:00+00:00
broader: financiamento e oferta de ações
narrower: recompra
narrower: anúncio de dividendos
narrower: atividade bolsista
narrower: oferta pública inicial
narrower: derivados financeiros
narrower: recomendação de ações
narrower: hot stock

associações de pais
type: Concept
definition: Grupos de pais que se organizam para apoiar as atividades educacionais dos filhos.
in scheme: mediatopic
created: 2009-10-22T02:00:00+00:00
modified: 2021-09-30T12:00:00+00:00
broader: educação

Educação religiosa
type: Concept
definition: Instrução religiosa ou a propósito de religiões, geralmente, mas não sempre, ministrada em escolas dirigidas por religiosos.
in scheme: mediatopic
created: 2009-10-22T02:00:00+00:00
modified: 2021-09-30T12:00:00+00:00
broader: educação

escolas
type: Concept
definition: Edifício ou instituição onde educação de vários níveis é fornecida.
in scheme: mediatopic
created: 2009-10-22T02:00:00+00:00
modified: 2021-09-30T12:00:00+00:00
broader: educação
narrower: escolas de ensino fundamental, 1ª à 5ª série
narrower: educação contínua
narrower: educação de adultos
narrower: escolas de ensino médio
narrower: ensino superior
narrower: escolas de ensino fundamental, 6ª à 9ª série
narrower: pré-escolar
narrower: escolas religiosas
narrower: escolas públicas
narrower: escolas privadas
narrower: escolas independentes

escolas de ensino fundamental, 1ª à 5ª série
type: Concept
definition: Escola a partir dos 5-6 anos até os 10 anos.
in scheme: mediatopic
created: 2009-10-22T02:00:00+00:00
modified: 2021-09-30T12:00:00+00:00
broader: escolas

educação contínua
type: Concept
definition: Qualquer forma de educação que vai além da escolaridade básica.
in scheme: mediatopic
created: 2009-10-22T02:00:00+00:00
modified: 2021-09-30T12:00:00+00:00
retired: 2021-09-30T12:00:00+00:00
broader: escolas

educação de adultos
type: Concept
definition: Educação fornecida a estudantes mais velhos do que o grupo usual entre os 5 e os 25 anos.
in scheme: mediatopic
created: 2009-10-22T02:00:00+00:00
modified: 2024-07-01T12:00:00+00:00
broader: escolas

escolas de ensino médio
type: Concept
definition: Educação pré-universitária, entre 15 e 17-18 anos.
in scheme: mediatopic
created: 2009-10-22T02:00:00+00:00
modified: 2021-09-30T12:00:00+00:00
broader: escolas

ensino superior
type: Concept
definition: Educação acima do ensino médio, geralmente fornecida por faculdades e universidades.
in scheme: mediatopic
created: 2009-10-22T02:00:00+00:00
modified: 2021-09-30T12:00:00+00:00
broad match: http://cv.iptc.org/newscodes/subjectcode/05000000
broader: escolas
narrower: faculdade
narrower: universidades

faculdade
type: Concept
definition: Instituição de ensino superior cujo escopo específico é definido de forma diferente consoante o país.
in scheme: mediatopic
created: 2009-10-22T02:00:00+00:00
modified: 2021-09-30T12:00:00+00:00
retired: 2021-09-30T12:00:00+00:00
broad match: http://cv.iptc.org/newscodes/subjectcode/05000000
broader: ensino superior

universidades
type: Concept
definition: Instituições de ensino superior capazes de atribuir grau de doutorado.
in scheme: mediatopic
created: 2009-10-22T02:00:00+00:00
modified: 2021-09-30T12:00:00+00:00
retired: 2021-09-30T12:00:00+00:00
broader: ensino superior

escolas de ensino fundamental, 6ª à 9ª série
type: Concept
definition: Escola de transição, anterior à escola de ensino médio, entre 10 e 15 anos.
in scheme: mediatopic
created: 2009-10-22T02:00:00+00:00
modified: 2021-09-30T12:00:00+00:00
broader: escolas

pré-escolar
type: Concept
definition: Educação para crianças abaixo da idade da escolaridade obrigatória.
in scheme: mediatopic
created: 2009-10-22T02:00:00+00:00
modified: 2021-09-30T12:00:00+00:00
broader: escolas

aprendizagem social
type: Concept
definition: Aprendizagem das competências sociais através dos pais e de outros à medida que o indivíduo cresce.
in scheme: mediatopic
created: 2009-10-22T02:00:00+00:00
modified: 2024-07-01T12:00:00+00:00
broad match: http://cv.iptc.org/newscodes/subjectcode/05008000
broader: educação

ensino/aprendizado
type: Concept
definition: Os dois objetivos da equação escolar: ensinar e aprender.
in scheme: mediatopic
created: 2009-10-22T02:00:00+00:00
modified: 2021-09-30T12:00:00+00:00
retired: 2021-09-30T12:00:00+00:00
broader: educação

currículo
type: Concept
definition: Conjunto dos cursos oferecidos por uma instituição de ensino e regulamentação desses cursos.
in scheme: mediatopic
created: 2009-10-22T02:00:00+00:00
modified: 2021-09-30T12:00:00+00:00
broader: educação

prova
type: Concept
definition: Medição do desempenho do estudante.
in scheme: mediatopic
created: 2009-10-22T02:00:00+00:00
modified: 2021-09-30T12:00:00+00:00
broad match: http://cv.iptc.org/newscodes/subjectcode/05010004
broader: educação

exame de admissão
type: Concept
definition: Exames para entrar em universidades, institutos superiores e outras instituições de ensino.
in scheme: mediatopic
created: 2009-10-22T02:00:00+00:00
modified: 2021-09-30T12:00:00+00:00
broader: educação

alunos
type: Concept
definition: Pessoas de todas as idades em ambiente estruturado, não necessariamente uma sala de aula, para aprender alguma coisa.
in scheme: mediatopic
created: 2009-10-22T02:00:00+00:00
modified: 2021-09-30T12:00:00+00:00
broader: educação

professores
type: Concept
definition: Pessoas dotadas de conhecimento e de meios e técnicas para o transmitir a outros.
in scheme: mediatopic
created: 2009-10-22T02:00:00+00:00
modified: 2021-09-30T12:00:00+00:00
broader: educação

alterações climáticas
type: Concept
definition: Mudança significativa nas medições médias relativas ao clima (como temperatura, precipitação ou vento), que se mantém por um período longo.
in scheme: mediatopic
created: 2009-10-22T02:00:00+00:00
modified: 2025-06-30T12:00:00+00:00
broader: ambiente
narrower: aquecimento global

aquecimento global
type: Concept
definition: Esta categoria inclui todos os assuntos relativos ao aquecimento global, incluindo investigação de temperaturas, sensoriamento remoto de tendências de temperaturas, debate sobre o aquecimento global, formas de reduzir emissões e comércio de carbono.
in scheme: mediatopic
created: 2009-10-22T02:00:00+00:00
modified: 2025-06-30T12:00:00+00:00
retired: 2025-06-30T12:00:00+00:00
broader: alterações climáticas

conservação
type: Concept
definition: Preservação de áreas selvagens, flora e fauna, incluindo extinção de espécies.
in scheme: mediatopic
created: 2009-10-22T02:00:00+00:00
modified: 2025-06-30T12:00:00+00:00
broader: ambiente
narrower: poupança de energia
narrower: parques

poupança de energia
type: Concept
definition: Conservação da eletricidade e de outras fontes de energia.
in scheme: mediatopic
created: 2009-10-22T02:00:00+00:00
modified: 2025-06-30T12:00:00+00:00
retired: 2025-06-30T12:00:00+00:00
broader: conservação

parques
type: Concept
definition: Áreas reservadas para preservação.
in scheme: mediatopic
created: 2009-10-22T02:00:00+00:00
modified: 2025-06-30T12:00:00+00:00
broader: conservação

políticas ambientais
type: Concept
definition: Debate sobre política ambiental.
in scheme: mediatopic
created: 2009-10-22T02:00:00+00:00
modified: 2025-03-31T12:00:00+00:00
broader: política governamental

poluição ambiental
type: Concept
definition: Contaminação de ar, água, terra etc., por substâncias nocivas.
in scheme: mediatopic
created: 2009-10-22T02:00:00+00:00
modified: 2025-10-09T12:00:00+00:00
broader: ambiente
narrower: poluição atmosférica
narrower: limpeza ambiental
narrower: materiais perigosos
narrower: resíduos
narrower: poluição da água

poluição atmosférica
type: Concept
definition: Matéria sólida ou gasosa que afeta a qualidade do ar que respiramos.
in scheme: mediatopic
created: 2009-10-22T02:00:00+00:00
modified: 2025-10-09T12:00:00+00:00
broader: poluição ambiental

limpeza ambiental
type: Concept
definition: Processos através dos quais áreas contaminadas são limpas de materiais perigosos, para que possam ser novamente habitadas por pessoas ou animais.
in scheme: mediatopic
created: 2009-10-22T02:00:00+00:00
modified: 2025-10-09T12:00:00+00:00
broader: poluição ambiental

materiais perigosos
type: Concept
definition: Materiais perigosos para o homem e para os animais quando expostos a eles. Inclui radiação, gases venenosos, químicos, metais pesados, PCB, certos produtos vegetais etc.
in scheme: mediatopic
created: 2009-10-22T02:00:00+00:00
modified: 2025-10-09T12:00:00+00:00
broader: poluição ambiental

resíduos
type: Concept
definition: Impacto ambiental do lixo, incluindo os esforços de reciclagem.
in scheme: mediatopic
created: 2009-10-22T02:00:00+00:00
modified: 2025-10-09T12:00:00+00:00
broader: poluição ambiental

poluição da água
type: Concept
definition: Sólidos ou líquidos que contaminam a qualidade da água que podia ser usada para beber ou regar.
in scheme: mediatopic
created: 2009-10-22T02:00:00+00:00
modified: 2025-10-09T12:00:00+00:00
broader: poluição ambiental

recursos naturais
type: Concept
definition: Questões ambientais relativas à exploração de recursos naturais.
in scheme: mediatopic
created: 2009-10-22T02:00:00+00:00
modified: 2025-06-30T12:00:00+00:00
broader: ambiente
narrower: recursos energéticos
narrower: recursos terrestres
narrower: crescimento demográfico
narrower: energias renováveis
narrower: água

recursos energéticos
type: Concept
definition: Recursos como carvão, gás, vento, luz solar etc., usados para produzir calor, eletricidade e energia.
in scheme: mediatopic
created: 2009-10-22T02:00:00+00:00
modified: 2025-06-30T12:00:00+00:00
retired: 2025-06-30T12:00:00+00:00
broader: recursos naturais

recursos terrestres
type: Concept
definition: Porção de uma nação ou estado que está acima do nível da água e disponível para o desenvolvimento de lucros ou para o bem geral do público.
in scheme: mediatopic
created: 2009-10-22T02:00:00+00:00
modified: 2025-06-30T12:00:00+00:00
retired: 2025-06-30T12:00:00+00:00
broader: recursos naturais

florestas
type: Concept
definition: Zonas abertas arborizadas para divertimento público ou fins comerciais.
in scheme: mediatopic
created: 2009-10-22T02:00:00+00:00
modified: 2025-06-30T12:00:00+00:00
broader: natureza

montanhas
type: Concept
definition: Elevações de terreno, formadas ao longo dos tempos por erosão, erupção vulcânica ou movimento de grandes formações geográficas chamadas placas.
in scheme: mediatopic
created: 2009-10-22T02:00:00+00:00
modified: 2025-06-30T12:00:00+00:00
broader: natureza

crescimento demográfico
type: Concept
definition: As pessoas, seu crescimento e desenvolvimento dentro de seu ambiente natural.
in scheme: mediatopic
created: 2009-10-22T02:00:00+00:00
modified: 2025-06-30T12:00:00+00:00
retired: 2025-06-30T12:00:00+00:00
broader: recursos naturais

energias renováveis
type: Concept
definition: Histórias sobre o impacto ambiental das energias renováveis, incluindo energia solar, eólica, hidrenergia, biomassa e energia geotérmica.
in scheme: mediatopic
created: 2009-10-22T02:00:00+00:00
modified: 2023-03-31T12:00:00+00:00
retired: 2023-03-31T12:00:00+00:00
broader: recursos naturais

água
type: Concept
definition: Questões ambientais sobre massas de água, incluindo oceanos, lagos, ribeiros e reservatórios, mas também gelo, geleiras e formas de precipitação.
in scheme: mediatopic
created: 2009-10-22T02:00:00+00:00
modified: 2021-02-18T12:00:00+00:00
retired: 2025-10-09T12:00:00+00:00
broader: recursos naturais

oceanos
type: Concept
definition: Massas de água salgada que separam continentes ou outras massas geográficas grandes. Inclui formas mais pequenas como mares, lagos ou lagoas.
in scheme: mediatopic
created: 2009-10-22T02:00:00+00:00
modified: 2025-06-30T12:00:00+00:00
broader: natureza

rios
type: Concept
definition: Água corrente limitada por terra, que se estende das nascentes e serpenteia por terra até se unir a outras massas de água. Inclui formas mais pequenas, como afluentes, regatos, ribeirões etc.
in scheme: mediatopic
created: 2009-10-22T02:00:00+00:00
modified: 2025-06-30T12:00:00+00:00
broader: natureza

zonas úmidas
type: Concept
definition: Áreas geralmente pantanosas e que não estão debaixo de água, nem em terra seca. Frequentemente em relação com aquíferos para a qualidade da água e/ou vida selvagem.
in scheme: mediatopic
created: 2009-10-22T02:00:00+00:00
modified: 2025-06-30T12:00:00+00:00
broader: natureza

natureza
type: Concept
definition: O mundo natural em sua totalidade.
in scheme: mediatopic
created: 2009-10-22T02:00:00+00:00
modified: 2025-10-09T12:00:00+00:00
broader: ambiente
narrower: florestas
narrower: montanhas
narrower: oceanos
narrower: rios
narrower: zonas úmidas
narrower: ecossistema
narrower: espécies ameaçadas
narrower: espécie invasora
narrower: animais
narrower: plantas

ecossistema
type: Concept
definition: Sistema de plantas, animais e bactérias inter-relacionados em seu ambiente físico e químico.
in scheme: mediatopic
created: 2009-10-22T02:00:00+00:00
modified: 2025-10-09T12:00:00+00:00
broader: natureza

espécies ameaçadas
type: Concept
definition: Espécies em risco de extinção, em grande parte devido a alterações no ambiente, à caça ou ao clima.
in scheme: mediatopic
created: 2009-10-22T02:00:00+00:00
modified: 2025-10-09T12:00:00+00:00
broader: natureza

espécie invasora
type: Concept
definition: Plantas, animais ou outros organismos não nativos que tendem a sobrepor-se às espécies nativas.
in scheme: mediatopic
created: 2009-10-22T02:00:00+00:00
modified: 2025-10-09T12:00:00+00:00
broader: natureza

doenças e condições
type: Concept
definition: Qualquer condição de saúde lesiva ou destrutiva que afete seres humanos.
in scheme: mediatopic
created: 2009-10-22T02:00:00+00:00
modified: 2022-06-14T12:00:00+00:00
broad match: http://cv.iptc.org/newscodes/subjectcode/07001000
broader: saúde
narrower: câncer
narrower: doenças transmissíveis
narrower: doença cardíaca
narrower: outras doenças
narrower: traumatismos
narrower: condições médicas
narrower: distúrbios mentais e comportamentais
narrower: http://cv.iptc.org/newscodes/mediatopic/20001322
narrower: http://cv.iptc.org/newscodes/mediatopic/20001355

câncer
type: Concept
definition: Doença grave e muitas vezes fatal, com origem na mutação de células normais em tumores.
in scheme: mediatopic
created: 2009-10-22T02:00:00+00:00
modified: 2021-02-18T12:00:00+00:00
broader: doenças e condições

doenças transmissíveis
type: Concept
definition: Doenças que podem ser transmitidas de um indivíduo (pessoa ou animal) a outro.
in scheme: mediatopic
created: 2009-10-22T02:00:00+00:00
modified: 2021-02-18T12:00:00+00:00
broader: doenças e condições
narrower: epidemia
narrower: doenças virais

epidemia
type: Concept
definition: Uma epidemia é uma condição que se espalha rapidamente numa comunidade.
in scheme: mediatopic
created: 2009-10-22T02:00:00+00:00
modified: 2022-06-14T12:00:00+00:00
broad match: http://cv.iptc.org/newscodes/subjectcode/07002000
broader: doenças transmissíveis
narrower: peste
narrower: pandemia

peste
type: Concept
definition: Doença epidêmica altamente infecciosa causada pela bactéria Yersinia pestis.
in scheme: mediatopic
created: 2009-10-22T02:00:00+00:00
modified: 2022-06-14T12:00:00+00:00
retired: 2022-06-14T12:00:00+00:00
broad match: http://cv.iptc.org/newscodes/subjectcode/07002000
broader: epidemia

doenças virais
type: Concept
definition: Doenças causadas por uma infecção das células por vírus.
in scheme: mediatopic
created: 2009-10-22T02:00:00+00:00
modified: 2022-06-14T12:00:00+00:00
broader: doenças transmissíveis
narrower: aids
narrower: retrovírus

aids
type: Concept
definition: Síndrome de Imunodeficiência Adquirida, doença incurável causada pelo vírus da imunodeficiência humana.
in scheme: mediatopic
created: 2009-10-22T02:00:00+00:00
modified: 2022-06-14T12:00:00+00:00
broader: doenças virais

retrovírus
type: Concept
definition: Família de vírus RNA como os que causam leucemia e aids.
in scheme: mediatopic
created: 2009-10-22T02:00:00+00:00
modified: 2022-06-14T12:00:00+00:00
retired: 2022-06-14T12:00:00+00:00
broader: doenças virais

doença cardíaca
type: Concept
definition: Doença degenerativa grave causada pelo estreitamento das artérias que alimentam o coração.
in scheme: mediatopic
created: 2009-10-22T02:00:00+00:00
modified: 2022-06-14T12:00:00+00:00
broader: doenças e condições

outras doenças
type: Concept
definition: Doenças não específicas como dores de estômago, dores de cabeça, pé plano, lumbago.
in scheme: mediatopic
created: 2009-10-22T02:00:00+00:00
modified: 2022-06-14T12:00:00+00:00
retired: 2022-06-14T12:00:00+00:00
broader: doenças e condições

traumatismos
type: Concept
definition: Condição traumática do corpo, geralmente causada por forças externas.
in scheme: mediatopic
created: 2009-10-22T02:00:00+00:00
modified: 2022-06-14T12:00:00+00:00
broader: doenças e condições

condições médicas
type: Concept
definition: Estados de evolução de doenças ou feridas.
in scheme: mediatopic
created: 2009-10-22T02:00:00+00:00
modified: 2024-07-01T12:00:00+00:00
broader: doenças e condições
narrower: obesidade

distúrbios mentais e comportamentais
type: Concept
definition: Doenças e distúrbios que afetam a mente e o comportamento.
in scheme: mediatopic
created: 2009-10-22T02:00:00+00:00
modified: 2022-06-14T12:00:00+00:00
broad match: http://cv.iptc.org/newscodes/subjectcode/07000000
broader: doenças e condições
narrower: transtornos alimentares
narrower: http://cv.iptc.org/newscodes/mediatopic/20001356
narrower: http://cv.iptc.org/newscodes/mediatopic/20001357

transtornos alimentares
type: Concept
definition: Anorexia, bulimia, ingestão abusiva de alimentos e doenças similares.
in scheme: mediatopic
created: 2009-10-22T02:00:00+00:00
modified: 2021-02-18T12:00:00+00:00
broader: distúrbios mentais e comportamentais

obesidade
type: Concept
definition: Condição do peso corporal considerada geralmente 20% acima do normal para o gênero, idade, altura e estrutura óssea.
in scheme: mediatopic
created: 2009-10-22T02:00:00+00:00
modified: 2022-06-14T12:00:00+00:00
broader: condições médicas

estabelecimento de saúde
type: Concept
definition: Instalações usadas para qualquer tipo de cuidados de saúde.
in scheme: mediatopic
created: 2009-10-22T02:00:00+00:00
modified: 2022-06-14T12:00:00+00:00
broad match: http://cv.iptc.org/newscodes/subjectcode/07010000
broader: saúde
narrower: hospitais
narrower: centro de saúde

hospitais
type: Concept
definition: Instalações médicas para o tratamento de doenças e feridas.
in scheme: mediatopic
created: 2009-10-22T02:00:00+00:00
modified: 2021-05-05T12:00:00+00:00
broader: estabelecimento de saúde

organizações de saúde
type: Concept
definition: Organizações de saúde específicas, incluindo associações profissionais, organismos sem fins lucrativos e grupos internacionais.
in scheme: mediatopic
created: 2009-10-22T02:00:00+00:00
modified: 2022-06-14T12:00:00+00:00
broader: saúde

tratamento de saúde
type: Concept
definition: Em geral, tratamento de doenças e de outras condições para gerar bem-estar.
in scheme: mediatopic
created: 2009-10-22T02:00:00+00:00
modified: 2022-06-14T12:00:00+00:00
broader: saúde
narrower: dieta
narrower: fármacos
narrower: medicamentos sujeitos a prescrição médica
narrower: meios complementares de diagnóstico
narrower: medicamento
narrower: condição física
narrower: medicina preventiva
narrower: vacinas
narrower: terapias
narrower: cura de desintoxicação
narrower: serviço de emergência
narrower: cirurgia

dieta
type: Concept
definition: Consumo controlado de comida.
in scheme: mediatopic
created: 2009-10-22T02:00:00+00:00
modified: 2022-06-14T12:00:00+00:00
broader: tratamento de saúde
narrower: suplementos alimentares

suplementos alimentares
type: Concept
definition: Nutrientes que se acrescentam à alimentação para fortalecer a saúde.
in scheme: mediatopic
created: 2009-10-22T02:00:00+00:00
modified: 2022-06-14T12:00:00+00:00
broader: dieta

fármacos
type: Concept
definition: Substâncias químicas usadas no diagnóstico, tratamento ou prevenção de doenças físicas e mentais.
in scheme: mediatopic
created: 2009-10-22T02:00:00+00:00
modified: 2022-06-14T12:00:00+00:00
broad match: http://cv.iptc.org/newscodes/subjectcode/07000000
broader: tratamento de saúde

medicamentos sujeitos a prescrição médica
type: Concept
definition: Medicamentos que só podem ser comprados com autorização médica.
in scheme: mediatopic
created: 2009-10-22T02:00:00+00:00
modified: 2022-06-14T12:00:00+00:00
broader: tratamento de saúde

meios complementares de diagnóstico
type: Concept
definition: Variedade de tratamentos, como testes de estresse, cateterização, exames de sangue, tomografia computadorizada, ressonância magnética etc.
in scheme: mediatopic
created: 2009-10-22T02:00:00+00:00
modified: 2022-06-14T12:00:00+00:00
broader: tratamento de saúde

medicamento
type: Concept
definition: Substância administrada com intenção de eliminar uma afecção ou doença.
in scheme: mediatopic
created: 2009-10-22T02:00:00+00:00
modified: 2022-06-14T12:00:00+00:00
broader: tratamento de saúde
narrower: fitoterapia
narrower: medicina holística
narrower: medicina tradicional chinesa
narrower: medicina ocidental

fitoterapia
type: Concept
definition: Tratamento baseado no uso de ervas e de outras plantas para curar ou aliviar sintomas de doença.
in scheme: mediatopic
created: 2009-10-22T02:00:00+00:00
modified: 2022-06-14T12:00:00+00:00
broader: medicamento

medicina holística
type: Concept
definition: Tratamento da pessoa como um todo, incluindo fatores mentais e sociais, e não somente os sintomas da doença.
in scheme: mediatopic
created: 2009-10-22T02:00:00+00:00
modified: 2022-06-14T12:00:00+00:00
broader: medicamento

medicina tradicional chinesa
type: Concept
definition: Prática de diagnóstico, tratamento e prevenção de doenças baseada em métodos tradicionais desenvolvidos no oriente.
in scheme: mediatopic
created: 2009-10-22T02:00:00+00:00
modified: 2022-06-14T12:00:00+00:00
broader: medicamento

medicina ocidental
type: Concept
definition: Prática de diagnóstico, tratamento e prevenção de doenças baseada na investigação científica moderna do hemisfério ocidental.
in scheme: mediatopic
created: 2009-10-22T02:00:00+00:00
modified: 2022-06-14T12:00:00+00:00
broader: medicamento

condição física
type: Concept
definition: Capacidade do corpo de funcionar de forma eficiente e eficaz durante as atividades de trabalho e lazer.
in scheme: mediatopic
created: 2009-10-22T02:00:00+00:00
modified: 2022-06-14T12:00:00+00:00
retired: 2022-06-14T12:00:00+00:00
broader: tratamento de saúde

medicina preventiva
type: Concept
definition: Medidas destinadas a manter uma boa saúde e a prevenir a ocorrência ou agravamento de doenças e afecções.
in scheme: mediatopic
created: 2009-10-22T02:00:00+00:00
modified: 2022-06-14T12:00:00+00:00
retired: 2022-06-14T12:00:00+00:00
broader: tratamento de saúde

vacinas
type: Concept
definition: Medicamentos desenvolvidos para criar imunidade a doenças.
in scheme: mediatopic
created: 2009-10-22T02:00:00+00:00
modified: 2022-06-14T12:00:00+00:00
broader: tratamento de saúde

terapias
type: Concept
definition: Tratamento de condições físicas, mentais ou médicas através de meios não cirúrgicos.
in scheme: mediatopic
created: 2009-10-22T02:00:00+00:00
modified: 2021-02-18T12:00:00+00:00
broader: tratamento de saúde

política de saúde
type: Concept
definition: Decisões políticas relativas à saúde, incluindo o que diferentes países estão a fazer em relação à prescrição de medicamentos, aids, cuidados psiquiátricos, financiamento da assistência médica e tópicos relacionados.
in scheme: mediatopic
created: 2009-10-22T02:00:00+00:00
modified: 2025-03-31T12:00:00+00:00
broader: política governamental

sistema público de saúde
type: Concept
definition: Cuidados de saúde fornecidos pelos governos nacionais.
in scheme: mediatopic
created: 2009-10-22T02:00:00+00:00
modified: 2022-06-14T12:00:00+00:00
broader: saúde
narrower: Medicaid
narrower: Medicare

Medicaid
type: Concept
definition: Programa do governo norte-americano para fornecer cuidados de saúde a cidadãos necessitados de todas as idades.
in scheme: mediatopic
created: 2009-10-22T02:00:00+00:00
modified: 2021-02-18T12:00:00+00:00
retired: 2014-06-02T12:00:00+00:00
broader: sistema público de saúde

Medicare
type: Concept
definition: Programa do governo norte-americano para fornecer cuidados de saúde a cidadãos idosos.
in scheme: mediatopic
created: 2009-10-22T02:00:00+00:00
modified: 2021-02-18T12:00:00+00:00
retired: 2014-06-02T12:00:00+00:00
broader: sistema público de saúde

seguro de saúde
type: Concept
definition: Seguro que cobre custos médicos extraordinários.
in scheme: mediatopic
created: 2009-10-22T02:00:00+00:00
modified: 2022-06-14T12:00:00+00:00
broader: saúde

sistemas privados de saúde
type: Concept
definition: Cuidados de saúde fornecidos por organizações de fundos ou seguros privados.
in scheme: mediatopic
created: 2009-10-22T02:00:00+00:00
modified: 2022-06-14T12:00:00+00:00
broader: saúde

profissão médica
type: Concept
definition: Profissão que requer formação formal no estudo, diagnóstico, tratamento, cuidado e prevenção de doenças, condições médicas ou lesões.
in scheme: mediatopic
created: 2009-10-22T02:00:00+00:00
modified: 2022-06-14T12:00:00+00:00
broad match: http://cv.iptc.org/newscodes/subjectcode/07006000
broader: saúde
narrower: serviços médicos
narrower: especialização médica
narrower: profissionais de saúde

serviços médicos
type: Concept
definition: Serviços de apoio a médicos, incluindo exames de sangue e outros testes individuais, raios X, tomografias computadorizadas, ressonâncias magnéticas etc.
in scheme: mediatopic
created: 2009-10-22T02:00:00+00:00
modified: 2022-06-14T12:00:00+00:00
broader: profissão médica

especialização médica
type: Concept
definition: Diferentes áreas de especialidade médica.
in scheme: mediatopic
created: 2009-10-22T02:00:00+00:00
modified: 2022-06-14T12:00:00+00:00
broader: profissão médica
narrower: geriatria
narrower: obstetrícia/ginecologia
narrower: pediatria
narrower: medicina reprodutiva
narrower: medicina dentária
narrower: farmacologia
narrower: medicina veterinária
narrower: medicina de família e comunidade
narrower: ortopedia
narrower: oncologia
narrower: radiologia
narrower: oftalmologia
narrower: medicina cirúrgica
narrower: psiquiatria

geriatria
type: Concept
definition: Especialidade que trata de questões de idade e de envelhecimento, incluindo doenças relacionadas com a idade, investigação médica e tendências.
in scheme: mediatopic
created: 2009-10-22T02:00:00+00:00
modified: 2022-06-14T12:00:00+00:00
retired: 2022-06-14T12:00:00+00:00
broader: especialização médica

obstetrícia/ginecologia
type: Concept
definition: Especialidade que se ocupa dos órgãos reprodutores femininos.
in scheme: mediatopic
created: 2009-10-22T02:00:00+00:00
modified: 2022-06-14T12:00:00+00:00
retired: 2022-06-14T12:00:00+00:00
broader: especialização médica

pediatria
type: Concept
definition: Especialidade médica para os jovens - inclui bebês prematuros, cuidados infantis, doenças de crianças e seu tratamento – e ainda problemas de saúde e de comportamento de adolescentes.
in scheme: mediatopic
created: 2009-10-22T02:00:00+00:00
modified: 2022-06-14T12:00:00+00:00
broader: especialização médica

medicina reprodutiva
type: Concept
definition: Especialidade das tecnologias de reprodução como a fertilização in vitro.
in scheme: mediatopic
created: 2009-10-22T02:00:00+00:00
modified: 2022-06-14T12:00:00+00:00
retired: 2022-06-14T12:00:00+00:00
broad match: http://cv.iptc.org/newscodes/subjectcode/07014003
broader: especialização médica

profissionais de saúde
type: Concept
definition: Médicos, enfermeiros e outros profissionais que trabalham em instalações médicas.
in scheme: mediatopic
created: 2009-10-22T02:00:00+00:00
modified: 2021-05-05T12:00:00+00:00
broader: profissão médica

doenças não humanas
type: Concept
definition: Qualquer condição de saúde lesiva ou destrutiva que afete animais, plantas ou microrganismos.
in scheme: mediatopic
created: 2009-10-22T02:00:00+00:00
modified: 2022-06-14T12:00:00+00:00
retired: 2022-06-14T12:00:00+00:00
broad match: http://cv.iptc.org/newscodes/subjectcode/07001000
broader: saúde

doenças dos animais
type: Concept
definition: Doenças que afetam os animais.
in scheme: mediatopic
created: 2009-10-22T02:00:00+00:00
modified: 2025-10-09T12:00:00+00:00
broader: animais

doenças das plantas
type: Concept
definition: Doenças que afetam as plantas, causadas por parasitas ou fatores ambientais.
in scheme: mediatopic
created: 2009-10-22T02:00:00+00:00
modified: 2025-10-09T12:00:00+00:00
broader: plantas

feitos
type: Concept
definition: Conquistas de indivíduos ou grupos, animais, plantas ou outros objetos, como ganhar uma competição etc.
in scheme: mediatopic
created: 2009-10-22T02:00:00+00:00
modified: 2021-05-05T12:00:00+00:00
retired: 2021-05-05T12:00:00+00:00
broader: interesse humano

prêmios e galardões
type: Concept
definition: Condecorações, prêmios e recompensas, incluindo os que são atribuídos pelo governo.
in scheme: mediatopic
created: 2009-10-22T02:00:00+00:00
modified: 2021-05-05T12:00:00+00:00
broader: interesse humano

recordes e proezas
type: Concept
definition: Proeza não esportiva, realizada por um indivíduo ou por um grupo, que estabelece um novo recorde, como o maior número de livros lidos, respiração sustida durante mais tempo etc.
in scheme: mediatopic
created: 2009-10-22T02:00:00+00:00
modified: 2021-05-05T12:00:00+00:00
broader: interesse humano

animais
type: Concept
definition: Itens sobre animais, com foco em facetas emocionais.
in scheme: mediatopic
created: 2009-10-22T02:00:00+00:00
modified: 2025-10-09T12:00:00+00:00
broader: natureza
narrower: doenças dos animais
narrower: pragas

cerimônia
type: Concept
definition: Rituais de natureza não religiosa, como cerimônias de consagração, deposição de coroa de flores, lançamento de barcos etc.
in scheme: mediatopic
created: 2009-10-22T02:00:00+00:00
modified: 2021-05-05T12:00:00+00:00
broader: interesse humano
narrower: cerimônia de batismo
narrower: formatura
narrower: funeral e serviço fúnebre
narrower: casamento

pessoas
type: Concept
definition: Indivíduos ou grupos, com foco em facetas emocionais.
in scheme: mediatopic
created: 2009-10-22T02:00:00+00:00
modified: 2021-02-18T12:00:00+00:00
retired: 2021-05-05T12:00:00+00:00
broader: interesse humano

desaires
type: Concept
definition: Erros humanos idiotas ou estúpidos.
in scheme: mediatopic
created: 2009-10-22T02:00:00+00:00
modified: 2021-05-12T12:00:00+00:00
broader: interesse humano

alta sociedade
type: Concept
definition: Vida e comportamento de pessoas conhecidas.
in scheme: mediatopic
created: 2009-10-22T02:00:00+00:00
modified: 2021-05-05T12:00:00+00:00
broader: interesse humano
narrower: realeza

celebridades
type: Concept
definition: Vida e comportamento de pessoas famosas.
in scheme: mediatopic
created: 2009-10-22T02:00:00+00:00
modified: 2021-05-05T12:00:00+00:00
broader: interesse humano

realeza
type: Concept
definition: Notícias sobre membros de famílias reais e imperiais, incluindo assuntos de sistemas legais.
in scheme: mediatopic
created: 2009-10-22T02:00:00+00:00
modified: 2021-05-05T12:00:00+00:00
broader: alta sociedade

plantas
type: Concept
definition: Itens sobre plantas, com foco em facetas emocionais.
in scheme: mediatopic
created: 2009-10-22T02:00:00+00:00
modified: 2025-10-09T12:00:00+00:00
broader: natureza
narrower: doenças das plantas

emprego
type: Concept
definition: Trabalho para uma organização, para um indivíduo ou por conta própria, incluindo trabalho voluntário.
in scheme: mediatopic
created: 2009-10-22T02:00:00+00:00
modified: 2021-02-18T12:00:00+00:00
broader: trabalho
narrower: migração pendular
narrower: estagiários e aprendizes
narrower: trabalho infantil
narrower: empregado
narrower: empregador
narrower: formação profissional
narrower: ocupações
narrower: salários e benefícios
narrower: trabalho autônomo
narrower: licença parental
narrower: voluntariado

estagiários e aprendizes
type: Concept
definition: Pessoas que fazem parte de uma força de trabalho em nível inicial, aprendendo a profissão sob a direção de alguém.
in scheme: mediatopic
created: 2009-10-22T02:00:00+00:00
modified: 2021-02-18T12:00:00+00:00
broader: emprego

trabalho infantil
type: Concept
definition: Trabalho de crianças, geralmente com menos de 18 anos.
in scheme: mediatopic
created: 2009-10-22T02:00:00+00:00
modified: 2021-02-18T12:00:00+00:00
broader: emprego

empregado
type: Concept
definition: Pessoa que troca seu tempo, talento e capacidades por dinheiro e outros benefícios.
in scheme: mediatopic
created: 2009-10-22T02:00:00+00:00
modified: 2021-02-18T12:00:00+00:00
broader: emprego

empregador
type: Concept
definition: Pessoa que emprega trabalhadores e paga salários e outros benefícios.
in scheme: mediatopic
created: 2009-10-22T02:00:00+00:00
modified: 2021-02-18T12:00:00+00:00
broader: emprego

formação profissional
type: Concept
definition: Aprendizagem de competências para o emprego.
in scheme: mediatopic
created: 2009-10-22T02:00:00+00:00
modified: 2021-02-18T12:00:00+00:00
broad match: http://cv.iptc.org/newscodes/subjectcode/09003000
broader: emprego
narrower: formação avançada
narrower: reconversão

formação avançada
type: Concept
definition: Formação adicional para melhorar as competências atuais.
in scheme: mediatopic
created: 2009-10-22T02:00:00+00:00
modified: 2021-05-05T12:00:00+00:00
retired: 2019-10-07T12:00:00+00:00
broader: formação profissional

reconversão
type: Concept
definition: Dotar um trabalhador de novos conhecimentos e competências quando os antigos já não são aplicáveis.
in scheme: mediatopic
created: 2009-10-22T02:00:00+00:00
modified: 2021-02-18T12:00:00+00:00
retired: 2019-10-07T12:00:00+00:00
broader: formação profissional

ocupações
type: Concept
definition: Em geral, ofício, profissão ou negócio, embora as profissões sejam geralmente coisas como advogados e médicos e as ocupações sejam algo como funcionários administrativos ou caminhoneiros.
in scheme: mediatopic
created: 2009-10-22T02:00:00+00:00
modified: 2021-02-18T12:00:00+00:00
retired: 2019-10-07T12:00:00+00:00
broader: emprego

salários e benefícios
type: Concept
definition: Remuneração laboral.
in scheme: mediatopic
created: 2009-10-22T02:00:00+00:00
modified: 2021-02-18T12:00:00+00:00
broad match: http://cv.iptc.org/newscodes/subjectcode/09011001
broader: emprego
narrower: benefícios trabalhistas
narrower: seguridade social
narrower: http://cv.iptc.org/newscodes/mediatopic/20001375

benefícios trabalhistas
type: Concept
definition: Benefícios fornecidos a um funcionário por uma empresa, como contribuições para o regime de pensões, seguro de saúde.
in scheme: mediatopic
created: 2009-10-22T02:00:00+00:00
modified: 2021-02-18T12:00:00+00:00
retired: 2019-10-07T12:00:00+00:00
broader: salários e benefícios

seguridade social
type: Concept
definition: Dinheiro entregue pelo indivíduo e pelas empresas para uma conta do governo para ser pago quando esse indivíduo atinge uma certa idade.
in scheme: mediatopic
created: 2009-10-22T02:00:00+00:00
modified: 2021-02-18T12:00:00+00:00
broader: salários e benefícios

legislação trabalhista
type: Concept
definition: Leis que regem o trabalho.
in scheme: mediatopic
created: 2009-10-22T02:00:00+00:00
modified: 2021-02-18T12:00:00+00:00
broad match: http://cv.iptc.org/newscodes/subjectcode/09005000
broader: trabalho
narrower: higiene e segurança no trabalho

higiene e segurança no trabalho
type: Concept
definition: Regras e procedimentos para garantir a saúde dos trabalhadores.
in scheme: mediatopic
created: 2009-10-22T02:00:00+00:00
modified: 2021-02-18T12:00:00+00:00
broader: legislação trabalhista

mercado de trabalho
type: Concept
definition: Parte da população que está trabalhando ou que está procurando trabalho.
in scheme: mediatopic
created: 2009-10-22T02:00:00+00:00
modified: 2021-02-18T12:00:00+00:00
broader: trabalho
narrower: economia sob demanda

relações trabalhistas
type: Concept
definition: Intercâmbio entre administração e empregados.
in scheme: mediatopic
created: 2009-10-22T02:00:00+00:00
modified: 2021-02-18T12:00:00+00:00
broad match: http://cv.iptc.org/newscodes/subjectcode/09012000
broader: trabalho
narrower: contratos coletivos
narrower: conflitos trabalhistas

contratos coletivos
type: Concept
definition: Contratos geralmente escritos que cobrem uma classe específica de trabalhadores.
in scheme: mediatopic
created: 2009-10-22T02:00:00+00:00
modified: 2021-02-18T12:00:00+00:00
broader: relações trabalhistas
narrower: questões contratuais de saúde
narrower: questões contratuais de salário
narrower: questões contratuais trabalhistas

questões contratuais de saúde
type: Concept
definition: Elementos e discussões contratuais sobre questões de cuidados de saúde.
in scheme: mediatopic
created: 2009-10-22T02:00:00+00:00
modified: 2021-05-05T12:00:00+00:00
retired: 2019-10-07T12:00:00+00:00
broader: contratos coletivos

questões contratuais de salário
type: Concept
definition: Elementos e discussões contratuais sobre remuneração.
in scheme: mediatopic
created: 2009-10-22T02:00:00+00:00
modified: 2021-05-05T12:00:00+00:00
retired: 2019-10-07T12:00:00+00:00
broader: contratos coletivos

questões contratuais trabalhistas
type: Concept
definition: Elementos e discussões contratuais sobre regras relacionadas com questões como almoço e outras pausas, turnos, marcação de férias, antiguidade, licença por doença etc.
in scheme: mediatopic
created: 2009-10-22T02:00:00+00:00
modified: 2021-02-18T12:00:00+00:00
retired: 2019-10-07T12:00:00+00:00
broader: contratos coletivos

conflitos trabalhistas
type: Concept
definition: Diferenças de opinião sobre condições de trabalho, salário etc.
in scheme: mediatopic
created: 2009-10-22T02:00:00+00:00
modified: 2021-02-18T12:00:00+00:00
broader: relações trabalhistas
narrower: greve

greve
type: Concept
definition: Ação por parte dos empregados que envolve paralisação de atividade laboral.
in scheme: mediatopic
created: 2009-10-22T02:00:00+00:00
modified: 2021-02-18T12:00:00+00:00
broader: conflitos trabalhistas

aposentadoria
type: Concept
definition: Os anos após o período ativo de trabalho.
in scheme: mediatopic
created: 2009-10-22T02:00:00+00:00
modified: 2021-02-18T12:00:00+00:00
broader: trabalho
narrower: reforma pensionária

reforma pensionária
type: Concept
definition: Pagamentos a uma pessoa aposentada.
in scheme: mediatopic
created: 2009-10-22T02:00:00+00:00
modified: 2021-02-18T12:00:00+00:00
broad match: http://cv.iptc.org/newscodes/subjectcode/09006000
broader: aposentadoria

desemprego
type: Concept
definition: Fato de não ter trabalho, sendo capaz de trabalhar.
in scheme: mediatopic
created: 2009-10-22T02:00:00+00:00
modified: 2021-02-18T12:00:00+00:00
broader: trabalho
narrower: demissões
narrower: seguro-desemprego

demissões
type: Concept
definition: Redução da força de trabalho de uma empresa, através de despedimento por alteração de fatores econômicos.
in scheme: mediatopic
created: 2009-10-22T02:00:00+00:00
modified: 2021-02-18T12:00:00+00:00
retired: 2019-10-07T12:00:00+00:00
broader: desemprego

seguro-desemprego
type: Concept
definition: Compensação monetária paga aos desempregados.
in scheme: mediatopic
created: 2009-10-22T02:00:00+00:00
modified: 2021-02-18T12:00:00+00:00
broad match: http://cv.iptc.org/newscodes/subjectcode/09009000
broader: desemprego

sindicatos
type: Concept
definition: Grupos estabelecidos para representar classes de trabalhadores.
in scheme: mediatopic
created: 2009-10-22T02:00:00+00:00
modified: 2021-02-18T12:00:00+00:00
broader: trabalho

lazer
type: Concept
definition: Atividades desenvolvidas no tempo livre e de forma não competitiva.
in scheme: mediatopic
created: 2009-10-22T02:00:00+00:00
modified: 2021-02-18T12:00:00+00:00
broad match: http://cv.iptc.org/newscodes/subjectcode/10010000
broader: estilo de vida e lazer
narrower: clubes e associações
narrower: jogos
narrower: jogos e loterias
narrower: passatempo
narrower: férias
narrower: lugar de lazer
narrower: atividades recreativas ao ar livre
narrower: viagens e turismo

clubes e associações
type: Concept
definition: Organizações a que as pessoas aderem por partilharem interesses similares.
in scheme: mediatopic
created: 2009-10-22T02:00:00+00:00
modified: 2021-02-18T12:00:00+00:00
broader: lazer

jogos
type: Concept
definition: Competição, geralmente para divertimento próprio.
in scheme: mediatopic
created: 2009-10-22T02:00:00+00:00
modified: 2021-02-18T12:00:00+00:00
broader: lazer
narrower: jogo de tabuleiro
narrower: jogo de cartas
narrower: jogo de crianças
narrower: jogo de dados
narrower: jogo de exterior
narrower: quebra-cabeça
narrower: jogo de peças
narrower: jogo eletrônico

jogo de tabuleiro
type: Concept
definition: Jogo praticado num tabuleiro.
in scheme: mediatopic
created: 2009-10-22T02:00:00+00:00
modified: 2021-02-18T12:00:00+00:00
broad match: http://cv.iptc.org/newscodes/subjectcode/10001000
broader: jogos

jogo de cartas
type: Concept
definition: Jogo praticado com um baralho de cartas.
in scheme: mediatopic
created: 2009-10-22T02:00:00+00:00
modified: 2021-02-18T12:00:00+00:00
broad match: http://cv.iptc.org/newscodes/subjectcode/10001000
broader: jogos

jogo de crianças
type: Concept
definition: Jogo geralmente destinado a e maioritariamente praticado por crianças.
in scheme: mediatopic
created: 2009-10-22T02:00:00+00:00
modified: 2021-04-09T12:00:00+00:00
broad match: http://cv.iptc.org/newscodes/subjectcode/10001000
broader: jogos

jogo de dados
type: Concept
definition: Jogo praticado só com dados.
in scheme: mediatopic
created: 2009-10-22T02:00:00+00:00
modified: 2021-02-18T12:00:00+00:00
broad match: http://cv.iptc.org/newscodes/subjectcode/10001000
broader: jogos

jogo de exterior
type: Concept
definition: Jogo praticado num espaço aberto.
in scheme: mediatopic
created: 2009-10-22T02:00:00+00:00
modified: 2021-02-18T12:00:00+00:00
broad match: http://cv.iptc.org/newscodes/subjectcode/10001000
broader: jogos

quebra-cabeça
type: Concept
definition: Jogo de entretenimento que consiste na resolução de um problema lógico.
in scheme: mediatopic
created: 2009-10-22T02:00:00+00:00
modified: 2021-02-18T12:00:00+00:00
broad match: http://cv.iptc.org/newscodes/subjectcode/10001000
broader: jogos

jogo de peças
type: Concept
definition: Jogo praticado com peças.
in scheme: mediatopic
created: 2009-10-22T02:00:00+00:00
modified: 2021-02-18T12:00:00+00:00
broad match: http://cv.iptc.org/newscodes/subjectcode/10001000
broader: jogos

jogo eletrônico
type: Concept
definition: Jogo praticado numa tela de televisão ou num monitor.
in scheme: mediatopic
created: 2009-10-22T02:00:00+00:00
modified: 2021-02-18T12:00:00+00:00
broad match: http://cv.iptc.org/newscodes/subjectcode/10001000
broader: jogos

jogos e loterias
type: Concept
definition: Jogos de azar, que envolvem frequentemente a seleção de um conjunto de números que se espera que sejam sorteados.
in scheme: mediatopic
created: 2009-10-22T02:00:00+00:00
modified: 2021-02-18T12:00:00+00:00
broader: lazer

passatempo
type: Concept
definition: Atividades para entretenimento.
in scheme: mediatopic
created: 2009-10-22T02:00:00+00:00
modified: 2021-02-18T12:00:00+00:00
broader: lazer
narrower: entusiasmo automobilístico
narrower: interesse por bicicletas
narrower: interesse gastronômico
narrower: interesse por motas
narrower: colecionismo

férias
type: Concept
definition: Tempo de descanso e relaxamento passado fora do trabalho.
in scheme: mediatopic
created: 2009-10-22T02:00:00+00:00
modified: 2021-02-18T12:00:00+00:00
broad match: http://cv.iptc.org/newscodes/subjectcode/10005000
broader: lazer
narrower: feriado
narrower: Dia das Bruxas

feriado
type: Concept
definition: Dia de celebração declarado por um governo.
in scheme: mediatopic
created: 2009-10-22T02:00:00+00:00
modified: 2021-02-18T12:00:00+00:00
broader: férias
narrower: festa de solstício de verão
narrower: feriado nacional
narrower: Dia de Ano Novo

lugar de lazer
type: Concept
definition: Lugar onde as pessoas vão para entretenimento ou diversão.
in scheme: mediatopic
created: 2009-10-22T02:00:00+00:00
modified: 2021-05-05T12:00:00+00:00
broad match: http://cv.iptc.org/newscodes/subjectcode/10000000
broader: lazer
narrower: parque de diversões
narrower: bar
narrower: café
narrower: casa noturna
narrower: restaurante
narrower: instalações esportivas
narrower: jardim zoológico
narrower: http://cv.iptc.org/newscodes/mediatopic/20001392

parque de diversões
type: Concept
definition: Parque que oferece várias atrações de entretenimento para adultos e crianças, incluindo parques temáticos.
in scheme: mediatopic
created: 2009-10-22T02:00:00+00:00
modified: 2021-02-18T12:00:00+00:00
broad match: http://cv.iptc.org/newscodes/subjectcode/10000000
broader: lugar de lazer

bar
type: Concept
definition: Estabelecimento comercial onde são preparadas e servidas ao público bebidas para consumo no local.
in scheme: mediatopic
created: 2009-10-22T02:00:00+00:00
modified: 2021-02-18T12:00:00+00:00
broad match: http://cv.iptc.org/newscodes/subjectcode/10000000
broader: lugar de lazer

café
type: Concept
definition: Pequeno estabelecimento onde são preparadas e servidas ao público bebidas e refeições ligeiras – a sua especificidade pode depender da cultura local.
in scheme: mediatopic
created: 2009-10-22T02:00:00+00:00
modified: 2021-02-18T12:00:00+00:00
broad match: http://cv.iptc.org/newscodes/subjectcode/10000000
broader: lugar de lazer

casa noturna
type: Concept
definition: Estabelecimento comercial que fornece música e outras formas de entretenimento, assim como comida e bebida, a uma clientela seleta.
in scheme: mediatopic
created: 2009-10-22T02:00:00+00:00
modified: 2021-02-18T12:00:00+00:00
broader: lugar de lazer

restaurante
type: Concept
definition: Estabelecimento onde são preparadas e servidas ao público refeições.
in scheme: mediatopic
created: 2009-10-22T02:00:00+00:00
modified: 2021-02-18T12:00:00+00:00
broad match: http://cv.iptc.org/newscodes/subjectcode/10000000
broader: lugar de lazer

instalações esportivas
type: Concept
definition: Pavilhões, estádios ou recintos onde têm lugar eventos esportivos.
in scheme: mediatopic
created: 2009-10-22T02:00:00+00:00
modified: 2021-02-18T12:00:00+00:00
retired: 2021-02-18T12:00:00+00:00
broad match: http://cv.iptc.org/newscodes/subjectcode/10000000
broader: lugar de lazer

atividades recreativas ao ar livre
type: Concept
definition: Atividades de lazer ao ar livre, habitualmente em ambientes naturais.
in scheme: mediatopic
created: 2009-10-22T02:00:00+00:00
modified: 2021-02-18T12:00:00+00:00
broad match: http://cv.iptc.org/newscodes/subjectcode/10000000
broader: lazer
narrower: pesca
narrower: caça
narrower: mergulho
narrower: montanhismo
narrower: equitação

pesca
type: Concept
definition: Atividade que envolve o uso de isca, chamariz, armas ou armadilhas na captura de espécies aquáticas.
in scheme: mediatopic
created: 2009-10-22T02:00:00+00:00
modified: 2021-02-18T12:00:00+00:00
broader: atividades recreativas ao ar livre

caça
type: Concept
definition: Atividade que envolve o uso de armas ou de armadilhas na captura de animais.
in scheme: mediatopic
created: 2009-10-22T02:00:00+00:00
modified: 2021-02-18T12:00:00+00:00
broader: atividades recreativas ao ar livre

viagens e turismo
type: Concept
definition: Viajar para passar um tempo fora de casa em busca de recreação, relaxamento ou prazer.
in scheme: mediatopic
created: 2009-10-22T02:00:00+00:00
modified: 2021-02-18T12:00:00+00:00
broad match: http://cv.iptc.org/newscodes/subjectcode/10000000
broader: lazer
narrower: turismo

turismo
type: Concept
definition: Viagens de lazer que envolvem visitas a vários locais e/ou países durante um período prolongado, frequentemente em grupos organizados.
in scheme: mediatopic
created: 2009-10-22T02:00:00+00:00
modified: 2021-02-18T12:00:00+00:00
retired: 2019-07-22T12:00:00+00:00
broader: viagens e turismo

estilo de vida
type: Concept
definition: Modo de vida de uma pessoa, incluindo seu estilo e posses.
in scheme: mediatopic
created: 2009-10-22T02:00:00+00:00
modified: 2021-02-18T12:00:00+00:00
broad match: http://cv.iptc.org/newscodes/subjectcode/10000000
broader: estilo de vida e lazer
narrower: alimentos biológicos
narrower: casa e decoração
narrower: tendências
narrower: festa
narrower: http://cv.iptc.org/newscodes/mediatopic/20001391

entusiasmo automobilístico
type: Concept
definition: Interesse por carros novos e clássicos.
in scheme: mediatopic
created: 2009-10-22T02:00:00+00:00
modified: 2021-02-18T12:00:00+00:00
broad match: http://cv.iptc.org/newscodes/subjectcode/10000000
broader: passatempo

interesse por bicicletas
type: Concept
definition: Interesse por bicicletas novas e clássicas.
in scheme: mediatopic
created: 2009-10-22T02:00:00+00:00
modified: 2021-02-18T12:00:00+00:00
broad match: http://cv.iptc.org/newscodes/subjectcode/10000000
broader: passatempo

interesse gastronômico
type: Concept
definition: Interesse por comidas e bebidas.
in scheme: mediatopic
created: 2009-10-22T02:00:00+00:00
modified: 2021-02-18T12:00:00+00:00
broad match: http://cv.iptc.org/newscodes/subjectcode/10000000
broader: passatempo
narrower: cozinhar
narrower: cerveja, vinho e bebidas espirituosas

alimentos biológicos
type: Concept
definition: Alimentos produzidos sem uso de fertilizantes artificiais ou compostos químicos.
in scheme: mediatopic
created: 2009-10-22T02:00:00+00:00
modified: 2021-02-18T12:00:00+00:00
broader: estilo de vida

casa e decoração
type: Concept
definition: Interesse por cuidar e por decorar a casa.
in scheme: mediatopic
created: 2009-10-22T02:00:00+00:00
modified: 2021-02-18T12:00:00+00:00
broad match: http://cv.iptc.org/newscodes/subjectcode/10000000
broader: estilo de vida
narrower: reforma de casas
narrower: decoração de interiores
narrower: jardinagem

interesse por motas
type: Concept
definition: Interesse por motas novas e clássicas.
in scheme: mediatopic
created: 2009-10-22T02:00:00+00:00
modified: 2021-05-05T12:00:00+00:00
broad match: http://cv.iptc.org/newscodes/subjectcode/10000000
broader: passatempo

tendências
type: Concept
definition: Interesse pelo que se considera popular ou na moda em determinado momento.
in scheme: mediatopic
created: 2009-10-22T02:00:00+00:00
modified: 2021-02-18T12:00:00+00:00
broad match: http://cv.iptc.org/newscodes/subjectcode/10000000
broader: estilo de vida
narrower: modificação corporal

eleições
type: Concept
definition: Seleção de representantes por votação.
in scheme: mediatopic
created: 2009-10-22T02:00:00+00:00
modified: 2024-09-26T12:00:00+00:00
broader: política
narrower: iniciativa dos cidadãos e revocação
narrower: sistema eleitoral
narrower: eleições intergovernamentais
narrower: eleições locais
narrower: eleições nacionais
narrower: campanhas políticas
narrower: financiamento de campanhas
narrower: candidatos políticos
narrower: eleições primárias
narrower: referendo
narrower: eleições regionais
narrower: votação
narrower: eleições na Igreja
narrower: debates políticos
narrower: http://cv.iptc.org/newscodes/mediatopic/20001380
narrower: http://cv.iptc.org/newscodes/mediatopic/20001381
narrower: http://cv.iptc.org/newscodes/mediatopic/20001382

iniciativa dos cidadãos e revocação
type: Concept
definition: Sugestões políticas de membros ou organismos não governamentais para corrigir uma ação ou para fazer mudanças nas regras e regulações existentes.
in scheme: mediatopic
created: 2009-10-22T02:00:00+00:00
modified: 2021-05-12T12:00:00+00:00
broader: eleições

sistema eleitoral
type: Concept
definition: Sistemas de votação.
in scheme: mediatopic
created: 2009-10-22T02:00:00+00:00
modified: 2024-09-26T12:00:00+00:00
broad match: http://cv.iptc.org/newscodes/subjectcode/11000000
broader: eleições

eleições intergovernamentais
type: Concept
definition: Escolha de indivíduos para a chefia de uma organização internacional, como Nações Unidas, União Europeia, OTAN ou Banco Mundial.
in scheme: mediatopic
created: 2009-10-22T02:00:00+00:00
modified: 2021-07-12T12:00:00+00:00
broad match: http://cv.iptc.org/newscodes/subjectcode/11000000
broader: eleições

eleições locais
type: Concept
definition: Escolha de pessoas para o governo a nível básico, seja cidade, vila ou município.
in scheme: mediatopic
created: 2009-10-22T02:00:00+00:00
modified: 2021-07-12T12:00:00+00:00
broader: eleições

eleições nacionais
type: Concept
definition: Escolha de pessoas para o governo a nível nacional.
in scheme: mediatopic
created: 2009-10-22T02:00:00+00:00
modified: 2021-07-12T12:00:00+00:00
broader: eleições

campanhas políticas
type: Concept
definition: Campanhas para cargos públicos.
in scheme: mediatopic
created: 2009-10-22T02:00:00+00:00
modified: 2024-09-26T12:00:00+00:00
retired: 2024-09-26T12:00:00+00:00
broader: eleições

financiamento de campanhas
type: Concept
definition: Dinheiro que torna possível as campanhas para cargos públicos.
in scheme: mediatopic
created: 2009-10-22T02:00:00+00:00
modified: 2021-02-18T12:00:00+00:00
broader: eleições

candidatos políticos
type: Concept
definition: Indivíduos escolhidos para se candidatarem a cargos públicos.
in scheme: mediatopic
created: 2009-10-22T02:00:00+00:00
modified: 2021-02-18T12:00:00+00:00
broader: eleições

eleições primárias
type: Concept
definition: Eleições primárias locais ou regionais que conduzem a eleições regionais ou nacionais.
in scheme: mediatopic
created: 2009-10-22T02:00:00+00:00
modified: 2021-07-12T12:00:00+00:00
broader: eleições

referendo
type: Concept
definition: Propostas políticas, leis e ações sugeridas por membros ou organismos não governamentais para serem votados pela comunidade.
in scheme: mediatopic
created: 2009-10-22T02:00:00+00:00
modified: 2024-09-26T12:00:00+00:00
broader: eleições

eleições regionais
type: Concept
definition: Escolha de pessoas para o governo a nível regional.
in scheme: mediatopic
created: 2009-10-22T02:00:00+00:00
modified: 2021-07-12T12:00:00+00:00
broader: eleições

votação
type: Concept
definition: Ato de selecionar uma pessoa para representar os seus interesses no governo.
in scheme: mediatopic
created: 2009-10-22T02:00:00+00:00
modified: 2021-02-18T12:00:00+00:00
broader: eleições

direitos fundamentais
type: Concept
definition: Direitos políticos, sociais e econômicos aos quais todas as criaturas têm direito, geralmente confirmados por lei.
in scheme: mediatopic
created: 2009-10-22T02:00:00+00:00
modified: 2024-09-26T12:00:00+00:00
broad match: http://cv.iptc.org/newscodes/subjectcode/02007000
broader: sociedade
narrower: direitos civis
narrower: censura e liberdade de expressão
narrower: liberdade religiosa
narrower: liberdade de imprensa
narrower: direitos humanos
narrower: privacidade
narrower: http://cv.iptc.org/newscodes/mediatopic/20001326

censura e liberdade de expressão
type: Concept
definition: Tentativas de um grupo controlar as liberdades de expressão, de religião ou de ideias difundidas de forma impressa, em gráficos, no ciberespaço ou por outros meios. Não inclui padrões oficiais como classificação de filmes, publicidade e padrões de transmissão.
in scheme: mediatopic
created: 2009-10-22T02:00:00+00:00
modified: 2021-02-18T12:00:00+00:00
broader: direitos fundamentais

liberdade religiosa
type: Concept
definition: Direitos e liberdades religiosas, pressão e intimidação dos crentes, censura na mídia de massa, atividades de órgãos governamentais, associações e/ou organizações de jornalistas e outras ONG no que diz respeito à liberdade de crença e de prática.
in scheme: mediatopic
created: 2009-10-22T02:00:00+00:00
modified: 2021-05-05T12:00:00+00:00
broader: direitos fundamentais

liberdade de imprensa
type: Concept
definition: Direitos e liberdades da mídia de massa, pressão e intimidação dos jornalistas, censura na mídia de massa, atividades de órgãos governamentais, associações e/ou organizações de jornalistas e outras ONG em relação à liberdade de imprensa.
in scheme: mediatopic
created: 2009-10-22T02:00:00+00:00
modified: 2021-02-18T12:00:00+00:00
broader: direitos fundamentais

direitos humanos
type: Concept
definition: Direitos comuns a todos os cidadãos do mundo.
in scheme: mediatopic
created: 2009-10-22T02:00:00+00:00
modified: 2021-02-18T12:00:00+00:00
broader: direitos fundamentais

governo
type: Concept
definition: Sistema que administra um país.
in scheme: mediatopic
created: 2009-10-22T02:00:00+00:00
modified: 2025-03-31T12:00:00+00:00
broader: política
narrower: serviços públicos
narrower: funcionários públicos
narrower: detentores de cargos públicos
narrower: constituição
narrower: defesa
narrower: executivo (governo)
narrower: orçamento de estado
narrower: departamentos governamentais
narrower: chefes de estado
narrower: impeachment
narrower: governo e autoridades locais
narrower: ministro (governo)
narrower: governo nacional
narrower: parlamento
narrower: governo e autoridades regionais
narrower: lobby
narrower: partidos e movimentos políticos
narrower: desenvolvimento político
narrower: sistemas políticos
narrower: agência reguladora
narrower: convenção partidária
narrower: comissão parlamentar
narrower: chefe de governo
narrower: inquérito público
narrower: liderança política
narrower: http://cv.iptc.org/newscodes/mediatopic/20001384
narrower: http://cv.iptc.org/newscodes/mediatopic/20001385

serviços públicos
type: Concept
definition: Serviço pago feito por civis para o governo e serviço, frequentemente não pago, de indivíduos para benefício de outros (serviço público).
in scheme: mediatopic
created: 2009-10-22T02:00:00+00:00
modified: 2025-03-31T12:00:00+00:00
retired: 2025-03-31T12:00:00+00:00
broader: governo
narrower: serviço alternativo

funcionários públicos
type: Concept
definition: Pessoas contratadas por qualquer nível de governo.
in scheme: mediatopic
created: 2009-10-22T02:00:00+00:00
modified: 2025-03-31T12:00:00+00:00
broader: governo

detentores de cargos públicos
type: Concept
definition: Pessoas, geralmente eleitas para cargos políticos, que estão no serviço público ou frequentemente na opinião pública.
in scheme: mediatopic
created: 2009-10-22T02:00:00+00:00
modified: 2025-03-31T12:00:00+00:00
broader: governo

constituição
type: Concept
definition: Geralmente, documento escrito que estabelece as operações de um governo e os direitos dos cidadãos.
in scheme: mediatopic
created: 2009-10-22T02:00:00+00:00
modified: 2025-03-31T12:00:00+00:00
broader: governo

defesa
type: Concept
definition: Tudo o que envolva a proteção de um país.
in scheme: mediatopic
created: 2009-10-22T02:00:00+00:00
modified: 2025-03-31T12:00:00+00:00
broader: governo
narrower: forças armadas
narrower: equipamento militar
narrower: armamento militar
narrower: medidas de segurança
narrower: espionagem e inteligência

forças armadas
type: Concept
definition: Funcionários de um governo incumbidos de gerir um conflito armado ou de garantir a segurança de uma nação.
in scheme: mediatopic
created: 2009-10-22T02:00:00+00:00
modified: 2025-03-31T12:00:00+00:00
broader: defesa
narrower: veteranos
narrower: serviço militar

veteranos
type: Concept
definition: Cuidado e assistência para antigos combatentes das forças armadas.
in scheme: mediatopic
created: 2009-10-22T02:00:00+00:00
modified: 2021-05-05T12:00:00+00:00
broader: forças armadas

equipamento militar
type: Concept
definition: Equipamento atribuído a membros das forças armadas.
in scheme: mediatopic
created: 2009-10-22T02:00:00+00:00
modified: 2025-03-31T12:00:00+00:00
retired: 2025-03-31T12:00:00+00:00
broader: defesa

armamento militar
type: Concept
definition: Conjunto do armamento militar de um país.
in scheme: mediatopic
created: 2009-10-22T02:00:00+00:00
modified: 2025-03-31T12:00:00+00:00
broader: defesa

medidas de segurança
type: Concept
definition: Meios para proteger uma nação, um estado, um edifício ou uma pessoa de danos e interferências exteriores.
in scheme: mediatopic
created: 2009-10-22T02:00:00+00:00
modified: 2025-03-31T12:00:00+00:00
retired: 2025-03-31T12:00:00+00:00
broader: defesa
narrower: segurança nacional

segurança nacional
type: Concept
definition: Filosofia de proteger o país, suas fronteiras e o bem-estar de seus cidadãos.
in scheme: mediatopic
created: 2009-10-22T02:00:00+00:00
modified: 2025-03-31T12:00:00+00:00
retired: 2025-03-31T12:00:00+00:00
broader: medidas de segurança

espionagem e inteligência
type: Concept
definition: Recolha secreta de informações.
in scheme: mediatopic
created: 2009-10-22T02:00:00+00:00
modified: 2025-03-31T12:00:00+00:00
broader: defesa

executivo (governo)
type: Concept
definition: Parte do corpo governativo de um país que detém o poder de executar as leis e a operação geral do governo.
in scheme: mediatopic
created: 2009-10-22T02:00:00+00:00
modified: 2025-03-31T12:00:00+00:00
broader: governo

orçamento de estado
type: Concept
definition: Despesas e receitas aprovadas pela câmara legislativa.
in scheme: mediatopic
created: 2009-10-22T02:00:00+00:00
modified: 2025-03-31T12:00:00+00:00
broad match: http://cv.iptc.org/newscodes/subjectcode/11013000
broader: governo
narrower: finanças públicas

finanças públicas
type: Concept
definition: Dinheiro que o governo usa para financiar programas e serviços públicos e pagar a dívida pública.
in scheme: mediatopic
created: 2009-10-22T02:00:00+00:00
modified: 2025-03-31T12:00:00+00:00
retired: 2025-03-31T12:00:00+00:00
broader: orçamento de estado

departamentos governamentais
type: Concept
definition: Divisões de um governo que se concentram em áreas específicas, como a saúde, o bem-estar, a economia ou a guerra.
in scheme: mediatopic
created: 2009-10-22T02:00:00+00:00
modified: 2025-03-31T12:00:00+00:00
retired: 2025-03-31T12:00:00+00:00
broader: governo

chefes de estado
type: Concept
definition: Representante supremo de uma nação, simbólico ou não, como a realeza, um presidente ou um emir, por exemplo.
in scheme: mediatopic
created: 2009-10-22T02:00:00+00:00
modified: 2025-03-31T12:00:00+00:00
broader: governo

impeachment
type: Concept
definition: Processo em que um detentor de cargo público é levado a tribunal para responder por acusações de irregularidades.
in scheme: mediatopic
created: 2009-10-22T02:00:00+00:00
modified: 2021-02-18T12:00:00+00:00
broader: governo

governo e autoridades locais
type: Concept
definition: Autoridades de uma cidade, condado, distrito, município.
in scheme: mediatopic
created: 2009-10-22T02:00:00+00:00
modified: 2025-03-31T12:00:00+00:00
broader: governo

ministro (governo)
type: Concept
definition: Político que chefia um departamento do governo e trabalha em conjunto com outros ministros para tomar e implementar decisões políticas.
in scheme: mediatopic
created: 2009-10-22T02:00:00+00:00
modified: 2025-03-31T12:00:00+00:00
broader: governo

governo nacional
type: Concept
definition: Corpo governativo de uma nação.
in scheme: mediatopic
created: 2009-10-22T02:00:00+00:00
modified: 2021-02-18T12:00:00+00:00
broader: governo

parlamento
type: Concept
definition: Corpo coletivo dos representantes eleitos do povo.
in scheme: mediatopic
created: 2009-10-22T02:00:00+00:00
modified: 2021-03-31T12:00:00+00:00
broader: governo
narrower: câmara baixa (legislatura)
narrower: câmara alta (legislatura)

câmara baixa (legislatura)
type: Concept
definition: Câmara inferior de um órgão legislativo, como a Câmara dos Deputados do Brasil, a Câmara dos Representantes dos EUA ou a Câmara dos Comuns do Reino Unido.
in scheme: mediatopic
created: 2009-10-22T02:00:00+00:00
modified: 2021-02-18T12:00:00+00:00
broader: parlamento

câmara alta (legislatura)
type: Concept
definition: Câmara superior de um órgão legislativo, como o Senado Federal do Brasil, o Senado dos EUA ou a Câmara dos Lordes do Reino Unido.
in scheme: mediatopic
created: 2009-10-22T02:00:00+00:00
modified: 2021-02-18T12:00:00+00:00
broader: parlamento

governo e autoridades regionais
type: Concept
definition: Autoridades acima do nível local e abaixo do nível nacional. Pode tratar-se de estado, província, departamento, região etc.
in scheme: mediatopic
created: 2009-10-22T02:00:00+00:00
modified: 2025-03-31T12:00:00+00:00
broader: governo

segurança dos cidadãos
type: Concept
definition: Políticas do governo para proteger o bem-estar de seus cidadãos.
in scheme: mediatopic
created: 2009-10-22T02:00:00+00:00
modified: 2025-03-31T12:00:00+00:00
retired: 2025-03-31T12:00:00+00:00
broader: política governamental

impostos
type: Concept
definition: Taxa imposta às pessoas físicas e jurídicas de um Estado, via coerção legislativa, para custear despesas do governo.
in scheme: mediatopic
created: 2009-10-22T02:00:00+00:00
modified: 2025-03-31T12:00:00+00:00
broad match: http://cv.iptc.org/newscodes/subjectcode/11013000
broader: política governamental

política governamental
type: Concept
definition: Plano global ou plano de ação estabelecido por um governo para influenciar e orientar decisões e ações em direção a um resultado desejado.
in scheme: mediatopic
created: 2009-10-22T02:00:00+00:00
modified: 2025-03-31T12:00:00+00:00
broad match: http://cv.iptc.org/newscodes/subjectcode/11006000
broader: política
narrower: política econômica
narrower: políticas ambientais
narrower: política de saúde
narrower: segurança dos cidadãos
narrower: impostos
narrower: política interna
narrower: política de proteção de dados
narrower: política de habitação e urbanismo
narrower: política para os povos indígenas
narrower: política de pensões e benefícios sociais
narrower: política de recolha de dados pessoais
narrower: controle de armas pessoais
narrower: consultas públicas
narrower: política de migração
narrower: política nuclear
narrower: autoridades reguladoras
narrower: política cultural
narrower: política de integração
narrower: políticas esportivas
narrower: política de desenvolvimento regional
narrower: política de infraestruturas
narrower: política de governo local
narrower: http://cv.iptc.org/newscodes/mediatopic/20001338
narrower: http://cv.iptc.org/newscodes/mediatopic/20001383

nacionalização
type: Concept
definition: Tomada de posse por parte do estado de empresas ou propriedades privadas.
in scheme: mediatopic
created: 2009-10-22T02:00:00+00:00
modified: 2025-03-31T12:00:00+00:00
broader: política econômica

privatização
type: Concept
definition: Transferência de empresas ou propriedades do estado para proprietários ou empresas privados.
in scheme: mediatopic
created: 2009-10-22T02:00:00+00:00
modified: 2025-03-31T12:00:00+00:00
broader: política econômica

empresa estatal
type: Concept
definition: O governo como proprietário de empresas, com capital exclusivo ou parcial do estado.
in scheme: mediatopic
created: 2009-10-22T02:00:00+00:00
modified: 2025-03-31T12:00:00+00:00
broad match: http://cv.iptc.org/newscodes/subjectcode/04017001
broader: política econômica

política interna
type: Concept
definition: Políticas governamentais que afetam assuntos internos.
in scheme: mediatopic
created: 2009-10-22T02:00:00+00:00
modified: 2025-03-31T12:00:00+00:00
retired: 2025-03-31T12:00:00+00:00
broader: política governamental

política de proteção de dados
type: Concept
definition: Esforços para proteger dados pessoais sob forma escrita, oral ou eletrônica.
in scheme: mediatopic
created: 2009-10-22T02:00:00+00:00
modified: 2025-03-31T12:00:00+00:00
broader: política governamental

política de habitação e urbanismo
type: Concept
definition: Planejamento sistemático de áreas urbanas e suburbanas e da habitação dentro dessas áreas.
in scheme: mediatopic
created: 2009-10-22T02:00:00+00:00
modified: 2025-03-31T12:00:00+00:00
broader: política governamental

política para os povos indígenas
type: Concept
definition: Políticas governamentais relativas a povos indígenas.
in scheme: mediatopic
created: 2009-10-22T02:00:00+00:00
modified: 2025-03-31T12:00:00+00:00
broader: política governamental

política de pensões e benefícios sociais
type: Concept
definition: Políticas governamentais que afetam o bem-estar dos cidadãos através de seguros-desemprego, pensões e outros pagamentos similares.
in scheme: mediatopic
created: 2009-10-22T02:00:00+00:00
modified: 2025-03-31T12:00:00+00:00
broader: política governamental

política de recolha de dados pessoais
type: Concept
definition: Recolha de informação sobre indivíduos, por parte do governo ou de outras entidades.
in scheme: mediatopic
created: 2009-10-22T02:00:00+00:00
modified: 2025-03-31T12:00:00+00:00
retired: 2025-03-31T12:00:00+00:00
broader: política governamental

controle de armas pessoais
type: Concept
definition: Controle governamental da posse de armas de fogo e de outras armas ofensivas, incluindo controle de armas usadas em esportes, através de licenças e outros meios.
in scheme: mediatopic
created: 2009-10-22T02:00:00+00:00
modified: 2025-03-31T12:00:00+00:00
broader: política governamental

consultas públicas
type: Concept
definition: Audiências públicas ou consultas de planejamento sobre propostas de obras públicas, como a construção de uma central elétrica em um parque nacional.
in scheme: mediatopic
created: 2009-10-22T02:00:00+00:00
modified: 2025-03-31T12:00:00+00:00
retired: 2025-03-31T12:00:00+00:00
broader: política governamental

política de migração
type: Concept
definition: Deslocação de uma comunidade de pessoas de um lugar para outro.
in scheme: mediatopic
created: 2009-10-22T02:00:00+00:00
modified: 2025-03-31T12:00:00+00:00
broader: política governamental

política nuclear
type: Concept
definition: Políticas governamentais relativas ao uso de energia nuclear para a produção de energia ou de armas.
in scheme: mediatopic
created: 2009-10-22T02:00:00+00:00
modified: 2025-03-31T12:00:00+00:00
broader: política governamental

autoridades reguladoras
type: Concept
definition: Normas e entidades, nacionais e internacionais, que regem os conflitos de interesse e as regulações de boas práticas.
in scheme: mediatopic
created: 2009-10-22T02:00:00+00:00
modified: 2025-03-31T12:00:00+00:00
broader: política governamental
narrower: regulamentação sobre alimentos e bebidas

regulamentação sobre alimentos e bebidas
type: Concept
definition: Políticas governamentais relativas a alimentos e bebidas.
in scheme: mediatopic
created: 2009-10-22T02:00:00+00:00
modified: 2025-03-31T12:00:00+00:00
broad match: http://cv.iptc.org/newscodes/subjectcode/11022000
broader: autoridades reguladoras

relações internacionais
type: Concept
definition: Relações não violentas entre nações através de negociações, tratados ou reuniões pessoais.
in scheme: mediatopic
created: 2009-10-22T02:00:00+00:00
modified: 2025-03-31T12:00:00+00:00
broader: política
narrower: diplomacia
narrower: sanções econômicas
narrower: ajuda externa
narrower: organizações internacionais
narrower: refugiados e deslocados
narrower: conflitos fronteiriços

diplomacia
type: Concept
definition: Uso das capacidades orais e de escrita para persuadir outros ao seu ponto de vista.
in scheme: mediatopic
created: 2009-10-22T02:00:00+00:00
modified: 2025-03-31T12:00:00+00:00
broader: relações internacionais
narrower: cúpulas
narrower: tratado

cúpulas
type: Concept
definition: Inclui reuniões de líderes, ministros das relações exteriores e das finanças do Grupo dos Oito maiores países (G8) ou do Grupo dos Sete dos países mais industrializados (G7).
in scheme: mediatopic
created: 2009-10-22T02:00:00+00:00
modified: 2025-03-31T12:00:00+00:00
broader: diplomacia

tratado
type: Concept
definition: Um tratado (de acordo com a Convenção de Viena sobre o Direito dos Tratados) é um acordo escrito entre entidades internacionais vinculativo à luz do direito internacional.
in scheme: mediatopic
created: 2009-10-22T02:00:00+00:00
modified: 2025-03-31T12:00:00+00:00
broader: diplomacia

sanções econômicas
type: Concept
definition: Ações punitivas tomadas por um país contra outro, incluindo restrições comerciais, embargos etc.
in scheme: mediatopic
created: 2009-10-22T02:00:00+00:00
modified: 2025-03-31T12:00:00+00:00
broader: relações internacionais

ajuda externa
type: Concept
definition: Auxílio prestado por uma nação a outra.
in scheme: mediatopic
created: 2009-10-22T02:00:00+00:00
modified: 2025-03-31T12:00:00+00:00
broader: relações internacionais

organizações internacionais
type: Concept
definition: Inclui organizações com membros e funções que atravessam fronteiras internacionais e pode incluir organizações intergovernamentais de nações soberanas.
in scheme: mediatopic
created: 2009-10-22T02:00:00+00:00
modified: 2025-03-31T12:00:00+00:00
broader: relações internacionais

refugiados e deslocados
type: Concept
definition: Pessoa que procura abrigo em outro país por medo de perseguição em seu próprio país.
in scheme: mediatopic
created: 2009-10-22T02:00:00+00:00
modified: 2025-03-31T12:00:00+00:00
broader: relações internacionais

organização não governamental
type: Concept
definition: Grupos não pertencentes ao governo que pressionam, protestam ou fazem campanha sobre vários assuntos como economia, meio ambiente, cuidados de saúde etc.
in scheme: mediatopic
created: 2009-10-22T02:00:00+00:00
modified: 2025-03-31T12:00:00+00:00
broader: política

crise política
type: Concept
definition: Conflito que atinge um nível em que, dependendo dos acontecimentos, os governos podem cair.
in scheme: mediatopic
created: 2009-10-22T02:00:00+00:00
modified: 2025-03-31T12:00:00+00:00
retired: 2025-03-31T12:00:00+00:00
broad match: http://cv.iptc.org/newscodes/subjectcode/16011000
broader: política

dissidência política
type: Concept
definition: Desacordo entre grupos políticos, geralmente organizado, por vezes resultando na prisão dos dissidentes.
in scheme: mediatopic
created: 2009-10-22T02:00:00+00:00
modified: 2025-03-31T12:00:00+00:00
broader: política

processo político
type: Concept
definition: Arte ou ciência de participar nos assuntos de um governo, de um estado ou de um partido político.
in scheme: mediatopic
created: 2009-10-22T02:00:00+00:00
modified: 2025-03-31T12:00:00+00:00
retired: 2025-03-31T12:00:00+00:00
broader: política

lobby
type: Concept
definition: Tentativa, exercida por grupos e indivíduos não governamentais, de afetar o resultado dos processos de legislação através de persuasão verbal ou outra.
in scheme: mediatopic
created: 2009-10-22T02:00:00+00:00
modified: 2025-03-31T12:00:00+00:00
broader: governo

partidos e movimentos políticos
type: Concept
definition: Inclui associações políticas formalmente reconhecidas e informais.
in scheme: mediatopic
created: 2009-10-22T02:00:00+00:00
modified: 2025-03-31T12:00:00+00:00
retired: 2025-03-31T12:00:00+00:00
broader: governo

desenvolvimento político
type: Concept
definition: Criação e evolução de sistemas políticos e a história dos povos e nações que estão associados a esses sistemas.
in scheme: mediatopic
created: 2009-10-22T02:00:00+00:00
modified: 2025-03-31T12:00:00+00:00
retired: 2025-03-31T12:00:00+00:00
broader: governo

sistemas políticos
type: Concept
definition: Sistemas desenvolvidos para a organização do governo.
in scheme: mediatopic
created: 2009-10-22T02:00:00+00:00
modified: 2025-03-31T12:00:00+00:00
broader: governo
narrower: democracia
narrower: ditadura
narrower: http://cv.iptc.org/newscodes/mediatopic/20001386
narrower: http://cv.iptc.org/newscodes/mediatopic/20001387
narrower: http://cv.iptc.org/newscodes/mediatopic/20001388
narrower: http://cv.iptc.org/newscodes/mediatopic/20001389

democracia
type: Concept
definition: Governo no qual o povo detém o poder de maneira direta ou por meio de representantes governamentais eleitos.
in scheme: mediatopic
created: 2009-10-22T02:00:00+00:00
modified: 2025-03-31T12:00:00+00:00
broader: sistemas políticos

ditadura
type: Concept
definition: Governo em que um único indivíduo ou um pequeno grupo de indivíduos detém o poder sem o consentimento da população.
in scheme: mediatopic
created: 2009-10-22T02:00:00+00:00
modified: 2025-03-31T12:00:00+00:00
broad match: http://cv.iptc.org/newscodes/subjectcode/11006000
broader: sistemas políticos

crenças religiosas
type: Concept
definition: Crenças estabelecidas da religião de um indivíduo.
in scheme: mediatopic
created: 2009-10-22T02:00:00+00:00
modified: 2021-12-21T12:00:00+00:00
broader: religião e crença
narrower: budismo
narrower: cristianismo
narrower: confucionismo
narrower: cultos e seitas
narrower: maçonaria
narrower: hinduísmo
narrower: islã
narrower: jainismo
narrower: judaísmo
narrower: religião natural
narrower: parsismo
narrower: cientologia
narrower: xintoísmo
narrower: siquismo
narrower: taoismo
narrower: unificacionismo
narrower: http://cv.iptc.org/newscodes/mediatopic/20001349

budismo
type: Concept
definition: Importante religião asiática, fundada por Buda no séc. VI a.C. na Índia, que prega que o bom uso da razão e a abnegação conduzem a um estado divino sem desejo.
in scheme: mediatopic
created: 2009-10-22T02:00:00+00:00
modified: 2021-12-21T12:00:00+00:00
broader: crenças religiosas

cristianismo
type: Concept
definition: Aqueles que usam Jesus Cristo e seus ensinamentos como centro de sua crença religiosa.
in scheme: mediatopic
created: 2009-10-22T02:00:00+00:00
modified: 2021-12-21T12:00:00+00:00
broader: crenças religiosas
narrower: ecumenismo
narrower: mórmon
narrower: veterocatólico
narrower: ortodoxia
narrower: protestante
narrower: católico romano
narrower: http://cv.iptc.org/newscodes/mediatopic/20001344

ecumenismo
type: Concept
definition: Relações entre igrejas cristãs.
in scheme: mediatopic
created: 2009-10-22T02:00:00+00:00
modified: 2021-02-18T12:00:00+00:00
retired: 2021-12-17T12:00:00+00:00
broader: cristianismo

mórmon
type: Concept
definition: Membros de uma comunidade religiosa que acredita no *Livro de Mórmon* e nas revelações do fundador M. J. Smith.
in scheme: mediatopic
created: 2009-10-22T02:00:00+00:00
modified: 2021-12-21T12:00:00+00:00
broader: cristianismo

veterocatólico
type: Concept
definition: Membros de uma igreja católica que começou em 1870 e que nega o dogma da infalibilidade do papa.
in scheme: mediatopic
created: 2009-10-22T02:00:00+00:00
modified: 2021-02-18T12:00:00+00:00
retired: 2021-12-17T12:00:00+00:00
broader: cristianismo

ortodoxia
type: Concept
definition: Igrejas de rito oriental que se caracterizam pela sua continuidade com a igreja apostólica, sua liturgia e suas igrejas territoriais, sobretudo no leste e sudeste da Europa e no Oriente Médio.
in scheme: mediatopic
created: 2009-10-22T02:00:00+00:00
modified: 2021-12-17T12:00:00+00:00
broader: cristianismo

protestante
type: Concept
definition: Termo genérico para igrejas cristãs e comunidades religiosas que se formaram durante a Reforma Protestante do séc. XVI.
in scheme: mediatopic
created: 2009-10-22T02:00:00+00:00
modified: 2021-12-17T12:00:00+00:00
broader: cristianismo
narrower: anglicano
narrower: batista
narrower: luterano
narrower: menonita
narrower: metodista
narrower: reformado

anglicano
type: Concept
definition: Membros da comunidade anglicana mundial, que nasceu no séc. XVI na Inglaterra, em resultado da cisão com a igreja católica romana.
in scheme: mediatopic
created: 2009-10-22T02:00:00+00:00
modified: 2021-02-18T12:00:00+00:00
retired: 2021-12-17T12:00:00+00:00
broader: protestante

batista
type: Concept
definition: Membros de uma igreja cristã que apenas batiza adultos que creem verdadeiramente em Cristo.
in scheme: mediatopic
created: 2009-10-22T02:00:00+00:00
modified: 2021-07-12T12:00:00+00:00
retired: 2021-12-17T12:00:00+00:00
broader: protestante

luterano
type: Concept
definition: Cristãos que seguem os ensinamentos do reformista Martinho Lutero.
in scheme: mediatopic
created: 2009-10-22T02:00:00+00:00
modified: 2021-02-18T12:00:00+00:00
retired: 2021-12-17T12:00:00+00:00
broader: protestante

menonita
type: Concept
definition: Membros de uma igreja cristã do séc. XVI que é contra o serviço militar e o batismo de crianças.
in scheme: mediatopic
created: 2009-10-22T02:00:00+00:00
modified: 2021-12-17T12:00:00+00:00
retired: 2021-12-17T12:00:00+00:00
broader: protestante

metodista
type: Concept
definition: Seguidores de John e Charles Wesley, que tentaram reformar a igreja de Inglaterra no séc. XVIII e formaram uma igreja separada.
in scheme: mediatopic
created: 2009-10-22T02:00:00+00:00
modified: 2021-02-18T12:00:00+00:00
retired: 2021-12-17T12:00:00+00:00
broader: protestante

reformado
type: Concept
definition: Cristãos que seguem os ensinamentos dos reformistas João Calvino e Ulrico Zuínglio.
in scheme: mediatopic
created: 2009-10-22T02:00:00+00:00
modified: 2021-02-18T12:00:00+00:00
retired: 2021-12-17T12:00:00+00:00
broader: protestante

católico romano
type: Concept
definition: Maior igreja cristã do mundo, cuja origem remonta a Jesus Cristo.
in scheme: mediatopic
created: 2009-10-22T02:00:00+00:00
modified: 2021-02-18T12:00:00+00:00
retired: 2021-12-17T12:00:00+00:00
broader: cristianismo
narrower: concordata

concordata
type: Concept
definition: Tratado entre a Santa Sé e um país para a regulação de assuntos eclesiásticos nesse país.
in scheme: mediatopic
created: 2009-10-22T02:00:00+00:00
modified: 2021-12-17T12:00:00+00:00
retired: 2021-12-17T12:00:00+00:00
broader: católico romano

confucionismo
type: Concept
definition: Doutrina de vida propagada por Confúcio no séc. VI-V A.C. e seguida pelo povo chinês por mais de 2000 anos. Sua influência se estendeu até a Coreia, o Japão e o Vietnã.
in scheme: mediatopic
created: 2009-10-22T02:00:00+00:00
modified: 2021-12-17T12:00:00+00:00
broader: crenças religiosas

cultos e seitas
type: Concept
definition: Ramificações de corpos religiosos estabelecidos ou grupo restrito disseminado por um ou dois indivíduos.
in scheme: mediatopic
created: 2009-10-22T02:00:00+00:00
modified: 2021-12-21T12:00:00+00:00
broader: crenças religiosas

maçonaria
type: Concept
definition: Sociedade secreta internacional baseada nos princípios de irmandade, caridade e ajuda mútua.
in scheme: mediatopic
created: 2009-10-22T02:00:00+00:00
modified: 2021-12-17T12:00:00+00:00
retired: 2021-12-17T12:00:00+00:00
broader: crenças religiosas

hinduísmo
type: Concept
definition: Sistema religioso e social que acredita num sistema de castas, com os brâmanes na casta mais alta e os intocáveis na casta mais baixa.
in scheme: mediatopic
created: 2009-10-22T02:00:00+00:00
modified: 2021-12-21T12:00:00+00:00
broader: crenças religiosas

islã
type: Concept
definition: Aqueles que usam Alá e seus ensinamentos como centro de sua crença religiosa.
in scheme: mediatopic
created: 2009-10-22T02:00:00+00:00
modified: 2021-12-17T12:00:00+00:00
broader: crenças religiosas
narrower: http://cv.iptc.org/newscodes/mediatopic/20001347
narrower: http://cv.iptc.org/newscodes/mediatopic/20001348

jainismo
type: Concept
definition: Religião da Índia que ensina o caminho para a pureza e a iluminação espirituais através de um modo de vida disciplinado fundado na tradição de ainsa, não violência para todas as criaturas vivas. Teve origem nos séculos VII-V a.C.
in scheme: mediatopic
created: 2009-10-22T02:00:00+00:00
modified: 2021-12-21T12:00:00+00:00
broader: crenças religiosas

judaísmo
type: Concept
definition: Grupo que acredita em um só deus, baseando suas crenças nas escrituras e no Talmude, incluindo a primeira vinda do Messias.
in scheme: mediatopic
created: 2009-10-22T02:00:00+00:00
modified: 2021-12-21T12:00:00+00:00
broader: crenças religiosas
narrower: http://cv.iptc.org/newscodes/mediatopic/20001351

religião natural
type: Concept
definition: Adoração de elementos naturais como fogo, água, árvores, montanhas.
in scheme: mediatopic
created: 2009-10-22T02:00:00+00:00
modified: 2021-12-21T12:00:00+00:00
broader: crenças religiosas

parsismo
type: Concept
definition: Religião da Índia que segue o profeta iraniano Zoroastro, ou Zaratustra, sobretudo em Bombaim, mas também em Karachi (Paquistão).
in scheme: mediatopic
created: 2009-10-22T02:00:00+00:00
modified: 2021-12-17T12:00:00+00:00
broader: crenças religiosas

cientologia
type: Concept
definition: Crença de que o homem é um ser espiritual dotado de capacidades que vão além do que ele normalmente considera.
in scheme: mediatopic
created: 2009-10-22T02:00:00+00:00
modified: 2021-12-21T12:00:00+00:00
broader: crenças religiosas

xintoísmo
type: Concept
definition: Crenças e práticas religiosas autóctones do Japão. A palavra xintó foi adotada para distinguir as crenças autóctones japonesas do budismo.
in scheme: mediatopic
created: 2009-10-22T02:00:00+00:00
modified: 2021-12-17T12:00:00+00:00
broader: crenças religiosas

siquismo
type: Concept
definition: Religião de um grupo indiano, que combina elementos hindus e islâmicos, fundada no Punjabe (ou Punjab) no final do séc. XV pelo guru Nanak.
in scheme: mediatopic
created: 2009-10-22T02:00:00+00:00
modified: 2021-12-17T12:00:00+00:00
broader: crenças religiosas

taoismo
type: Concept
definition: Tradição religiosa e filosófica autóctone que molda a cultura chinesa há mais de 2000 anos.
in scheme: mediatopic
created: 2009-10-22T02:00:00+00:00
modified: 2021-12-17T12:00:00+00:00
broader: crenças religiosas

unificacionismo
type: Concept
definition: Sistema de crenças dos membros da Igreja da Unificação, estabelecida pelo reverendo Sun Myung Moon.
in scheme: mediatopic
created: 2009-10-22T02:00:00+00:00
modified: 2021-12-17T12:00:00+00:00
broader: crenças religiosas

diálogo inter-religioso
type: Concept
definition: Toda forma de comunicação entre religiões.
in scheme: mediatopic
created: 2009-10-22T02:00:00+00:00
modified: 2021-02-18T12:00:00+00:00
retired: 2021-12-17T12:00:00+00:00
broader: religião e crença

conflito religioso
type: Concept
definition: Conflitos envolvendo diferenças religiosas.
in scheme: mediatopic
created: 2009-10-22T02:00:00+00:00
modified: 2021-02-18T12:00:00+00:00
broader: religião e crença

evento religioso
type: Concept
definition: Notícias relativas a acontecimentos religiosos mas não a feriados ou festas religiosas.
in scheme: mediatopic
created: 2009-10-22T02:00:00+00:00
modified: 2021-07-12T12:00:00+00:00
retired: 2021-12-17T12:00:00+00:00
broader: religião e crença

festa ou feriado religioso
type: Concept
definition: Dia santo ou dia de prática religiosa que por vezes também é um feriado público.
in scheme: mediatopic
created: 2009-10-22T02:00:00+00:00
modified: 2021-12-17T12:00:00+00:00
broader: religião e crença
narrower: natal
narrower: páscoa
narrower: pentecostes
narrower: ramadã
narrower: yom kippur
narrower: Dia de Todos os Santos
narrower: Noite de Santa Valburga
narrower: http://cv.iptc.org/newscodes/mediatopic/20001350
narrower: http://cv.iptc.org/newscodes/mediatopic/20001352

natal
type: Concept
definition: Festa cristã que comemora o nascimento de Jesus Cristo.
in scheme: mediatopic
created: 2009-10-22T02:00:00+00:00
modified: 2021-12-21T12:00:00+00:00
broader: festa ou feriado religioso

páscoa
type: Concept
definition: Festa cristã que comemora a ressurreição de Jesus Cristo.
in scheme: mediatopic
created: 2009-10-22T02:00:00+00:00
modified: 2021-12-17T12:00:00+00:00
broader: festa ou feriado religioso

pentecostes
type: Concept
definition: Festa cristã, celebrada no 50.º dia depois da Páscoa, que comemora a descida do Espírito Santo.
in scheme: mediatopic
created: 2009-10-22T02:00:00+00:00
modified: 2021-12-17T12:00:00+00:00
broader: festa ou feriado religioso

ramadã
type: Concept
definition: Mês sagrado de jejum no Islã.
in scheme: mediatopic
created: 2009-10-22T02:00:00+00:00
modified: 2021-12-17T12:00:00+00:00
broader: festa ou feriado religioso

yom kippur
type: Concept
definition: O mais solene dos dias santos judaicos, celebrado no 10.º dia do mês lunar de tishri (entre setembro e outubro), quando os judeus buscam a reconciliação com deus.
in scheme: mediatopic
created: 2009-10-22T02:00:00+00:00
modified: 2021-12-17T12:00:00+00:00
broader: festa ou feriado religioso

ritual
type: Concept
definition: Rituais religiosos estabelecidos, como missa, batismo, oração em grupo.
in scheme: mediatopic
created: 2009-10-22T02:00:00+00:00
modified: 2021-12-17T12:00:00+00:00
broader: religião e crença
narrower: batismo
narrower: http://cv.iptc.org/newscodes/mediatopic/20001345
narrower: http://cv.iptc.org/newscodes/mediatopic/20001346

instalações religiosas
type: Concept
definition: Quaisquer instalações onde um grupo possa realizar ritos religiosos, quer seja uma mesquita, uma igreja, uma casa ou uma tenda.
in scheme: mediatopic
created: 2009-10-22T02:00:00+00:00
modified: 2021-12-17T12:00:00+00:00
broad match: http://cv.iptc.org/newscodes/subjectcode/12000000
broader: religião e crença
narrower: igreja
narrower: mesquita
narrower: sinagoga
narrower: templo

igreja
type: Concept
definition: Em geral, edifício identificável como local de culto para a religião cristã.
in scheme: mediatopic
created: 2009-10-22T02:00:00+00:00
modified: 2021-12-17T12:00:00+00:00
broad match: http://cv.iptc.org/newscodes/subjectcode/12000000
broader: instalações religiosas

mesquita
type: Concept
definition: Em geral, edifício identificável como local de culto para a religião muçulmana.
in scheme: mediatopic
created: 2009-10-22T02:00:00+00:00
modified: 2021-12-17T12:00:00+00:00
broad match: http://cv.iptc.org/newscodes/subjectcode/12000000
broader: instalações religiosas

sinagoga
type: Concept
definition: Em geral, edifício identificável como local de culto para a religião judaica.
in scheme: mediatopic
created: 2009-10-22T02:00:00+00:00
modified: 2021-12-17T12:00:00+00:00
broad match: http://cv.iptc.org/newscodes/subjectcode/12000000
broader: instalações religiosas

templo
type: Concept
definition: Em geral, edifício identificável como local de culto.
in scheme: mediatopic
created: 2009-10-22T02:00:00+00:00
modified: 2021-02-18T12:00:00+00:00
retired: 2021-12-17T12:00:00+00:00
broad match: http://cv.iptc.org/newscodes/subjectcode/12000000
broader: instalações religiosas

instituições religiosas e relações com o estado
type: Concept
definition: Separação legal e social entre instituições religiosas e assuntos de estado.
in scheme: mediatopic
created: 2009-10-22T02:00:00+00:00
modified: 2024-07-01T12:00:00+00:00
broader: religião e crença

líder religioso
type: Concept
definition: Pessoa ou pessoas que têm um papel de liderança ritual, jurídica ou outra em sua igreja ou religião.
in scheme: mediatopic
created: 2009-10-22T02:00:00+00:00
modified: 2021-02-18T12:00:00+00:00
broader: religião e crença
narrower: papa

papa
type: Concept
definition: Chefe da igreja católica romana no mundo.
in scheme: mediatopic
created: 2009-10-22T02:00:00+00:00
modified: 2021-12-17T12:00:00+00:00
broader: líder religioso

textos religiosos
type: Concept
definition: Escrituras sagradas ou importantes para uma igreja ou religião.
in scheme: mediatopic
created: 2009-10-22T02:00:00+00:00
modified: 2021-12-17T12:00:00+00:00
broader: religião e crença
narrower: Bíblia
narrower: Alcorão
narrower: Torá

Bíblia
type: Concept
definition: Escrituras sagradas do cristianismo que consistem no Velho e no Novo Testamento.
in scheme: mediatopic
created: 2009-10-22T02:00:00+00:00
modified: 2021-12-17T12:00:00+00:00
broader: textos religiosos

Alcorão
type: Concept
definition: Livro sagrado do Islã.
in scheme: mediatopic
created: 2009-10-22T02:00:00+00:00
modified: 2021-02-18T12:00:00+00:00
broader: textos religiosos

Torá
type: Concept
definition: Escrituras sagradas do judaísmo.
in scheme: mediatopic
created: 2009-10-22T02:00:00+00:00
modified: 2021-12-17T12:00:00+00:00
broader: textos religiosos

ciência biomédica
type: Concept
definition: Aplicação da ciência baseada na biologia em áreas médicas, como investigação, monitoramento de saúde ou tratamento médico.
in scheme: mediatopic
created: 2009-10-22T02:00:00+00:00
modified: 2021-02-18T12:00:00+00:00
broad match: http://cv.iptc.org/newscodes/subjectcode/13019000
broader: ciência e tecnologia
narrower: biotecnologia

biotecnologia
type: Concept
definition: Manipulação científica de organismos vivos e processos biológicos para fins científicos, médicos ou agrícolas.
in scheme: mediatopic
created: 2009-10-22T02:00:00+00:00
modified: 2021-02-18T12:00:00+00:00
broader: ciência biomédica

medicina dentária
type: Concept
definition: Especialidade médica e ramo de estudos dedicados ao diagnóstico, prevenção e tratamento de condições relativas à saúde oral.
in scheme: mediatopic
created: 2009-10-22T02:00:00+00:00
modified: 2021-02-18T12:00:00+00:00
broad match: http://cv.iptc.org/newscodes/subjectcode/13019000
broader: especialização médica

farmacologia
type: Concept
definition: Especialidade médica e ramo de estudos dedicados aos usos, modos de ação e efeitos dos agentes farmacêuticos.
in scheme: mediatopic
created: 2009-10-22T02:00:00+00:00
modified: 2022-06-14T12:00:00+00:00
retired: 2022-06-14T12:00:00+00:00
broad match: http://cv.iptc.org/newscodes/subjectcode/13019000
broader: especialização médica

medicina veterinária
type: Concept
definition: Especialidade médica e ramo de estudos dedicados ao diagnóstico, prevenção e tratamento de condições médicas nos animais.
in scheme: mediatopic
created: 2009-10-22T02:00:00+00:00
modified: 2021-02-18T12:00:00+00:00
broad match: http://cv.iptc.org/newscodes/subjectcode/13019000
broader: especialização médica

matemática
type: Concept
definition: Estudo da estrutura, espaço, mudança e número em abstrato, muitas vezes usando lógica e linguagem simbólicas, incluindo disciplinas como a geometria, a álgebra ou a trigonometria.
in scheme: mediatopic
created: 2009-10-22T02:00:00+00:00
modified: 2021-02-18T12:00:00+00:00
broader: ciência e tecnologia

engenharia mecânica
type: Concept
definition: Estudo e aplicação da planificação, construção e operação de sistemas mecânicos.
in scheme: mediatopic
created: 2009-10-22T02:00:00+00:00
modified: 2021-02-18T12:00:00+00:00
broad match: http://cv.iptc.org/newscodes/subjectcode/13002000
broader: tecnologia e engenharia

ciências naturais
type: Concept
definition: Ciências que lidam com a matéria, a energia e o mundo físico, incluindo a física, a biologia, a química e a astronomia.
in scheme: mediatopic
created: 2009-10-22T02:00:00+00:00
modified: 2021-02-18T12:00:00+00:00
broader: ciência e tecnologia
narrower: astronomia
narrower: biologia
narrower: química
narrower: cosmologia
narrower: geologia
narrower: horticultura
narrower: ciências marinhas
narrower: meteorologia
narrower: física

astronomia
type: Concept
definition: Estudo de objetos celestes através da observação direta e de modelos teóricos.
in scheme: mediatopic
created: 2009-10-22T02:00:00+00:00
modified: 2021-02-18T12:00:00+00:00
broader: ciências naturais

biologia
type: Concept
definition: Estudo da anatomia, do comportamento, da origem, da fisiologia e de outros aspectos dos organismos vivos.
in scheme: mediatopic
created: 2009-10-22T02:00:00+00:00
modified: 2021-02-18T12:00:00+00:00
broader: ciências naturais
narrower: botânica
narrower: genética
narrower: paleontologia
narrower: fisiologia
narrower: zoologia

botânica
type: Concept
definition: Estudo da estrutura física e fisiológica, da genética, da ecologia e de outros aspectos das plantas.
in scheme: mediatopic
created: 2009-10-22T02:00:00+00:00
modified: 2021-02-18T12:00:00+00:00
broader: biologia

genética
type: Concept
definition: Estudo de genes em organismos vivos e de seu papel na hereditariedade, no desenvolvimento ou na adaptação genética.
in scheme: mediatopic
created: 2009-10-22T02:00:00+00:00
modified: 2021-02-18T12:00:00+00:00
broader: biologia

paleontologia
type: Concept
definition: Estudo de formas de vida pré-históricas, períodos geológicos e fósseis.
in scheme: mediatopic
created: 2009-10-22T02:00:00+00:00
modified: 2021-02-18T12:00:00+00:00
broader: biologia

fisiologia
type: Concept
definition: Estudo dos processos vitais, órgãos internos ou mecanismos funcionais dos organismos vivos.
in scheme: mediatopic
created: 2009-10-22T02:00:00+00:00
modified: 2021-02-18T12:00:00+00:00
broader: biologia

zoologia
type: Concept
definition: Estudo da biologia, da fisiologia, do desenvolvimento, do comportamento ou de outros aspectos dos animais.
in scheme: mediatopic
created: 2009-10-22T02:00:00+00:00
modified: 2021-02-18T12:00:00+00:00
broader: biologia

química
type: Concept
definition: Estudo da composição e propriedades da matéria à escala dos átomos e das moléculas e das reações entre compostos.
in scheme: mediatopic
created: 2009-10-22T02:00:00+00:00
modified: 2021-02-18T12:00:00+00:00
broader: ciências naturais

cosmologia
type: Concept
definition: Estudo da origem, evolução, organização e estrutura do universo.
in scheme: mediatopic
created: 2009-10-22T02:00:00+00:00
modified: 2021-02-18T12:00:00+00:00
broader: ciências naturais

geologia
type: Concept
definition: Estudo dos processos físicos da Terra, das estruturas de materiais e das suas propriedades.
in scheme: mediatopic
created: 2009-10-22T02:00:00+00:00
modified: 2021-02-18T12:00:00+00:00
broader: ciências naturais

horticultura
type: Concept
definition: Estudo e arte do cultivo de plantas, incluindo design paisagístico e de jardins e conservação de plantas.
in scheme: mediatopic
created: 2009-10-22T02:00:00+00:00
modified: 2021-02-18T12:00:00+00:00
broad match: http://cv.iptc.org/newscodes/subjectcode/13004000
broader: ciências naturais

ciências marinhas
type: Concept
definition: Estudo de organismos vivos e de ambientes em ecossistemas de água salgada.
in scheme: mediatopic
created: 2009-10-22T02:00:00+00:00
modified: 2021-02-18T12:00:00+00:00
broader: ciências naturais

meteorologia
type: Concept
definition: Estudo da química e da física da atmosfera e física, com o foco na previsão do tempo.
in scheme: mediatopic
created: 2009-10-22T02:00:00+00:00
modified: 2021-02-18T12:00:00+00:00
broader: ciências naturais

física
type: Concept
definition: Estudo do movimento e estrutura da matéria e de como ela se relaciona com a energia.
in scheme: mediatopic
created: 2009-10-22T02:00:00+00:00
modified: 2021-02-18T12:00:00+00:00
broader: ciências naturais
narrower: eletromagnetismo
narrower: física nuclear

eletromagnetismo
type: Concept
definition: Estudo das interações físicas entre partículas carregadas eletricamente e campos magnéticos.
in scheme: mediatopic
created: 2009-10-22T02:00:00+00:00
modified: 2021-07-12T12:00:00+00:00
broad match: http://cv.iptc.org/newscodes/subjectcode/13001001
broader: física

física nuclear
type: Concept
definition: Estudo da estrutura e comportamento dos núcleos atômicos.
in scheme: mediatopic
created: 2009-10-22T02:00:00+00:00
modified: 2021-02-18T12:00:00+00:00
broad match: http://cv.iptc.org/newscodes/subjectcode/13001001
broader: física
narrower: física de partículas

física de partículas
type: Concept
definition: Estudo da natureza, das propriedades e das interações das partículas elementares que constituem matéria.
in scheme: mediatopic
created: 2009-10-22T02:00:00+00:00
modified: 2021-02-18T12:00:00+00:00
broader: física nuclear

investigação científica
type: Concept
definition: Investigação metódica de eventos, procedimentos etc., para explicar sua causa ou para solucionar problemas.
in scheme: mediatopic
created: 2009-10-22T02:00:00+00:00
modified: 2021-02-18T12:00:00+00:00
broader: ciência e tecnologia
narrower: inovação científica
narrower: investigação médica
narrower: exploração científica
narrower: publicação científica

inovação científica
type: Concept
definition: Desenvolvimento ou criação de novos produtos ou processos científicos ou tecnológicos, como aplicações de biotecnologia ou de inteligência artificial, membros robóticos ou câmaras à escala nanométrica.
in scheme: mediatopic
created: 2009-10-22T02:00:00+00:00
modified: 2021-02-18T12:00:00+00:00
broad match: http://cv.iptc.org/newscodes/subjectcode/13006000
broader: investigação científica

investigação médica
type: Concept
definition: Investigação nas áreas de saúde e medicina, como estudos genéticos, pesquisa de doenças ou testes de drogas farmacêuticas.
in scheme: mediatopic
created: 2009-10-22T02:00:00+00:00
modified: 2021-02-18T12:00:00+00:00
broader: investigação científica

exploração científica
type: Concept
definition: Viagens em terra, no mar ou no espaço para descobrir novas informações.
in scheme: mediatopic
created: 2009-10-22T02:00:00+00:00
modified: 2021-02-18T12:00:00+00:00
broader: investigação científica
narrower: exploração espacial

exploração espacial
type: Concept
definition: Exploração científica do espaço sideral através de missões tripuladas e não tripuladas.
in scheme: mediatopic
created: 2009-10-22T02:00:00+00:00
modified: 2021-02-18T12:00:00+00:00
broader: exploração científica

publicação científica
type: Concept
definition: Resultados de pesquisa acadêmica publicados em uma publicação periódica, em um livro ou em uma tese.
in scheme: mediatopic
created: 2009-10-22T02:00:00+00:00
modified: 2021-02-18T12:00:00+00:00
broad match: http://cv.iptc.org/newscodes/subjectcode/13006000
broader: investigação científica

instituições científicas
type: Concept
definition: Instituições que realizam ou gerem trabalho científico.
in scheme: mediatopic
created: 2009-10-22T02:00:00+00:00
modified: 2021-02-18T12:00:00+00:00
broader: ciência e tecnologia

ciências sociais
type: Concept
definition: Estudo da sociedade humana em aspectos como a linguística, a antropologia, a economia ou a sociologia.
in scheme: mediatopic
created: 2009-10-22T02:00:00+00:00
modified: 2021-02-18T12:00:00+00:00
broader: ciência e tecnologia
narrower: antropologia
narrower: arqueologia
narrower: economia
narrower: geografia
narrower: história
narrower: ciências da informação
narrower: direito
narrower: linguística
narrower: filosofia
narrower: ciência política
narrower: psicologia
narrower: sociologia

antropologia
type: Concept
definition: Estudo do comportamento humano e das interações sociais ao longo do tempo.
in scheme: mediatopic
created: 2009-10-22T02:00:00+00:00
modified: 2021-02-18T12:00:00+00:00
broader: ciências sociais

arqueologia
type: Concept
definition: Estudo da atividade humana ao longo do tempo e da história cultural, usando artefatos deixados por povos antigos.
in scheme: mediatopic
created: 2009-10-22T02:00:00+00:00
modified: 2021-02-18T12:00:00+00:00
broader: ciências sociais

economia
type: Concept
definition: Estudo das leis e princípios das economias, como a produção e distribuição de bens e serviços.
in scheme: mediatopic
created: 2009-10-22T02:00:00+00:00
modified: 2021-02-18T12:00:00+00:00
broad match: http://cv.iptc.org/newscodes/subjectcode/04017000
broader: ciências sociais

geografia
type: Concept
definition: Estudo das características físicas da superfície da Terra e de suas divisões políticas.
in scheme: mediatopic
created: 2009-10-22T02:00:00+00:00
modified: 2021-02-18T12:00:00+00:00
broader: ciências sociais

história
type: Concept
definition: Estudo de eventos humanos do passado.
in scheme: mediatopic
created: 2009-10-22T02:00:00+00:00
modified: 2021-02-18T12:00:00+00:00
broader: ciências sociais

ciências da informação
type: Concept
definition: Estudo e prática de recolher, classificar, armazenar, recuperar e disseminar informação.
in scheme: mediatopic
created: 2009-10-22T02:00:00+00:00
modified: 2021-02-18T12:00:00+00:00
broad match: http://cv.iptc.org/newscodes/subjectcode/13003001
broader: ciências sociais

direito
type: Concept
definition: Estudo dos sistemas jurídicos e da filosofia do direito.
in scheme: mediatopic
created: 2009-10-22T02:00:00+00:00
modified: 2023-10-02T12:00:00+00:00
broad match: http://cv.iptc.org/newscodes/subjectcode/13003001
broader: ciências sociais

linguística
type: Concept
definition: O estudo de todos os aspectos da linguagem humana, como a sintaxe, a fonética, formas escritas e faladas e variações ao longo do tempo.
in scheme: mediatopic
created: 2009-10-22T02:00:00+00:00
modified: 2021-02-18T12:00:00+00:00
broad match: http://cv.iptc.org/newscodes/subjectcode/13000000
broader: ciências sociais

filosofia
type: Concept
definition: Estudo dos princípios e das questões fundamentais sobre assuntos como a mente, a razão, a moralidade ou os valores.
in scheme: mediatopic
created: 2009-10-22T02:00:00+00:00
modified: 2021-02-18T12:00:00+00:00
broader: ciências sociais

ciência política
type: Concept
definition: Estudo dos princípios dos sistemas políticos e governamentais, do pensamento e da ação política.
in scheme: mediatopic
created: 2009-10-22T02:00:00+00:00
modified: 2021-02-18T12:00:00+00:00
broad match: http://cv.iptc.org/newscodes/subjectcode/13000000
broader: ciências sociais

psicologia
type: Concept
definition: Estudo da mente humana, das características mentais e dos processos emocionais.
in scheme: mediatopic
created: 2009-10-22T02:00:00+00:00
modified: 2021-02-18T12:00:00+00:00
broader: ciências sociais

sociologia
type: Concept
definition: Estudo da organização social humana e das relações e mudanças sociais.
in scheme: mediatopic
created: 2009-10-22T02:00:00+00:00
modified: 2021-02-18T12:00:00+00:00
broader: ciências sociais

normas científicas
type: Concept
definition: Regras, nacionais ou internacionais, que regulam o estudo e desenvolvimento científico e tecnológico, tais como padrões de calibração de ferramentas científicas ou equipamento.
in scheme: mediatopic
created: 2009-10-22T02:00:00+00:00
modified: 2021-02-18T12:00:00+00:00
broader: ciência e tecnologia

tecnologia e engenharia
type: Concept
definition: Estudo e prática de ciências industriais ou aplicadas, como a física, a hidrodinâmica ou a termodinâmica.
in scheme: mediatopic
created: 2009-10-22T02:00:00+00:00
modified: 2021-02-18T12:00:00+00:00
broad match: http://cv.iptc.org/newscodes/subjectcode/13000000
broader: ciência e tecnologia
narrower: engenharia mecânica
narrower: engenharia aeroespacial
narrower: tecnologia agrícola
narrower: engenharia civil
narrower: engenharia eletrônica
narrower: tecnologia de identificação
narrower: tecnologias de informação
narrower: ciência dos materiais
narrower: nanociência

engenharia aeroespacial
type: Concept
definition: Estudo, projeto, desenvolvimento e construção de aeronaves, espaçonaves e sistemas de mísseis.
in scheme: mediatopic
created: 2009-10-22T02:00:00+00:00
modified: 2021-02-18T12:00:00+00:00
broad match: http://cv.iptc.org/newscodes/subjectcode/04011001
broader: tecnologia e engenharia
narrower: ciência de foguetes

ciência de foguetes
type: Concept
definition: Estudo, concepção, desenvolvimento e construção de foguetes.
in scheme: mediatopic
created: 2009-10-22T02:00:00+00:00
modified: 2021-02-18T12:00:00+00:00
broader: engenharia aeroespacial

tecnologia agrícola
type: Concept
definition: Estudo e desenvolvimento de técnicas e maquinário para melhorar a gestão e a produtividade agrícola.
in scheme: mediatopic
created: 2009-10-22T02:00:00+00:00
modified: 2021-05-05T12:00:00+00:00
broad match: http://cv.iptc.org/newscodes/subjectcode/13020000
broader: tecnologia e engenharia

engenharia civil
type: Concept
definition: Estudo, projeto, desenvolvimento e construção de estruturas como edifícios, pontes, túneis, sistemas de irrigação, sistemas de esgoto, ruas ou ferrovias.
in scheme: mediatopic
created: 2009-10-22T02:00:00+00:00
modified: 2021-02-18T12:00:00+00:00
broad match: http://cv.iptc.org/newscodes/subjectcode/13002000
broader: tecnologia e engenharia

engenharia eletrônica
type: Concept
definition: Estudo, concepção, desenvolvimento e aplicação de sistemas construídos sobre a troca de cargas elétricas, como dispositivos de consumo, sistemas de comunicação ou computadores industriais.
in scheme: mediatopic
created: 2009-10-22T02:00:00+00:00
modified: 2021-02-18T12:00:00+00:00
broader: tecnologia e engenharia

tecnologia de identificação
type: Concept
definition: Estudo, desenvolvimento, aplicação e considerações éticas dos métodos tecnológicos para identificação de produtos, animais ou pessoas; inclui radiofrequência, biometria ou reconhecimento facial.
in scheme: mediatopic
created: 2009-10-22T02:00:00+00:00
modified: 2021-02-18T12:00:00+00:00
broader: tecnologia e engenharia

tecnologias de informação
type: Concept
definition: Estudo e desenvolvimento de sistemas computacionais, software e redes.
in scheme: mediatopic
created: 2009-10-22T02:00:00+00:00
modified: 2021-02-18T12:00:00+00:00
broader: tecnologia e engenharia
narrower: inteligência artificial

ciência dos materiais
type: Concept
definition: Estudo da composição, estrutura e propriedades dos materiais para seu uso na indústria e na manufatura.
in scheme: mediatopic
created: 2009-10-22T02:00:00+00:00
modified: 2021-02-18T12:00:00+00:00
broader: tecnologia e engenharia

nanociência
type: Concept
definition: Estudo e tecnologias construídas em escala microscópica, como a microbiologia ou a microcomputação.
in scheme: mediatopic
created: 2009-10-22T02:00:00+00:00
modified: 2021-02-18T12:00:00+00:00
broader: tecnologia e engenharia
narrower: nanotecnologia

nanotecnologia
type: Concept
definition: Manipulação de objetos à escala molecular.
in scheme: mediatopic
created: 2009-10-22T02:00:00+00:00
modified: 2021-02-18T12:00:00+00:00
broader: nanociência

comunidades
type: Concept
definition: Grupo de indivíduos que partilha de forma ativa um valor ou interesse comum.
in scheme: mediatopic
created: 2009-10-22T02:00:00+00:00
modified: 2021-02-18T12:00:00+00:00
broad match: http://cv.iptc.org/newscodes/subjectcode/14024000
broader: sociedade
narrower: redes sociais
narrower: http://cv.iptc.org/newscodes/mediatopic/20001360

redes sociais
type: Concept
definition: Construção de comunidades de pessoas, incluindo o uso de meios de mídia online.
in scheme: mediatopic
created: 2009-10-22T02:00:00+00:00
modified: 2021-02-18T12:00:00+00:00
broad match: http://cv.iptc.org/newscodes/subjectcode/14000000
broader: comunidades

demografia
type: Concept
definition: Estudo dos povos, do lugar onde habitam e do modo como interagem.
in scheme: mediatopic
created: 2009-10-22T02:00:00+00:00
modified: 2021-02-18T12:00:00+00:00
broader: sociedade
narrower: população e censos

imigração
type: Concept
definition: Movimentação de indivíduos de um país a outro.
in scheme: mediatopic
created: 2009-10-22T02:00:00+00:00
modified: 2021-02-18T12:00:00+00:00
broader: sociedade
narrower: imigrantes ilegais

emigrantes
type: Concept
definition: Pessoas que deixam seu país de origem; sua relação com seu país de origem e associação com outros emigrantes.
in scheme: mediatopic
created: 2009-10-22T02:00:00+00:00
modified: 2021-07-12T12:00:00+00:00
broader: sociedade

imigrantes ilegais
type: Concept
definition: Movimentação de indivíduos de um país a outro por meios ilícitos.
in scheme: mediatopic
created: 2009-10-22T02:00:00+00:00
modified: 2021-02-18T12:00:00+00:00
broader: imigração

população e censos
type: Concept
definition: População é o número de pessoas em uma região geográfica e censo é o processo de sua contagem.
in scheme: mediatopic
created: 2009-10-22T02:00:00+00:00
modified: 2021-05-05T12:00:00+00:00
broader: demografia

discriminação
type: Concept
definition: Negação de serviços a uma ou mais pessoas por questões de raça, cor, identidade sexual, religião, crenças políticas etc.
in scheme: mediatopic
created: 2009-10-22T02:00:00+00:00
modified: 2021-02-18T12:00:00+00:00
broader: sociedade
narrower: idadismo
narrower: racismo
narrower: discriminação religiosa
narrower: sexismo

idadismo
type: Concept
definition: Atitudes hostis ou discriminatórias em relação a outro grupo com base em critérios de idade.
in scheme: mediatopic
created: 2009-10-22T02:00:00+00:00
modified: 2021-02-18T12:00:00+00:00
broad match: http://cv.iptc.org/newscodes/subjectcode/14025003
broader: discriminação

racismo
type: Concept
definition: Atitudes ou comportamento nocivos contra um grupo, em função de diferenças raciais.
in scheme: mediatopic
created: 2009-10-22T02:00:00+00:00
modified: 2021-02-18T12:00:00+00:00
broader: discriminação

discriminação religiosa
type: Concept
definition: Atitudes hostis ou discriminatórias em relação a outro grupo com base em diferenças de crença ou fé.
in scheme: mediatopic
created: 2009-10-22T02:00:00+00:00
modified: 2021-02-18T12:00:00+00:00
broad match: http://cv.iptc.org/newscodes/subjectcode/14025003
broader: discriminação

sexismo
type: Concept
definition: Atitudes hostis ou discriminatórias em relação a outro grupo com base em critérios de gênero.
in scheme: mediatopic
created: 2009-10-22T02:00:00+00:00
modified: 2021-09-30T12:00:00+00:00
broad match: http://cv.iptc.org/newscodes/subjectcode/14025003
broader: discriminação

família
type: Concept
definition: Grupo de indivíduos relacionados por laços de sangue e casamento.
in scheme: mediatopic
created: 2009-10-22T02:00:00+00:00
modified: 2021-02-18T12:00:00+00:00
broader: sociedade
narrower: adoção
narrower: namoro
narrower: divórcio
narrower: planejamento familiar
narrower: casamento
narrower: pais e filhos
narrower: http://cv.iptc.org/newscodes/mediatopic/20001359

adoção
type: Concept
definition: Processo legal que integra uma criança sem apoio de pais numa família ou união de apoio.
in scheme: mediatopic
created: 2009-10-22T02:00:00+00:00
modified: 2021-02-18T12:00:00+00:00
broader: família

namoro
type: Concept
definition: Procedimento para cortejar e conquistar um parceiro.
in scheme: mediatopic
created: 2009-10-22T02:00:00+00:00
modified: 2021-07-12T12:00:00+00:00
broader: família

divórcio
type: Concept
definition: Processo através do qual um casamento é dissolvido.
in scheme: mediatopic
created: 2009-10-22T02:00:00+00:00
modified: 2022-06-14T12:00:00+00:00
broader: família

planejamento familiar
type: Concept
definition: Decisões conscientes e esforços relativos à reprodução.
in scheme: mediatopic
created: 2009-10-22T02:00:00+00:00
modified: 2022-06-14T12:00:00+00:00
broader: família
narrower: aborto
narrower: contracepção

aborto
type: Concept
definition: Geralmente, interrupção planejada do processo de reprodução de vida humana.
in scheme: mediatopic
created: 2009-10-22T02:00:00+00:00
modified: 2021-02-18T12:00:00+00:00
broader: planejamento familiar

casamento
type: Concept
definition: União de duas pessoas que juram fidelidade, respeito e apoio mútuos.
in scheme: mediatopic
created: 2009-10-22T02:00:00+00:00
modified: 2021-03-15T12:00:00+00:00
broader: família

pais e filhos
type: Concept
definition: Dois ou mais indivíduos com uma relação familiar hierárquica.
in scheme: mediatopic
created: 2009-10-22T02:00:00+00:00
modified: 2021-02-18T12:00:00+00:00
broader: família

humanidade
type: Concept
definition: Indivíduos como um todo, por vezes divididos em classes, como povos indígenas, pessoas de classe etc.
in scheme: mediatopic
created: 2009-10-22T02:00:00+00:00
modified: 2025-06-30T12:00:00+00:00
broader: sociedade
narrower: adultos
narrower: crianças
narrower: deficiências
narrower: LGBT
narrower: gênero
narrower: bebês
narrower: minoria étnica ou nacional
narrower: vítimas de radiação nuclear
narrower: terceira idade
narrower: adolescentes
narrower: povo indígena
narrower: http://cv.iptc.org/newscodes/mediatopic/20001327
narrower: http://cv.iptc.org/newscodes/mediatopic/20001328

adultos
type: Concept
definition: Pessoas acima da idade definida por lei para adquirir responsabilidade total.
in scheme: mediatopic
created: 2009-10-22T02:00:00+00:00
modified: 2021-02-18T12:00:00+00:00
broader: humanidade

crianças
type: Concept
definition: Pessoas imaturas, geralmente até a idade da puberdade.
in scheme: mediatopic
created: 2009-10-22T02:00:00+00:00
modified: 2021-02-18T12:00:00+00:00
broader: humanidade

deficiências
type: Concept
definition: Condições físicas ou mentais que limitam os movimentos, sentidos ou atividades de uma pessoa.
in scheme: mediatopic
created: 2009-10-22T02:00:00+00:00
modified: 2024-03-28T12:00:00+00:00
broader: humanidade

LGBT
type: Concept
definition: Pessoas que se identificam como lésbicas, gays, bissexuais ou transexuais.
in scheme: mediatopic
created: 2009-10-22T02:00:00+00:00
modified: 2021-05-05T12:00:00+00:00
broader: humanidade

gênero
type: Concept
definition: Classificação de indivíduos como masculinos ou femininos.
in scheme: mediatopic
created: 2009-10-22T02:00:00+00:00
modified: 2021-02-18T12:00:00+00:00
broad match: http://cv.iptc.org/newscodes/subjectcode/14024000
broader: humanidade

bebês
type: Concept
definition: Indivíduos na fase que vai do nascimento até à idade de 1-2 anos, geralmente quando começam a caminhar.
in scheme: mediatopic
created: 2009-10-22T02:00:00+00:00
modified: 2021-02-18T12:00:00+00:00
broader: humanidade

minoria étnica ou nacional
type: Concept
definition: Grupos de pessoas que formam uma minoria étnica ou nacional, seu estatuto, seus problemas e suas relações com a maioria.
in scheme: mediatopic
created: 2009-10-22T02:00:00+00:00
modified: 2021-02-18T12:00:00+00:00
broader: humanidade

vítimas de radiação nuclear
type: Concept
definition: Inclui movimentos antinucleares e indenizações às vítimas de explosões nucleares.
in scheme: mediatopic
created: 2009-10-22T02:00:00+00:00
modified: 2021-02-18T12:00:00+00:00
retired: 2019-10-07T12:00:00+00:00
broader: humanidade

terceira idade
type: Concept
definition: Pessoas que já chegaram à idade da aposentadoria.
in scheme: mediatopic
created: 2009-10-22T02:00:00+00:00
modified: 2021-02-18T12:00:00+00:00
broader: humanidade

adolescentes
type: Concept
definition: Pessoas que estão numa idade entre a infância e a idade adulta.
in scheme: mediatopic
created: 2009-10-22T02:00:00+00:00
modified: 2021-02-18T12:00:00+00:00
broader: humanidade

condição social
type: Concept
definition: Condições em que as pessoas vivem no que diz respeito a habitação, abastecimento de água, disponibilidade de educação.
in scheme: mediatopic
created: 2009-10-22T02:00:00+00:00
modified: 2021-05-05T12:00:00+00:00
broader: sociedade
narrower: sem-teto
narrower: pobreza

sem-teto
type: Concept
definition: Ausência de local de moradia fixa.
in scheme: mediatopic
created: 2009-10-22T02:00:00+00:00
modified: 2021-02-18T12:00:00+00:00
broader: condição social

pobreza
type: Concept
definition: Insuficiência de recursos para garantir os serviços básicos e a subsistência de alguém ou de sua família.
in scheme: mediatopic
created: 2009-10-22T02:00:00+00:00
modified: 2021-02-18T12:00:00+00:00
broader: condição social

problemas sociais
type: Concept
definition: Problemas que afetam a vida dos indivíduos.
in scheme: mediatopic
created: 2009-10-22T02:00:00+00:00
modified: 2021-02-18T12:00:00+00:00
broad match: http://cv.iptc.org/newscodes/subjectcode/14025002
broader: sociedade
narrower: maus-tratos
narrower: adição
narrower: delinquência juvenil
narrower: prostituição
narrower: escravatura
narrower: má conduta sexual
narrower: bullying

maus-tratos
type: Concept
definition: Comportamento violento ou cruel contra um ou mais indivíduos, através de tratamento desumano, incluindo abuso sexual ou mental, privação de sentidos, de necessidades físicas, abusos físicos, incluindo espancamentos e outras formas de tortura.
in scheme: mediatopic
created: 2009-10-22T02:00:00+00:00
modified: 2021-02-18T12:00:00+00:00
broader: problemas sociais

adição
type: Concept
definition: Consumo habitual e normalmente incontrolável de substâncias nocivas, como álcool, tabaco, medicamentos ou drogas.
in scheme: mediatopic
created: 2009-10-22T02:00:00+00:00
modified: 2021-02-18T12:00:00+00:00
broader: problemas sociais

delinquência juvenil
type: Concept
definition: Atos de delinquência realizados por menores de idade.
in scheme: mediatopic
created: 2009-10-22T02:00:00+00:00
modified: 2021-02-18T12:00:00+00:00
broader: problemas sociais

prostituição
type: Concept
definition: Venda de sexo, masculino ou feminino, e aqueles que beneficiam dessa venda.
in scheme: mediatopic
created: 2009-10-22T02:00:00+00:00
modified: 2021-02-18T12:00:00+00:00
broader: problemas sociais

escravatura
type: Concept
definition: Submissão involuntária, fora do encarceramento legal por crimes passíveis de punição, de homens, mulheres e crianças, incluindo trabalho involuntário não remunerado, atos de coerção, trabalho infantil.
in scheme: mediatopic
created: 2009-10-22T02:00:00+00:00
modified: 2021-02-18T12:00:00+00:00
broader: problemas sociais

valores
type: Concept
definition: Níveis de conduta e sua aceitação pela comunidade.
in scheme: mediatopic
created: 2009-10-22T02:00:00+00:00
modified: 2021-02-18T12:00:00+00:00
broader: sociedade
narrower: práticas corruptas
narrower: morte
narrower: ética
narrower: pornografia
narrower: comportamento sexual

práticas corruptas
type: Concept
definition: Toda ação que seja nociva para os outros.
in scheme: mediatopic
created: 2009-10-22T02:00:00+00:00
modified: 2021-02-18T12:00:00+00:00
retired: 2019-10-07T12:00:00+00:00
broader: valores

morte
type: Concept
definition: Questões sociais relacionadas com a morte.
in scheme: mediatopic
created: 2009-10-22T02:00:00+00:00
modified: 2021-02-18T12:00:00+00:00
broader: valores
narrower: eutanásia
narrower: suicídio

eutanásia
type: Concept
definition: Ajuda à morte de uma pessoa com uma doença terminal.
in scheme: mediatopic
created: 2009-10-22T02:00:00+00:00
modified: 2021-02-18T12:00:00+00:00
broader: morte
narrower: suicídio assistido

suicídio assistido
type: Concept
definition: Morte pelas próprias mãos com a ajuda de outra pessoa.
in scheme: mediatopic
created: 2009-10-22T02:00:00+00:00
modified: 2021-02-18T12:00:00+00:00
broad match: http://cv.iptc.org/newscodes/subjectcode/14005000
broader: eutanásia

suicídio
type: Concept
definition: Morte de uma pessoa por suas próprias mãos.
in scheme: mediatopic
created: 2009-10-22T02:00:00+00:00
modified: 2021-02-18T12:00:00+00:00
broader: morte

ética
type: Concept
definition: Sistema de crenças acerca de uma conduta aceitável.
in scheme: mediatopic
created: 2009-10-22T02:00:00+00:00
modified: 2021-07-12T12:00:00+00:00
broader: valores

pornografia
type: Concept
definition: Representações visuais, audiovisuais ou textuais de vários atos relacionados ao sexo e considerados fora dos padrões aceitos pela comunidade.
in scheme: mediatopic
created: 2009-10-22T02:00:00+00:00
modified: 2021-02-18T12:00:00+00:00
broader: valores

comportamento sexual
type: Concept
definition: Comportamento sexual de indivíduos ou grupos.
in scheme: mediatopic
created: 2009-10-22T02:00:00+00:00
modified: 2021-02-18T12:00:00+00:00
broad match: http://cv.iptc.org/newscodes/subjectcode/12006000
broader: valores

assistência social
type: Concept
definition: Ajuda para quem precisa de comida, habitação, saúde e outros serviços.
in scheme: mediatopic
created: 2009-10-22T02:00:00+00:00
modified: 2021-02-18T12:00:00+00:00
broader: sociedade
narrower: filantropia
narrower: cuidados continuados
narrower: serviços sociais
narrower: assistência a idosos
narrower: habitação social
narrower: assistência infantil

filantropia
type: Concept
definition: Doação filantrópica.
in scheme: mediatopic
created: 2009-10-22T02:00:00+00:00
modified: 2021-05-05T12:00:00+00:00
broader: assistência social

cuidados continuados
type: Concept
definition: Serviços e cuidados de saúde prestados de forma prolongada e continuada a pacientes que sofrem de doenças crônicas ou deficiência.
in scheme: mediatopic
created: 2009-10-22T02:00:00+00:00
modified: 2021-05-05T12:00:00+00:00
broader: assistência social

serviços sociais
type: Concept
definition: Programas apoiados para melhorar o bem-estar de indivíduos ou grupos de indivíduos.
in scheme: mediatopic
created: 2009-10-22T02:00:00+00:00
modified: 2021-02-18T12:00:00+00:00
broader: assistência social

disciplina de competição
type: Concept
definition: Diferentes tipos de esportes que podem ser executados em competições.
in scheme: mediatopic
created: 2009-10-22T02:00:00+00:00
modified: 2021-02-18T12:00:00+00:00
has facet: distance
has facet: racetime
broad match: http://cv.iptc.org/newscodes/subjectcode/15000000
has facet: teamsize
has facet: parasporttype
has facet: ageclass
has facet: parasport
has facet: racetype
has facet: gender
broader: esporte
narrower: futebol americano
narrower: tiro com arco
narrower: atletismo
narrower: futebol australiano
narrower: badminton
narrower: bandy
narrower: beisebol
narrower: basquete
narrower: biatlo
narrower: bilhar
narrower: bobsled
narrower: petanca
narrower: boxe
narrower: tourada
narrower: futebol canadense
narrower: canoagem
narrower: casting (pesca)
narrower: alpinismo
narrower: escalada
narrower: críquete
narrower: croquet
narrower: curling
narrower: ciclismo
narrower: dança rítmica
narrower: dardos
narrower: saltos ornamentais
narrower: esportes subaquáticos
narrower: corrida de cães
narrower: duatlo
narrower: hipismo
narrower: esgrima
narrower: hóquei em campo
narrower: patinação artística
narrower: punhobol
narrower: floorball
narrower: frisbee
narrower: futebol gaélico
narrower: golfe
narrower: ginástica
narrower: handebol
narrower: hornuss
narrower: corridas de cavalos
narrower: hurling
narrower: hóquei no gelo
narrower: patinação em linha
narrower: pelota basca
narrower: kabaddi
narrower: caiaque
narrower: lacrosse
narrower: luge
narrower: maratona
narrower: pentatlo moderno
narrower: corrida de barcos a motor
narrower: corrida de automóveis
narrower: motociclismo
narrower: netball
narrower: orientação
narrower: paraquedismo
narrower: polo
narrower: motonáutica
narrower: rodeio
narrower: remo
narrower: vela

futebol americano
type: Concept
definition: Jogo de bola que opõe duas equipes, compostas por uma secção de ataque e outra de defesa. Cada ataque avança em direção à defesa contrária, movendo uma bola ovalada pelo campo até à *end zone* para marcar *touchdown* e ganhar pontos.
in scheme: mediatopic
created: 2009-10-22T02:00:00+00:00
modified: 2021-02-18T12:00:00+00:00
broader: disciplina de competição

tiro com arco
type: Concept
definition: Os arqueiros usam arcos e flechas para acertar em alvos de 1.22 metros de diâmetro, colocados a cerca de 710 metros de distância.
in scheme: mediatopic
created: 2009-10-22T02:00:00+00:00
modified: 2021-02-18T12:00:00+00:00
broader: disciplina de competição
narrower: tiro com besta
narrower: tiro com arco longo

tiro com besta
type: Concept
definition: Tiro com besta contra alvos colocados a várias distâncias.
in scheme: mediatopic
created: 2009-10-22T02:00:00+00:00
modified: 2021-02-18T12:00:00+00:00
broader: tiro com arco

tiro com arco longo
type: Concept
definition: Tiro com arco longo contra alvos colocados a várias distâncias. A competição decorre no exterior, em um campo grande e plano.
in scheme: mediatopic
created: 2009-10-22T02:00:00+00:00
modified: 2021-05-05T12:00:00+00:00
broad match: http://cv.iptc.org/newscodes/subjectcode/15004000
broader: tiro com arco

atletismo
type: Concept
definition: Competições que envolvem corridas a pé, saltos e lançamentos, em pista de estádio ou ao ar livre.
in scheme: mediatopic
created: 2009-10-22T02:00:00+00:00
modified: 2021-05-05T12:00:00+00:00
broader: disciplina de competição
narrower: corrida de cross-country
narrower: decatlo
narrower: lançamento de disco
narrower: lançamento de martelo
narrower: heptatlo
narrower: salto em altura
narrower: barreiras
narrower: lançamento de dardo
narrower: corrida de fundo
narrower: salto em distância
narrower: corrida de meio-fundo
narrower: pentatlo
narrower: salto com vara
narrower: marcha atlética
narrower: revezamento
narrower: arremesso de peso
narrower: sprint
narrower: salto triplo
narrower: corrida de obstáculos (atletismo)

corrida de cross-country
type: Concept
definition: Os atletas correm em terreno acidentado e não em uma pista.
in scheme: mediatopic
created: 2009-10-22T02:00:00+00:00
modified: 2021-05-05T12:00:00+00:00
broad match: http://cv.iptc.org/newscodes/subjectcode/15005000
broader: atletismo

decatlo
type: Concept
definition: Competição individual masculina envolvendo 10 provas diferentes durante 2 dias. 1º dia: 100m, salto em distância, lançamento de peso, salto em altura e 400m. 2º dia: 110m barreiras, lançamento de disco, salto com vara, lançamento de dardo e 1500m.
in scheme: mediatopic
created: 2009-10-22T02:00:00+00:00
modified: 2021-02-18T12:00:00+00:00
broader: atletismo

lançamento de disco
type: Concept
definition: Prova em que os atletas, dentro de um círculo com 2.50 metros de diâmetro, dão várias voltas antes de lançarem o mais longe possível um disco de metal que pesa 2 kg para os homens e 1 kg para as mulheres. Ganha quem fizer o lançamento mais longo.
in scheme: mediatopic
created: 2009-10-22T02:00:00+00:00
modified: 2021-02-18T12:00:00+00:00
broader: atletismo

lançamento de martelo
type: Concept
definition: Prova em que os atletas, dentro de um círculo com 2.13 metros de diâmetro, lançam o mais longe possível um martelo (bola de metal, com cabo e pega) que pesa 7.26 kg para os homens e 4 kg para as mulheres. Ganha quem fizer o lançamento mais longo.
in scheme: mediatopic
created: 2009-10-22T02:00:00+00:00
modified: 2021-02-18T12:00:00+00:00
broader: atletismo

heptatlo
type: Concept
definition: Competição individual feminina que consiste em acumular pontos em 7 provas diferentes durante 2 dias. 1º dia: 100m barreiras, salto em altura, arremesso de peso e 200m. 2º dia: salto em distância, lançamento de dardo e 800m.
in scheme: mediatopic
created: 2009-10-22T02:00:00+00:00
modified: 2021-02-18T12:00:00+00:00
broader: atletismo

salto em altura
type: Concept
definition: Prova em que os atletas saltam o mais alto possível sobre uma barra horizontal, que é subida a cada ronda de saltos. Ganha quem atingir a marca mais alta.
in scheme: mediatopic
created: 2009-10-22T02:00:00+00:00
modified: 2021-02-18T12:00:00+00:00
broader: atletismo

barreiras
type: Concept
definition: Corrida de velocidade em que os atletas saltam sobre uma série de obstáculos verticais.
in scheme: mediatopic
created: 2009-10-22T02:00:00+00:00
modified: 2021-05-05T12:00:00+00:00
broad match: http://cv.iptc.org/newscodes/subjectcode/15005000
broader: atletismo

lançamento de dardo
type: Concept
definition: Prova em que os atletas, a partir de uma área de lançamento própria, arremessam o mais longe possível um dardo que pesa 800 gramas para os homens e 600 gramas para as mulheres. Ganha quem fizer o lançamento mais longo.
in scheme: mediatopic
created: 2009-10-22T02:00:00+00:00
modified: 2021-02-18T12:00:00+00:00
broader: atletismo

corrida de fundo
type: Concept
definition: Corrida de distâncias superiores a 1500 metros.
in scheme: mediatopic
created: 2009-10-22T02:00:00+00:00
modified: 2021-02-18T12:00:00+00:00
broad match: http://cv.iptc.org/newscodes/subjectcode/15005000
broader: atletismo

salto em distância
type: Concept
definition: Prova em que os atletas fazem uma corrida curta para ganhar velocidade até um ponto determinado e depois se impulsionam saltando para a frente antes de caírem sobre uma caixa de areia. Ganha quem fizer o salto mais longo.
in scheme: mediatopic
created: 2009-10-22T02:00:00+00:00
modified: 2021-02-18T12:00:00+00:00
broader: atletismo

corrida de meio-fundo
type: Concept
definition: Corrida de distâncias entre 400 e 1500 metros.
in scheme: mediatopic
created: 2009-10-22T02:00:00+00:00
modified: 2021-02-18T12:00:00+00:00
broad match: http://cv.iptc.org/newscodes/subjectcode/15005000
broader: atletismo

pentatlo
type: Concept
definition: Competição em pista fechada composta por 60 m barreiras, salto em altura, arremesso de peso, salto em distância, 800 m.
in scheme: mediatopic
created: 2009-10-22T02:00:00+00:00
modified: 2021-02-18T12:00:00+00:00
broader: atletismo

salto com vara
type: Concept
definition: Prova em que os atletas usam uma vara flexível para se projetarem com os pés para o ar e transpor uma barra horizontal que é subida a cada ronda de saltos. Ganha quem atingir a marca mais alta.
in scheme: mediatopic
created: 2009-10-22T02:00:00+00:00
modified: 2021-02-18T12:00:00+00:00
broader: atletismo

marcha atlética
type: Concept
definition: Corrida em que o atleta deve manter um dos pés sempre em contato com o chão.
in scheme: mediatopic
created: 2009-10-22T02:00:00+00:00
modified: 2021-02-18T12:00:00+00:00
broad match: http://cv.iptc.org/newscodes/subjectcode/15005000
broader: atletismo

revezamento
type: Concept
definition: Atletas da mesma equipe se revezam durante um percurso, cumprindo distâncias iguais.
in scheme: mediatopic
created: 2009-10-22T02:00:00+00:00
modified: 2021-02-18T12:00:00+00:00
broad match: http://cv.iptc.org/newscodes/subjectcode/15005000
broader: atletismo

arremesso de peso
type: Concept
definition: Prova em que os atletas, dentro de um círculo com 2.13 metros de diâmetro, tentam lançar o mais longe possível uma bola de metal que pesa 7,26 kg para os homens e 4 kg para as mulheres. Ganha quem fizer o lançamento mais longo.
in scheme: mediatopic
created: 2009-10-22T02:00:00+00:00
modified: 2021-02-18T12:00:00+00:00
broader: atletismo

sprint
type: Concept
definition: Corrida de velocidade de distâncias até 400 metros.
in scheme: mediatopic
created: 2009-10-22T02:00:00+00:00
modified: 2021-02-18T12:00:00+00:00
broader: atletismo

salto triplo
type: Concept
definition: Prova em que os atletas fazem uma corrida curta para ganhar velocidade até um ponto determinado e depois se impulsionam encadeando três saltos sucessivos que terminam com uma queda sobre uma caixa de areia. Ganha quem fizer o salto mais longo.
in scheme: mediatopic
created: 2009-10-22T02:00:00+00:00
modified: 2021-02-18T12:00:00+00:00
broader: atletismo

futebol australiano
type: Concept
definition: Tipo de futebol disputado por duas equipes de 18 jogadores em campo, que correm e passam uma bola oval. São atribuídos pontos quando a bola passa por entre os postes do gol. É regulamentado pela Liga de Futebol Australiano.
in scheme: mediatopic
created: 2009-10-22T02:00:00+00:00
modified: 2021-02-18T12:00:00+00:00
broader: disciplina de competição

badminton
type: Concept
definition: Dois jogadores ou duas duplas competem batendo uma peteca com uma raquete, sobre uma rede alta. O objetivo de cada jogador/dupla é impedir a peteca de tocar o chão em seu lado da quadra.
in scheme: mediatopic
created: 2009-10-22T02:00:00+00:00
modified: 2021-02-18T12:00:00+00:00
broader: disciplina de competição

bandy
type: Concept
definition: Espécie de hóquei no gelo, jogado ao ar livre, sobre uma pista de gelo aproximadamente do tamanho de um campo de futebol. Os jogadores usam uma pequena bola dura e tacos, muito parecidos com os do hóquei no gelo, mas mais curtos e mais arredondados.
in scheme: mediatopic
created: 2009-10-22T02:00:00+00:00
modified: 2021-02-18T12:00:00+00:00
broader: disciplina de competição

beisebol
type: Concept
definition: Jogo disputado entre 2 equipes de 9 jogadores em campo fechado. Ganha a equipe que marcar mais pontos durante a partida. Para marcar um ponto, o jogador, após bater a bola com um bastão, deve dar a volta ao campo marcado por 4 bases externas.
in scheme: mediatopic
created: 2009-10-22T02:00:00+00:00
modified: 2021-02-18T12:00:00+00:00
broader: disciplina de competição
narrower: beisebol de bola de borracha

beisebol de bola de borracha
type: Concept
definition: Também denominado *soft baseball*, é um jogo de beisebol disputado com uma bola de borracha de dureza variável, dependendo das idades ou níveis dos jogadores.
in scheme: mediatopic
created: 2009-10-22T02:00:00+00:00
modified: 2021-05-05T12:00:00+00:00
broader: beisebol

basquete
type: Concept
definition: Jogo disputado entre duas equipes de 5 jogadores. Pontos são marcados quando uma bola é encestada num aro com rede, que se encontra a uma altura de 3.05m do solo.
in scheme: mediatopic
created: 2009-10-22T02:00:00+00:00
modified: 2021-02-18T12:00:00+00:00
broader: disciplina de competição

biatlo
type: Concept
definition: Prova que combina esqui de fundo com tiro ao alvo, em uma corrida de perseguição de 12.5 km.
in scheme: mediatopic
created: 2009-10-22T02:00:00+00:00
modified: 2021-05-05T12:00:00+00:00
broader: disciplina de competição

bilhar
type: Concept
definition: Esporte de taco e bolas disputado sobre uma mesa e sem ordem específica para as jogar.
in scheme: mediatopic
created: 2009-10-22T02:00:00+00:00
modified: 2021-02-18T12:00:00+00:00
broad match: http://cv.iptc.org/newscodes/subjectcode/15010000
has facet: billiardtype
broader: disciplina de competição

bobsled
type: Concept
definition: Esporte de inverno em que equipes de 2 ou 4 pessoas, sentadas em um trenó com casco assente em 4 trilhos de aço, deslizam por uma estreita pista de gelo protegida lateralmente e com muitas curvas.
in scheme: mediatopic
created: 2009-10-22T02:00:00+00:00
modified: 2022-02-03T12:00:00+00:00
broader: disciplina de competição

petanca
type: Concept
definition: Jogo que consiste no lançamento de bolas de aço com o objetivo de ficarem o mais próximo possível do alvo, uma pequena bola de madeira que é atirada no início do jogo.
in scheme: mediatopic
created: 2009-10-22T02:00:00+00:00
modified: 2021-05-05T12:00:00+00:00
broader: disciplina de competição

boxe
type: Concept
definition: Esporte de combate em que dois homens ou duas mulheres lutam usando apenas os punhos protegidos por luvas, num ringue quadrado de 6m de lado. A luta é geralmente dividida em 12 assaltos de 3 minutos cada.
in scheme: mediatopic
created: 2009-10-22T02:00:00+00:00
modified: 2021-02-18T12:00:00+00:00
has facet: weightclasstype
broader: disciplina de competição
narrower: peso-galo (boxe)
narrower: peso-cruzador (boxe)
narrower: peso-pena (boxe)
narrower: peso-mosca (boxe)
narrower: peso-pesado (boxe)
narrower: peso-mosca-ligeiro (boxe)
narrower: peso-meio-pesado (boxe)
narrower: peso-médio-ligeiro (boxe)
narrower: peso-meio-médio-ligeiro (boxe)
narrower: peso-leve (boxe)
narrower: peso-médio (boxe)
narrower: peso-palha (boxe)
narrower: peso-supergalo (boxe)
narrower: peso-superpena (boxe)
narrower: peso-supermosca (boxe)
narrower: peso-superpesado (boxe)
narrower: peso-supermédio (boxe)
narrower: peso-meio-médio (boxe)

peso-galo (boxe)
type: Concept
definition: Categoria de peso que varia segundo a federação ou os Jogos Olímpicos.
in scheme: mediatopic
created: 2009-10-22T02:00:00+00:00
modified: 2021-12-21T12:00:00+00:00
retired: 2015-02-24T12:00:00+00:00
broader: boxe

peso-cruzador (boxe)
type: Concept
definition: Categoria de peso que varia segundo a federação ou os Jogos Olímpicos.
in scheme: mediatopic
created: 2009-10-22T02:00:00+00:00
modified: 2021-12-21T12:00:00+00:00
retired: 2015-02-24T12:00:00+00:00
broader: boxe

peso-pena (boxe)
type: Concept
definition: Categoria de peso que varia segundo a federação ou os Jogos Olímpicos.
in scheme: mediatopic
created: 2014-04-08T12:00:00+00:00
modified: 2021-12-21T12:00:00+00:00
retired: 2015-02-24T12:00:00+00:00
broader: boxe

peso-mosca (boxe)
type: Concept
definition: Categoria de peso que varia segundo a federação ou os Jogos Olímpicos.
in scheme: mediatopic
created: 2009-10-22T02:00:00+00:00
modified: 2021-12-21T12:00:00+00:00
retired: 2015-02-24T12:00:00+00:00
broader: boxe

peso-pesado (boxe)
type: Concept
definition: Categoria de peso que varia segundo a federação ou os Jogos Olímpicos.
in scheme: mediatopic
created: 2009-10-22T02:00:00+00:00
modified: 2021-12-21T12:00:00+00:00
retired: 2015-02-24T12:00:00+00:00
broader: boxe

peso-mosca-ligeiro (boxe)
type: Concept
definition: Categoria de peso que varia segundo a federação ou os Jogos Olímpicos.
in scheme: mediatopic
created: 2009-10-22T02:00:00+00:00
modified: 2021-12-21T12:00:00+00:00
retired: 2015-02-24T12:00:00+00:00
broader: boxe

peso-meio-pesado (boxe)
type: Concept
definition: Categoria de peso que varia segundo a federação ou os Jogos Olímpicos.
in scheme: mediatopic
created: 2009-10-22T02:00:00+00:00
modified: 2021-12-21T12:00:00+00:00
retired: 2015-02-24T12:00:00+00:00
broader: boxe

peso-médio-ligeiro (boxe)
type: Concept
definition: Categoria de peso que varia segundo a federação ou os Jogos Olímpicos.
in scheme: mediatopic
created: 2009-10-22T02:00:00+00:00
modified: 2021-12-21T12:00:00+00:00
retired: 2015-02-24T12:00:00+00:00
broader: boxe

peso-meio-médio-ligeiro (boxe)
type: Concept
definition: Categoria de peso que varia segundo a federação ou os Jogos Olímpicos.
in scheme: mediatopic
created: 2009-10-22T02:00:00+00:00
modified: 2021-12-21T12:00:00+00:00
retired: 2015-02-24T12:00:00+00:00
broader: boxe

peso-leve (boxe)
type: Concept
definition: Categoria de peso que varia segundo a federação ou os Jogos Olímpicos.
in scheme: mediatopic
created: 2009-10-22T02:00:00+00:00
modified: 2021-12-21T12:00:00+00:00
retired: 2015-02-24T12:00:00+00:00
broader: boxe

peso-médio (boxe)
type: Concept
definition: Categoria de peso que varia segundo a federação ou os Jogos Olímpicos.
in scheme: mediatopic
created: 2009-10-22T02:00:00+00:00
modified: 2021-12-21T12:00:00+00:00
retired: 2015-02-24T12:00:00+00:00
broader: boxe

peso-palha (boxe)
type: Concept
definition: Categoria de peso que varia segundo a federação ou os Jogos Olímpicos.
in scheme: mediatopic
created: 2009-10-22T02:00:00+00:00
modified: 2021-12-21T12:00:00+00:00
retired: 2015-02-24T12:00:00+00:00
broad match: http://cv.iptc.org/newscodes/subjectcode/15014000
broader: boxe

peso-supergalo (boxe)
type: Concept
definition: Categoria de peso que varia segundo a federação ou os Jogos Olímpicos.
in scheme: mediatopic
created: 2009-10-22T02:00:00+00:00
modified: 2021-12-21T12:00:00+00:00
retired: 2015-02-24T12:00:00+00:00
broader: boxe

peso-superpena (boxe)
type: Concept
definition: Categoria de peso que varia segundo a federação ou os Jogos Olímpicos.
in scheme: mediatopic
created: 2009-10-22T02:00:00+00:00
modified: 2021-12-21T12:00:00+00:00
retired: 2015-02-24T12:00:00+00:00
broader: boxe

peso-supermosca (boxe)
type: Concept
definition: Categoria de peso que varia segundo a federação ou os Jogos Olímpicos.
in scheme: mediatopic
created: 2009-10-22T02:00:00+00:00
modified: 2021-12-21T12:00:00+00:00
retired: 2015-02-24T12:00:00+00:00
broader: boxe

peso-superpesado (boxe)
type: Concept
definition: Categoria de peso que varia segundo a federação ou os Jogos Olímpicos.
in scheme: mediatopic
created: 2009-10-22T02:00:00+00:00
modified: 2021-12-21T12:00:00+00:00
retired: 2015-02-24T12:00:00+00:00
broader: boxe

peso-supermédio (boxe)
type: Concept
definition: Categoria de peso que varia segundo a federação ou os Jogos Olímpicos.
in scheme: mediatopic
created: 2009-10-22T02:00:00+00:00
modified: 2021-12-21T12:00:00+00:00
retired: 2015-02-24T12:00:00+00:00
broader: boxe

peso-meio-médio (boxe)
type: Concept
definition: Categoria de peso que varia segundo a federação ou os Jogos Olímpicos.
in scheme: mediatopic
created: 2009-10-22T02:00:00+00:00
modified: 2021-12-21T12:00:00+00:00
retired: 2015-02-24T12:00:00+00:00
broader: boxe

tourada
type: Concept
definition: Espetáculo tradicional de Portugal, Espanha e França, também popular em alguns países da América do Sul, que consiste na lide de touros bravos.
in scheme: mediatopic
created: 2009-10-22T02:00:00+00:00
modified: 2021-02-18T12:00:00+00:00
broader: disciplina de competição

futebol canadense
type: Concept
definition: Jogo de bola disputado entre duas equipes de 12 jogadores que têm seções de ataque e defesa. Cada ataque tenta mover uma bola oval pelo campo de 150 jardas de comprimento. Os pontos são marcados quando se avança a bola para a *end zone* do adversário.
in scheme: mediatopic
created: 2009-10-22T02:00:00+00:00
modified: 2021-02-18T12:00:00+00:00
broader: disciplina de competição

canoagem
type: Concept
definition: Competição que envolve canoas e em que os participantes remam com um remo simples.
in scheme: mediatopic
created: 2009-10-22T02:00:00+00:00
modified: 2021-02-18T12:00:00+00:00
has facet: canoekayaktype
broad match: http://cv.iptc.org/newscodes/subjectcode/15015000
broader: disciplina de competição
narrower: C1
narrower: C2
narrower: C4
narrower: canoa a vela
narrower: pontoniering

C1
type: Concept
definition: Canoa de 1 lugar (embarcação aberta para uma pessoa que rema com remo simples).
in scheme: mediatopic
created: 2009-10-22T02:00:00+00:00
modified: 2021-12-21T12:00:00+00:00
retired: 2015-02-24T12:00:00+00:00
broader: canoagem

C2
type: Concept
definition: Canoa de 2 lugares (embarcação aberta para duas pessoas que remam com remo simples).
in scheme: mediatopic
created: 2009-10-22T02:00:00+00:00
modified: 2021-12-21T12:00:00+00:00
retired: 2015-02-24T12:00:00+00:00
broader: canoagem

C4
type: Concept
definition: Canoa de 4 lugares (embarcação aberta para quatro pessoas que remam com remo simples).
in scheme: mediatopic
created: 2009-10-22T02:00:00+00:00
modified: 2021-12-21T12:00:00+00:00
retired: 2015-02-24T12:00:00+00:00
broad match: http://cv.iptc.org/newscodes/subjectcode/15015010
broader: canoagem

canoa a vela
type: Concept
definition: Corrida de canoa com vela.
in scheme: mediatopic
created: 2009-10-22T02:00:00+00:00
modified: 2021-05-05T12:00:00+00:00
retired: 2017-07-04T12:00:00+00:00
broader: canoagem

pontoniering
type: Concept
definition: Esporte de equipe, de tradição militar, que usa barcos semelhantes às canoas.
in scheme: mediatopic
created: 2009-10-22T02:00:00+00:00
modified: 2021-02-18T12:00:00+00:00
retired: 2017-07-04T12:00:00+00:00
broader: canoagem

casting (pesca)
type: Concept
definition: Uso de equipamento de pesca para atingir um alvo e marcar pontos.
in scheme: mediatopic
created: 2009-10-22T02:00:00+00:00
modified: 2021-07-12T12:00:00+00:00
broader: disciplina de competição

alpinismo
type: Concept
definition: Escalar montanhas usando mãos, pés e equipamento próprio.
in scheme: mediatopic
created: 2009-10-22T02:00:00+00:00
modified: 2021-02-18T12:00:00+00:00
broader: disciplina de competição
narrower: escalada no gelo
narrower: montanhismo

escalada no gelo
type: Concept
definition: Escalar estruturas geladas, como cascatas de gelo e penhascos congelados.
in scheme: mediatopic
created: 2009-10-22T02:00:00+00:00
modified: 2021-02-18T12:00:00+00:00
broad match: http://cv.iptc.org/newscodes/subjectcode/15016000
broader: alpinismo

montanhismo
type: Concept
definition: Subir uma montanha com neve ou gelo.
in scheme: mediatopic
created: 2009-10-22T02:00:00+00:00
modified: 2023-10-02T12:00:00+00:00
broader: alpinismo

escalada
type: Concept
definition: Escalada esportiva como categoria especial: competição individual, em parede artificial com limite de tempo.
in scheme: mediatopic
created: 2009-10-22T02:00:00+00:00
modified: 2021-07-12T12:00:00+00:00
broader: disciplina de competição

críquete
type: Concept
definition: Jogo de bola e taco entre duas equipes de 11 jogadores. Joga-se em campo de grama, amplo e de formato oval. O objetivo é marcar o maior número de corridas, impedindo corridas e eliminando batedores da equipe adversária.
in scheme: mediatopic
created: 2009-10-22T02:00:00+00:00
modified: 2021-02-18T12:00:00+00:00
broader: disciplina de competição

croquet
type: Concept
definition: Jogo em que se bate uma bola com um taco de madeira para passar debaixo de pequenos arcos fixados na grama.
in scheme: mediatopic
created: 2009-10-22T02:00:00+00:00
modified: 2021-02-18T12:00:00+00:00
broader: disciplina de competição

curling
type: Concept
definition: Jogo disputado sobre pista de gelo com pedras redondas planas na base e pega curva. O jogador lança a pedra pela pista, tentando que ela fique o mais próximo possível do alvo. Os companheiros podem varrer a pista para que a pedra deslize mais facilmente até o alvo.
in scheme: mediatopic
created: 2009-10-22T02:00:00+00:00
modified: 2021-02-18T12:00:00+00:00
broader: disciplina de competição
narrower: ice stock sport

ice stock sport
type: Concept
definition: Jogo semelhante ao curling, disputado com pedras de pega direita e regras diferentes, geralmente praticado ao ar livre, nos países alpinos.
in scheme: mediatopic
created: 2009-10-22T02:00:00+00:00
modified: 2021-02-18T12:00:00+00:00
broader: curling

ciclismo
type: Concept
definition: Corrida de bicicleta.
in scheme: mediatopic
created: 2009-10-22T02:00:00+00:00
modified: 2021-02-18T12:00:00+00:00
has facet: cyclingtype
broader: disciplina de competição
narrower: ciclismo artístico
narrower: bicross
narrower: BMX
narrower: ciclobol
narrower: velocidade individual
narrower: cyclocross
narrower: perseguição individual (ciclismo)
narrower: contra o relógio individual (ciclismo)
narrower: keirin
narrower: madison
narrower: ciclismo de montanha
narrower: corrida por pontos (ciclismo)
narrower: ciclismo de estrada
narrower: corrida por etapas
narrower: velocidade por equipes
narrower: perseguição por equipes
narrower: contra o relógio por equipes (ciclismo)
narrower: pista (ciclismo)
narrower: http://cv.iptc.org/newscodes/mediatopic/20001332

ciclismo artístico
type: Concept
definition: Competição, individual ou por equipes, que consiste em fazer manobras e acrobacias em bicicletas especiais, adaptadas para o efeito. Os pontos são atribuídos por um júri.
in scheme: mediatopic
created: 2009-10-22T02:00:00+00:00
modified: 2021-02-18T12:00:00+00:00
broader: ciclismo

bicross
type: Concept
definition: Corrida em que os participantes têm de percorrer de bicicleta um circuito com obstáculos o mais rápido possível.
in scheme: mediatopic
created: 2009-10-22T02:00:00+00:00
modified: 2021-02-18T12:00:00+00:00
retired: 2017-07-04T12:00:00+00:00
broader: ciclismo

BMX
type: Concept
definition: Corrida de bicicleta com partida em linha e vários obstáculos em circuitos fora de estrada.
in scheme: mediatopic
created: 2009-10-22T02:00:00+00:00
modified: 2021-07-12T12:00:00+00:00
has facet: bmxfreestyletype
broad match: http://cv.iptc.org/newscodes/subjectcode/15019000
broader: ciclismo

ciclobol
type: Concept
definition: Esporte de equipe com bicicletas. O objetivo de cada equipe de dois jogadores é mover a bola usando a roda de trás e da frente sem deixar os pés tocar o chão.
in scheme: mediatopic
created: 2009-10-22T02:00:00+00:00
modified: 2021-02-18T12:00:00+00:00
broader: ciclismo

velocidade individual
type: Concept
definition: Corrida entre dois ciclistas em 2 ou 3 voltas à pista, com um *sprint* final cronometrado nos últimos 200m.
in scheme: mediatopic
created: 2009-10-22T02:00:00+00:00
modified: 2021-02-18T12:00:00+00:00
retired: 2017-07-04T12:00:00+00:00
broader: ciclismo

cyclocross
type: Concept
definition: Ciclismo praticado por etapas em várias superfícies (terra, lama, areia e estrada), com obstáculos naturais ou artificiais.
in scheme: mediatopic
created: 2009-10-22T02:00:00+00:00
modified: 2021-02-18T12:00:00+00:00
retired: 2017-07-04T12:00:00+00:00
broader: ciclismo

perseguição individual (ciclismo)
type: Concept
definition: Dois ciclistas partem de pontos médios opostos de uma pista e tentam recuperar a distância entre eles.
in scheme: mediatopic
created: 2009-10-22T02:00:00+00:00
modified: 2021-02-18T12:00:00+00:00
retired: 2017-07-04T12:00:00+00:00
broader: ciclismo

contra o relógio individual (ciclismo)
type: Concept
definition: Corrida ou etapa em que cada ciclista sai individualmente da linha de partida e corre contra o relógio.
in scheme: mediatopic
created: 2009-10-22T02:00:00+00:00
modified: 2021-02-18T12:00:00+00:00
retired: 2017-07-04T12:00:00+00:00
broader: ciclismo

keirin
type: Concept
definition: Corrida de velocidade de 6 ciclistas em pista de velódromo. Os ciclistas seguem atrás de um motociclista que aumenta gradualmente a velocidade nos primeiros 1400 m. Quando ele abandona a pista, ocorre o *sprint* final.
in scheme: mediatopic
created: 2009-10-22T02:00:00+00:00
modified: 2021-02-18T12:00:00+00:00
retired: 2017-07-04T12:00:00+00:00
broader: ciclismo

madison
type: Concept
definition: Corrida de pontos por equipes compostas por 2 ciclistas que se revezam.
in scheme: mediatopic
created: 2009-10-22T02:00:00+00:00
modified: 2021-02-18T12:00:00+00:00
retired: 2017-07-04T12:00:00+00:00
broader: ciclismo

ciclismo de montanha
type: Concept
definition: Corrida de bicicleta fora de estrada que requer resistência e bicicletas de montanha especialmente adaptadas.
in scheme: mediatopic
created: 2009-10-22T02:00:00+00:00
modified: 2021-02-18T12:00:00+00:00
has facet: mountainbikingtype
broad match: http://cv.iptc.org/newscodes/subjectcode/15019015
broader: ciclismo

corrida por pontos (ciclismo)
type: Concept
definition: Os ciclistas tentam completar o maior número de voltas. São atribuídos pontos extra em *sprints* intermédios a cada 2500 m.
in scheme: mediatopic
created: 2009-10-22T02:00:00+00:00
modified: 2021-02-18T12:00:00+00:00
retired: 2017-07-04T12:00:00+00:00
broader: ciclismo

ciclismo de estrada
type: Concept
definition: Corrida de estrada em que os ciclistas partem todos ao mesmo tempo.
in scheme: mediatopic
created: 2009-10-22T02:00:00+00:00
modified: 2024-07-01T12:00:00+00:00
retired: 2017-07-04T12:00:00+00:00
broader: ciclismo

corrida por etapas
type: Concept
definition: Corrida disputada por equipes em que as classificações são determinadas pelos resultados combinados de cada dia.
in scheme: mediatopic
created: 2009-10-22T02:00:00+00:00
modified: 2021-05-05T12:00:00+00:00
retired: 2017-07-04T12:00:00+00:00
broader: ciclismo

velocidade por equipes
type: Concept
definition: Corrida de bicicleta em que duas equipes competem uma contra a outra, começando em lados opostos da pista. Após a primeira volta, o primeiro ciclista se afasta, deixando o segundo ciclista liderar a próxima volta, que então faz o mesmo na última volta, com o terceiro ciclista a terminar a corrida. A equipe com o tempo mais rápido é a vencedora.
in scheme: mediatopic
created: 2009-10-22T02:00:00+00:00
modified: 2021-02-18T12:00:00+00:00
retired: 2017-07-04T12:00:00+00:00
broad match: http://cv.iptc.org/newscodes/subjectcode/15019000
broader: ciclismo

perseguição por equipes
type: Concept
definition: Duas equipes partem de pontos médios opostos de uma pista e tentam recuperar a distância entre elas.
in scheme: mediatopic
created: 2009-10-22T02:00:00+00:00
modified: 2021-02-18T12:00:00+00:00
retired: 2017-07-04T12:00:00+00:00
broad match: http://cv.iptc.org/newscodes/subjectcode/15019000
broader: ciclismo

contra o relógio por equipes (ciclismo)
type: Concept
definition: Equipes de ciclistas saem da linha de partida a intervalos regulares e correm contra o relógio.
in scheme: mediatopic
created: 2009-10-22T02:00:00+00:00
modified: 2021-02-18T12:00:00+00:00
retired: 2017-07-04T12:00:00+00:00
broad match: http://cv.iptc.org/newscodes/subjectcode/15019000
broader: ciclismo

pista (ciclismo)
type: Concept
definition: Corrida de bicicleta em pista de velódromo.
in scheme: mediatopic
created: 2009-10-22T02:00:00+00:00
modified: 2021-02-18T12:00:00+00:00
retired: 2017-07-04T12:00:00+00:00
broader: ciclismo

dança rítmica
type: Concept
definition: Competição de dança em que os pares são avaliados pela técnica e pela interpretação.
in scheme: mediatopic
created: 2009-10-22T02:00:00+00:00
modified: 2024-05-10T12:00:00+00:00
broader: disciplina de competição
narrower: http://cv.iptc.org/newscodes/mediatopic/20001379

dardos
type: Concept
definition: Os jogadores competem atirando dardos de metal a um alvo circular na parede, dividido em segmentos numerados.
in scheme: mediatopic
created: 2009-10-22T02:00:00+00:00
modified: 2021-02-18T12:00:00+00:00
broader: disciplina de competição

saltos ornamentais
type: Concept
definition: Os atletas mergulham de uma plataforma fixa ou de um trampolim e são avaliados por sete juízes, que atribuem notas de 0 a 10 a cada salto.
in scheme: mediatopic
created: 2009-10-22T02:00:00+00:00
modified: 2021-02-18T12:00:00+00:00
broader: disciplina de competição
narrower: saltos de plataforma
narrower: saltos de trampolim
narrower: saltos ornamentais sincronizados

saltos de plataforma
type: Concept
definition: Os atletas saltam para a água de uma plataforma fixa elevada.
in scheme: mediatopic
created: 2009-10-22T02:00:00+00:00
modified: 2021-02-18T12:00:00+00:00
has facet: platformheight
broad match: http://cv.iptc.org/newscodes/subjectcode/15021000
broader: saltos ornamentais

saltos de trampolim
type: Concept
definition: Os atletas saltam para a água de um trampolim elevado.
in scheme: mediatopic
created: 2009-10-22T02:00:00+00:00
modified: 2021-02-18T12:00:00+00:00
has facet: platformheight
broad match: http://cv.iptc.org/newscodes/subjectcode/15021000
broader: saltos ornamentais

saltos ornamentais sincronizados
type: Concept
definition: Dois atletas da mesma equipe saltam simultaneamente para a água de plataformas ou trampolins separados. Além dos critérios padrão, eles também são avaliados pela sincronização.
in scheme: mediatopic
created: 2009-10-22T02:00:00+00:00
modified: 2021-02-18T12:00:00+00:00
broad match: http://cv.iptc.org/newscodes/subjectcode/15021004
has facet: platformheight
broader: saltos ornamentais

mergulho
type: Concept
definition: Mergulho subaquático com o uso de um aparelho respiratório subaquático independente.
in scheme: mediatopic
created: 2009-10-22T02:00:00+00:00
modified: 2021-02-18T12:00:00+00:00
broader: atividades recreativas ao ar livre

esportes subaquáticos
type: Concept
definition: Esportes de competição que se realizam debaixo de água.
in scheme: mediatopic
created: 2009-10-22T02:00:00+00:00
modified: 2021-02-18T12:00:00+00:00
broader: disciplina de competição

corrida de cães
type: Concept
definition: Corrida de cães à volta de uma pista.
in scheme: mediatopic
created: 2009-10-22T02:00:00+00:00
modified: 2021-02-18T12:00:00+00:00
has facet: dogracingtype
broader: disciplina de competição
narrower: pista oval
narrower: corrida de trenó com cães

pista oval
type: Concept
definition: Corrida de cães perseguindo uma lebre artificial à volta de uma pista oval.
in scheme: mediatopic
created: 2009-10-22T02:00:00+00:00
modified: 2021-02-18T12:00:00+00:00
retired: 2017-07-04T12:00:00+00:00
broader: corrida de cães

corrida de trenó com cães
type: Concept
definition: Corrida de cães atrelados a um trenó.
in scheme: mediatopic
created: 2009-10-22T02:00:00+00:00
modified: 2021-02-18T12:00:00+00:00
retired: 2017-07-04T12:00:00+00:00
broader: corrida de cães

duatlo
type: Concept
definition: Evento esportivo que envolve corrida a pé e ciclismo.
in scheme: mediatopic
created: 2009-10-22T02:00:00+00:00
modified: 2021-02-18T12:00:00+00:00
broader: disciplina de competição

hipismo
type: Concept
definition: Disciplinas esportivas com cavalos regulamentadas pela Federação Equestre Internacional, como adestramento, concurso completo de equitação, salto de obstáculos e volteio.
in scheme: mediatopic
created: 2009-10-22T02:00:00+00:00
modified: 2021-07-12T12:00:00+00:00
has facet: equestriantype
broader: disciplina de competição
narrower: cross-country
narrower: adestramento
narrower: saltos
narrower: concurso completo de equitação (CCE)
narrower: atrelagem

cross-country
type: Concept
definition: Prova do concurso completo. Evento equestre realizado em circuito de campo, com obstáculos naturais e artificiais.
in scheme: mediatopic
created: 2009-10-22T02:00:00+00:00
modified: 2021-05-05T12:00:00+00:00
retired: 2017-07-04T12:00:00+00:00
broader: hipismo

adestramento
type: Concept
definition: Prova do concurso completo. O cavaleiro é avaliado por uma série de figuras ou movimentos que o cavalo tem de executar em três velocidades: passo, trote e galope.
in scheme: mediatopic
created: 2009-10-22T02:00:00+00:00
modified: 2021-02-18T12:00:00+00:00
retired: 2017-07-04T12:00:00+00:00
broader: hipismo

saltos
type: Concept
definition: Prova do concurso completo. Cavaleiro e cavalo têm de saltar uma série de obstáculos, no menor tempo possível, em área delimitada.
in scheme: mediatopic
created: 2009-10-22T02:00:00+00:00
modified: 2021-02-18T12:00:00+00:00
retired: 2017-07-04T12:00:00+00:00
broader: hipismo

concurso completo de equitação (CCE)
type: Concept
definition: Evento equestre que envolve três disciplinas: adestramento, cross-country e concurso de saltos.
in scheme: mediatopic
created: 2009-10-22T02:00:00+00:00
modified: 2021-02-18T12:00:00+00:00
retired: 2017-07-04T12:00:00+00:00
broader: hipismo

atrelagem
type: Concept
definition: Eventos equestres em que cavalos atrelados a um veículo são conduzidos por um percurso.
in scheme: mediatopic
created: 2009-10-22T02:00:00+00:00
modified: 2021-02-18T12:00:00+00:00
retired: 2017-07-04T12:00:00+00:00
broad match: http://cv.iptc.org/newscodes/subjectcode/15022000
broader: hipismo

esgrima
type: Concept
definition: Esporte de combate que usa espada, florete ou sabre.
in scheme: mediatopic
created: 2009-10-22T02:00:00+00:00
modified: 2021-02-18T12:00:00+00:00
has facet: fencingtype
broader: disciplina de competição
narrower: espada
narrower: florete
narrower: sabre

espada
type: Concept
definition: Categoria de esgrima que usa uma arma com lâmina rígida e triangular, dotada de empunhadura com guarda-mão grande.
in scheme: mediatopic
created: 2009-10-22T02:00:00+00:00
modified: 2021-07-12T12:00:00+00:00
retired: 2017-07-04T12:00:00+00:00
broader: esgrima

florete
type: Concept
definition: Categoria de esgrima que usa uma arma com lâmina flexível e quadrangular, dotada de empunhadura com pequeno guarda-mão.
in scheme: mediatopic
created: 2009-10-22T02:00:00+00:00
modified: 2021-02-18T12:00:00+00:00
retired: 2017-07-04T12:00:00+00:00
broader: esgrima

sabre
type: Concept
definition: Categoria de esgrima que usa uma arma com lâmina muito flexível e triangular, ligeiramente curva, dotada de empunhadura com pequeno guarda-mão semicircular.
in scheme: mediatopic
created: 2009-10-22T02:00:00+00:00
modified: 2021-02-18T12:00:00+00:00
retired: 2017-07-04T12:00:00+00:00
broader: esgrima

hóquei em campo
type: Concept
definition: Jogo de bola envolvendo duas equipes de 11 jogadores que usam tacos curvos na ponta inferior para bater uma bola pequena e dura. O objetivo é marcar o maior número de gols.
in scheme: mediatopic
created: 2009-10-22T02:00:00+00:00
modified: 2021-02-18T12:00:00+00:00
broader: disciplina de competição

patinação artística
type: Concept
definition: Esporte, individual ou em pares, em que os patinadores são avaliados por 9 juízes após cada programa apresentado. Os patinadores devem executar figuras e movimentos ao som da música, conjugando beleza artística e precisão técnica.
in scheme: mediatopic
created: 2009-10-22T02:00:00+00:00
modified: 2021-02-18T12:00:00+00:00
has facet: figureskatingtype
broader: disciplina de competição
narrower: dança no gelo

dança no gelo
type: Concept
definition: Prova que decorre durante 3 dias, com duas danças obrigatórias, uma dança original (2min e 30s) e uma dança livre (4min).
in scheme: mediatopic
created: 2009-10-22T02:00:00+00:00
modified: 2021-02-18T12:00:00+00:00
retired: 2017-07-04T12:00:00+00:00
broader: patinação artística

punhobol
type: Concept
definition: Esporte coletivo, semelhante ao vôlei, jogado em campo de grama, dividido ao meio por uma rede, e em que a bola é batida com os punhos ou braços.
in scheme: mediatopic
created: 2009-10-22T02:00:00+00:00
modified: 2021-02-18T12:00:00+00:00
broader: disciplina de competição

floorball
type: Concept
definition: Jogo de futebol em recinto fechado do tamanho de um campo de basquetebol, disputado por duas equipes de 6 jogadores, que usam bastões plásticos para bater uma bola de plástico leve.
in scheme: mediatopic
created: 2009-10-22T02:00:00+00:00
modified: 2021-02-18T12:00:00+00:00
broader: disciplina de competição

frisbee
type: Concept
definition: Grupo de provas disputadas com um disco voador de plástico.
in scheme: mediatopic
created: 2009-10-22T02:00:00+00:00
modified: 2021-02-18T12:00:00+00:00
has facet: flyingdisctype
broader: disciplina de competição

futebol gaélico
type: Concept
definition: Tipo de futebol disputado por duas equipes de 15 jogadores que competem em um gramado, correndo, chutando e passando com as mãos uma bola esférica. Os pontos são marcados quando a bola passa entre os postes do gol. É regulamentado pela Associação Atlética Gaélica.
in scheme: mediatopic
created: 2009-10-22T02:00:00+00:00
modified: 2021-02-18T12:00:00+00:00
broad match: http://cv.iptc.org/newscodes/subjectcode/15000000
broader: disciplina de competição

golfe
type: Concept
definition: Jogo em que os participantes batem uma pequena bola branca com diferentes tacos ao longo de um campo de 18 buracos, que variam em distância. O objetivo é fazer a bola entrar nos buracos com o menor número possível de tacadas.
in scheme: mediatopic
created: 2009-10-22T02:00:00+00:00
modified: 2021-02-18T12:00:00+00:00
broader: disciplina de competição
narrower: minigolfe

minigolfe
type: Concept
definition: Jogo semelhante ao golfe, praticado em campo artificial de menores dimensões.
in scheme: mediatopic
created: 2009-10-22T02:00:00+00:00
modified: 2021-02-18T12:00:00+00:00
broader: golfe

ginástica
type: Concept
definition: Esporte que consiste numa variedade de disciplinas em que os ginastas realizam movimentos artísticos e acrobáticos em diferentes aparelhos. Há 6 disciplinas para os homens e 4 para as mulheres.
in scheme: mediatopic
created: 2009-10-22T02:00:00+00:00
modified: 2021-02-18T12:00:00+00:00
broader: disciplina de competição
narrower: rítmica
narrower: trampolim
narrower: ginástica artística

bola
type: Concept
definition: Exercício de ginástica rítmica em que as ginastas realizam uma coreografia no solo usando uma bola.
in scheme: mediatopic
created: 2009-10-22T02:00:00+00:00
modified: 2021-12-21T12:00:00+00:00
retired: 2015-02-24T12:00:00+00:00
broader: rítmica

trave
type: Concept
definition: Prova feminina em que as ginastas executam uma série de movimentos e saltos em cima de uma trave fixa de 10 cm de largura a 1.20m do chão.
in scheme: mediatopic
created: 2009-10-22T02:00:00+00:00
modified: 2021-12-21T12:00:00+00:00
retired: 2015-02-24T12:00:00+00:00
broader: ginástica artística

maças
type: Concept
definition: Exercício de ginástica rítmica em que as ginastas realizam uma coreografia no solo usando maças.
in scheme: mediatopic
created: 2009-10-22T02:00:00+00:00
modified: 2021-12-21T12:00:00+00:00
retired: 2015-02-24T12:00:00+00:00
broader: rítmica

solo
type: Concept
definition: Exercício de ginástica no solo, em estrado de 12m x 12m.
in scheme: mediatopic
created: 2009-10-22T02:00:00+00:00
modified: 2021-12-21T12:00:00+00:00
retired: 2015-02-24T12:00:00+00:00
broader: ginástica artística

arco
type: Concept
definition: Exercício de ginástica rítmica em que as ginastas rolam e atiram um arco enquanto realizam uma coreografia.
in scheme: mediatopic
created: 2009-10-22T02:00:00+00:00
modified: 2021-12-21T12:00:00+00:00
retired: 2015-02-24T12:00:00+00:00
broader: rítmica

barra
type: Concept
definition: Prova masculina em que os ginastas executam uma sequência de movimentos giratórios e acrobacias suspenso de uma barra horizontal fixa.
in scheme: mediatopic
created: 2009-10-22T02:00:00+00:00
modified: 2021-12-21T12:00:00+00:00
retired: 2015-02-24T12:00:00+00:00
broader: ginástica artística

barras paralelas
type: Concept
definition: Prova masculina em que os ginastas executam uma sequência de movimentos ao longo de duas barras dispostas paralelamente à mesma altura.
in scheme: mediatopic
created: 2009-10-22T02:00:00+00:00
modified: 2021-12-21T12:00:00+00:00
retired: 2015-02-24T12:00:00+00:00
broader: ginástica artística

cavalo com alças
type: Concept
definition: Prova masculina em que os ginastas executam uma sequência ininterrupta de movimentos, balançando o corpo sobre um cavalo com alças, combinando equilíbrio e força.
in scheme: mediatopic
created: 2009-10-22T02:00:00+00:00
modified: 2021-12-21T12:00:00+00:00
retired: 2015-02-24T12:00:00+00:00
broader: ginástica artística

rítmica
type: Concept
definition: Modalidade esportiva que alia a dança a movimentos de ginástica.
in scheme: mediatopic
created: 2009-10-22T02:00:00+00:00
modified: 2021-02-18T12:00:00+00:00
has facet: rhythmgymtype
broader: ginástica
narrower: bola
narrower: maças
narrower: arco
narrower: fita
narrower: corda

fita
type: Concept
definition: Exercício de ginástica rítmica em que as ginastas realizam uma coreografia no solo usando uma fita.
in scheme: mediatopic
created: 2009-10-22T02:00:00+00:00
modified: 2021-12-21T12:00:00+00:00
retired: 2015-02-24T12:00:00+00:00
broader: rítmica

argolas
type: Concept
definition: Prova masculina em que os ginastas demonstram sua capacidade de força e equilíbrio executando movimentos e acrobacias suspensos de duas argolas paralelas.
in scheme: mediatopic
created: 2009-10-22T02:00:00+00:00
modified: 2021-12-21T12:00:00+00:00
retired: 2015-02-24T12:00:00+00:00
broader: ginástica artística

corda
type: Concept
definition: Exercício de ginástica rítmica em que as ginastas realizam uma coreografia no solo usando uma corda.
in scheme: mediatopic
created: 2009-10-22T02:00:00+00:00
modified: 2021-12-21T12:00:00+00:00
retired: 2015-02-24T12:00:00+00:00
broader: rítmica

trampolim
type: Concept
definition: Os ginastas executam movimentos e acrobacias saltando sobre um trampolim.
in scheme: mediatopic
created: 2009-10-22T02:00:00+00:00
modified: 2021-02-18T12:00:00+00:00
broader: ginástica

barras assimétricas
type: Concept
definition: Prova feminina em que as ginastas executam uma sequência de movimentos ao longo de e entre duas barras dispostas paralelamente a alturas diferentes.
in scheme: mediatopic
created: 2009-10-22T02:00:00+00:00
modified: 2021-12-21T12:00:00+00:00
retired: 2015-02-24T12:00:00+00:00
broader: ginástica artística

salto
type: Concept
definition: Os ginastas ganham impulso saltando sobre um trampolim e uma espécie de mesa após corrida acelerada em pista de 25m.
in scheme: mediatopic
created: 2009-10-22T02:00:00+00:00
modified: 2021-12-21T12:00:00+00:00
retired: 2015-02-24T12:00:00+00:00
broader: ginástica artística

handebol
type: Concept
definition: Jogo de bola de duas equipes de 7 jogadores que tentam introduzir a bola no gol do adversário através de passes apenas com as mãos.
in scheme: mediatopic
created: 2009-10-22T02:00:00+00:00
modified: 2021-02-18T12:00:00+00:00
broader: disciplina de competição

hornuss
type: Concept
definition: Esporte de equipe suíço, com 16 a 18 pessoas por equipe, que tentam lançar para o campo adversário um disco de borracha com um painel de madeira.
in scheme: mediatopic
created: 2009-10-22T02:00:00+00:00
modified: 2021-02-18T12:00:00+00:00
broader: disciplina de competição

corridas de cavalos
type: Concept
definition: Corridas de cavalos montados.
in scheme: mediatopic
created: 2009-10-22T02:00:00+00:00
modified: 2021-02-18T12:00:00+00:00
broader: disciplina de competição
narrower: flat racing
narrower: corridas de cavalos
narrower: corrida de obstáculos

flat racing
type: Concept
definition: Corrida de cavalos em pista plana sem obstáculos.
in scheme: mediatopic
created: 2009-10-22T02:00:00+00:00
modified: 2021-02-18T12:00:00+00:00
retired: 2017-07-04T12:00:00+00:00
broader: corridas de cavalos

corridas de cavalos
type: Concept
definition: Corridas de cavalos montados.
in scheme: mediatopic
created: 2009-10-22T02:00:00+00:00
modified: 2021-02-18T12:00:00+00:00
retired: 2017-07-04T12:00:00+00:00
broader: corridas de cavalos

corrida de obstáculos
type: Concept
definition: Corrida de cavalo montado com pelo menos 8 obstáculos clássicos, quatro dos quais são diferentes, como salto sobre água, cerca, vala etc.
in scheme: mediatopic
created: 2009-10-22T02:00:00+00:00
modified: 2021-02-18T12:00:00+00:00
retired: 2017-07-04T12:00:00+00:00
broader: corridas de cavalos

hurling
type: Concept
definition: Jogo disputado por duas equipes de quinze jogadores, cada um com um taco de madeira achatado e curvado na ponta, chamado *hurley*. O objetivo é marcar um gol colocando a pequena bola entre os postes de gol do adversário, seja por cima da barra, seja por baixo dela em uma rede protegida por um goleiro.
in scheme: mediatopic
created: 2009-10-22T02:00:00+00:00
modified: 2021-02-18T12:00:00+00:00
broad match: http://cv.iptc.org/newscodes/subjectcode/15000000
broader: disciplina de competição

hóquei no gelo
type: Concept
definition: Duas equipes de 6 patinadores fortemente equipados e munidos de tacos com que tentam introduzir um disco no gol do adversário.
in scheme: mediatopic
created: 2009-10-22T02:00:00+00:00
modified: 2021-02-18T12:00:00+00:00
broader: disciplina de competição
narrower: hóquei em trenó

hóquei em trenó
type: Concept
definition: Modalidade semelhante ao hóquei no gelo mas praticada com pequenos trenós que os patinadores empurram com os braços.
in scheme: mediatopic
created: 2009-10-22T02:00:00+00:00
modified: 2021-02-18T12:00:00+00:00
broader: hóquei no gelo

patinação em linha
type: Concept
definition: Esportes de competição que usam patins em linha.
in scheme: mediatopic
created: 2009-10-22T02:00:00+00:00
modified: 2021-02-18T12:00:00+00:00
retired: 2021-02-18T12:00:00+00:00
broader: disciplina de competição

pelota basca
type: Concept
definition: Esporte ancestral do País Basco em que dois ou quatro participantes batem alternadamente uma bola contra uma parede frontal com uma espécie de pá.
in scheme: mediatopic
created: 2009-10-22T02:00:00+00:00
modified: 2021-02-18T12:00:00+00:00
has facet: jaialaitype
broader: disciplina de competição

judô
type: Concept
definition: Arte marcial defensiva.
in scheme: mediatopic
created: 2009-10-22T02:00:00+00:00
modified: 2021-02-18T12:00:00+00:00
has facet: weightclasstype
broader: artes marciais
narrower: peso-extraleve (judô)
narrower: peso-meio-pesado (judô)
narrower: peso-meio-leve (judô)
narrower: peso-meio-médio (judô)
narrower: peso-pesado (judô)
narrower: peso-leve (judô)
narrower: peso-médio (judô)

peso-extraleve (judô)
type: Concept
definition: Categoria até 60kg para homens e até 48kg para mulheres.
in scheme: mediatopic
created: 2009-10-22T02:00:00+00:00
modified: 2021-12-21T12:00:00+00:00
retired: 2015-02-24T12:00:00+00:00
broader: judô

peso-meio-pesado (judô)
type: Concept
definition: Categoria até 100kg para homens e até 78kg para mulheres.
in scheme: mediatopic
created: 2009-10-22T02:00:00+00:00
modified: 2021-12-21T12:00:00+00:00
retired: 2015-02-24T12:00:00+00:00
broader: judô

peso-meio-leve (judô)
type: Concept
definition: Categoria até 73kg para homens e até 57kg para mulheres.
in scheme: mediatopic
created: 2009-10-22T02:00:00+00:00
modified: 2021-12-21T12:00:00+00:00
retired: 2015-02-24T12:00:00+00:00
broader: judô

peso-meio-médio (judô)
type: Concept
definition: Categoria até 81kg para homens e até 63kg para mulheres.
in scheme: mediatopic
created: 2009-10-22T02:00:00+00:00
modified: 2021-12-21T12:00:00+00:00
retired: 2015-02-24T12:00:00+00:00
broader: judô

peso-pesado (judô)
type: Concept
definition: Categoria aberta, geralmente acima de 100kg para homens e acima de 78kg para mulheres.
in scheme: mediatopic
created: 2009-10-22T02:00:00+00:00
modified: 2021-12-21T12:00:00+00:00
retired: 2015-02-24T12:00:00+00:00
broader: judô

peso-leve (judô)
type: Concept
definition: Categoria até 66kg para homens e até 52kg para mulheres.
in scheme: mediatopic
created: 2009-10-22T02:00:00+00:00
modified: 2021-12-21T12:00:00+00:00
retired: 2015-02-24T12:00:00+00:00
broader: judô

peso-médio (judô)
type: Concept
definition: Categoria até 90kg para homens e até 70kg para mulheres.
in scheme: mediatopic
created: 2009-10-22T02:00:00+00:00
modified: 2021-12-21T12:00:00+00:00
retired: 2015-02-24T12:00:00+00:00
broader: judô

jukendo
type: Concept
definition: Arte marcial tradicional japonesa que usa uma baioneta em madeira.
in scheme: mediatopic
created: 2009-10-22T02:00:00+00:00
modified: 2021-02-18T12:00:00+00:00
broader: artes marciais

kabaddi
type: Concept
definition: Esporte de origem índia em que as duas equipes se perseguem, tocando ou capturando os jogadores adversários.
in scheme: mediatopic
created: 2009-10-22T02:00:00+00:00
modified: 2021-02-18T12:00:00+00:00
broader: disciplina de competição

caiaque
type: Concept
definition: Competição com caiaques em que o remador fica com as pernas voltadas para a frente e rema com um remo de duas pás.
in scheme: mediatopic
created: 2009-10-22T02:00:00+00:00
modified: 2021-02-18T12:00:00+00:00
broad match: http://cv.iptc.org/newscodes/subjectcode/15015000
has facet: canoekayaktype
broader: disciplina de competição
narrower: K1
narrower: K2
narrower: K4

K1
type: Concept
definition: Caiaque de 1 lugar (embarcação fechada para uma pessoa sentada em assento fixo que rema com remo de duas pás).
in scheme: mediatopic
created: 2009-10-22T02:00:00+00:00
modified: 2021-12-21T12:00:00+00:00
retired: 2015-02-24T12:00:00+00:00
broader: caiaque

K2
type: Concept
definition: Caiaque de 2 lugares (embarcação fechada para duas pessoas sentadas em assento fixo que remam com remo de duas pás).
in scheme: mediatopic
created: 2009-10-22T02:00:00+00:00
modified: 2021-12-21T12:00:00+00:00
retired: 2015-02-24T12:00:00+00:00
broader: caiaque

K4
type: Concept
definition: Caiaque de 4 lugares (embarcação fechada para quatro pessoas sentadas em assento fixo que remam com remo de duas pás).
in scheme: mediatopic
created: 2009-10-22T02:00:00+00:00
modified: 2021-12-21T12:00:00+00:00
retired: 2015-02-24T12:00:00+00:00
broader: caiaque

caratê
type: Concept
definition: Arte marcial que usa golpes de mãos e pés para derrubar o adversário.
in scheme: mediatopic
created: 2009-10-22T02:00:00+00:00
modified: 2021-02-18T12:00:00+00:00
broader: artes marciais

kendo
type: Concept
definition: Arte marcial tradicional japonesa que usa uma espada de bambu.
in scheme: mediatopic
created: 2009-10-22T02:00:00+00:00
modified: 2021-03-15T12:00:00+00:00
broader: artes marciais

kyudo
type: Concept
definition: Arte marcial tradicional japonesa que usa um arco de bambu e flechas.
in scheme: mediatopic
created: 2009-10-22T02:00:00+00:00
modified: 2021-02-18T12:00:00+00:00
broader: artes marciais

lacrosse
type: Concept
definition: Jogo disputado por 2 equipes de jogadores devidamente protegidos que usam um taco longo e com rede na ponta para apanhar ou arremessar uma bola dura.
in scheme: mediatopic
created: 2009-10-22T02:00:00+00:00
modified: 2021-02-18T12:00:00+00:00
broader: disciplina de competição

luge
type: Concept
definition: O luge (palavra francesa para trenó) é uma competição individual ou em pares em que os atletas, deitados de costas em trenó aberto, percorrem a grande velocidade uma descida coberta de gelo. O(s) atleta(s) pode(m) manobrar o trenó e deve(m) estar em contato com ele ao passar a linha de chegada.
in scheme: mediatopic
created: 2009-10-22T02:00:00+00:00
modified: 2021-02-18T12:00:00+00:00
broader: disciplina de competição

maratona
type: Concept
definition: Corrida de estrada em que os atletas correm 42.195 km.
in scheme: mediatopic
created: 2009-10-22T02:00:00+00:00
modified: 2021-02-18T12:00:00+00:00
broader: disciplina de competição

pentatlo moderno
type: Concept
definition: O pentatlo moderno inclui 5 provas diferentes realizadas no mesmo dia pela seguinte ordem: tiro, esgrima, natação, hipismo e corrida.
in scheme: mediatopic
created: 2009-10-22T02:00:00+00:00
modified: 2021-02-18T12:00:00+00:00
broader: disciplina de competição

corrida de barcos a motor
type: Concept
definition: Corrida de embarcações motorizadas.
in scheme: mediatopic
created: 2009-10-22T02:00:00+00:00
modified: 2021-02-18T12:00:00+00:00
broad match: http://cv.iptc.org/newscodes/subjectcode/15046000
broader: disciplina de competição

corrida de automóveis
type: Concept
definition: Corridas de veículos motorizados de quatro rodas.
in scheme: mediatopic
created: 2009-10-22T02:00:00+00:00
modified: 2021-02-18T12:00:00+00:00
has facet: motorcarracingtype
broader: disciplina de competição
narrower: resistência
narrower: Fórmula 3000
narrower: Fórmula 1
narrower: Fórmula Indy
narrower: rallycross
narrower: rali

resistência
type: Concept
definition: Corrida de longa distância para piloto e copiloto, em carros especialmente preparados para testar a resistência.
in scheme: mediatopic
created: 2009-10-22T02:00:00+00:00
modified: 2021-02-18T12:00:00+00:00
retired: 2017-07-04T12:00:00+00:00
broader: corrida de automóveis

Fórmula 3000
type: Concept
definition: Corrida de velocidade de monopostos, com motores menos potentes que os de F1. Os pilotos competem individualmente e por equipes em vários circuitos mundiais, segundo especificações da Federação Internacional do Automóvel (FIA).
in scheme: mediatopic
created: 2009-10-22T02:00:00+00:00
modified: 2021-02-18T12:00:00+00:00
retired: 2017-07-04T12:00:00+00:00
broader: corrida de automóveis

Fórmula 1
type: Concept
definition: Corrida de velocidade de monopostos em que 20 ou mais pilotos competem lado a lado em vários circuitos mundiais para ganhar pontos em cada Grande Prêmio, do campeonato individual e de construtores.
in scheme: mediatopic
created: 2009-10-22T02:00:00+00:00
modified: 2021-02-18T12:00:00+00:00
retired: 2017-07-04T12:00:00+00:00
broader: corrida de automóveis

Fórmula Indy
type: Concept
definition: Corrida de velocidade de monopostos da liga profissional norte-americana de corridas de velocidade.
in scheme: mediatopic
created: 2009-10-22T02:00:00+00:00
modified: 2021-02-18T12:00:00+00:00
retired: 2017-07-04T12:00:00+00:00
broader: corrida de automóveis

rallycross
type: Concept
definition: Corridas de rali por etapas em circuitos de terra.
in scheme: mediatopic
created: 2009-10-22T02:00:00+00:00
modified: 2021-02-18T12:00:00+00:00
retired: 2017-07-04T12:00:00+00:00
broader: corrida de automóveis

rali
type: Concept
definition: Corridas de resistência, disputadas em circuitos delimitados que incluem caminhos de terra e estradas, usando carros especialmente adaptados com piloto e copiloto.
in scheme: mediatopic
created: 2009-10-22T02:00:00+00:00
modified: 2021-02-18T12:00:00+00:00
retired: 2017-07-04T12:00:00+00:00
broader: corrida de automóveis

motociclismo
type: Concept
definition: Corridas com veículos de 2, 3 ou 4 rodas com selim e guidão.
in scheme: mediatopic
created: 2009-10-22T02:00:00+00:00
modified: 2021-02-18T12:00:00+00:00
has facet: motorcyclingtype
broader: disciplina de competição
narrower: resistência
narrower: enduro
narrower: grass-track
narrower: motoball
narrower: motocross
narrower: motoGP
narrower: rali de motos
narrower: sidecar
narrower: speedway
narrower: trial

resistência
type: Concept
definition: Corrida de estrada de resistência e regularidade.
in scheme: mediatopic
created: 2009-10-22T02:00:00+00:00
modified: 2021-02-18T12:00:00+00:00
retired: 2017-07-04T12:00:00+00:00
broader: motociclismo

enduro
type: Concept
definition: Corrida de velocidade, resistência e regularidade sobre várias superfícies como florestas e estradas de terra.
in scheme: mediatopic
created: 2009-10-22T02:00:00+00:00
modified: 2021-02-18T12:00:00+00:00
retired: 2017-07-04T12:00:00+00:00
broader: motociclismo

grass-track
type: Concept
definition: Corrida de motos em pista de grama.
in scheme: mediatopic
created: 2009-10-22T02:00:00+00:00
modified: 2021-02-18T12:00:00+00:00
retired: 2017-07-04T12:00:00+00:00
broader: motociclismo

motoball
type: Concept
definition: Esporte de equipe em que os pilotos jogam bola.
in scheme: mediatopic
created: 2009-10-22T02:00:00+00:00
modified: 2021-02-18T12:00:00+00:00
retired: 2017-07-04T12:00:00+00:00
broader: motociclismo

motocross
type: Concept
definition: Corrida de motos em piso de terra com grandes desníveis.
in scheme: mediatopic
created: 2009-10-22T02:00:00+00:00
modified: 2021-02-18T12:00:00+00:00
retired: 2017-07-04T12:00:00+00:00
broader: motociclismo

motoGP
type: Concept
definition: Categoria de 1000cc.
in scheme: mediatopic
created: 2009-10-22T02:00:00+00:00
modified: 2021-02-18T12:00:00+00:00
retired: 2017-07-04T12:00:00+00:00
broader: motociclismo

rali de motos
type: Concept
definition: Corridas de motos em estrada.
in scheme: mediatopic
created: 2009-10-22T02:00:00+00:00
modified: 2021-02-18T12:00:00+00:00
retired: 2017-07-04T12:00:00+00:00
broader: motociclismo

sidecar
type: Concept
definition: Categoria de veículos com diferentes tamanhos de motor, mas com a característica comum de ter um pequeno carro fixo do lado, para transporte de outro passageiro.
in scheme: mediatopic
created: 2009-10-22T02:00:00+00:00
modified: 2021-05-05T12:00:00+00:00
retired: 2017-07-04T12:00:00+00:00
broader: motociclismo

speedway
type: Concept
definition: Corrida com até seis pilotos que competem em pista oval plana. As motos têm apenas uma marcha e não têm freios.
in scheme: mediatopic
created: 2009-10-22T02:00:00+00:00
modified: 2021-02-18T12:00:00+00:00
retired: 2017-07-04T12:00:00+00:00
broader: motociclismo

trial
type: Concept
definition: Corrida de resistência e regularidade, realizada em percursos acidentados, e em que os pilotos devem ultrapassar vários obstáculos, naturais ou artificiais.
in scheme: mediatopic
created: 2009-10-22T02:00:00+00:00
modified: 2021-02-18T12:00:00+00:00
retired: 2017-07-04T12:00:00+00:00
broader: motociclismo

naginata
type: Concept
definition: Arte marcial tradicional japonesa que usa uma espada curva de madeira.
in scheme: mediatopic
created: 2009-10-22T02:00:00+00:00
modified: 2021-02-18T12:00:00+00:00
broader: artes marciais

netball
type: Concept
definition: Esporte feminino, semelhante ao basquetebol, mas sem a tabela que segura o cesto.
in scheme: mediatopic
created: 2009-10-22T02:00:00+00:00
modified: 2021-02-18T12:00:00+00:00
broader: disciplina de competição

orientação
type: Concept
definition: Corrida individual contra o relógio em percurso assinalado por marcas. O atleta, que prossegue com a ajuda de bússola e mapa, tem que procurar e encontrar as marcas segundo determinada ordem.
in scheme: mediatopic
created: 2009-10-22T02:00:00+00:00
modified: 2021-02-18T12:00:00+00:00
broader: disciplina de competição
narrower: orientação em esqui

orientação em esqui
type: Concept
definition: Corrida individual de esqui contra o relógio em percurso assinalado por marcas. O atleta, que prossegue com a ajuda de bússola e mapa, tem que procurar e encontrar as marcas segundo determinada ordem.
in scheme: mediatopic
created: 2009-10-22T02:00:00+00:00
modified: 2021-02-18T12:00:00+00:00
broader: orientação

paraquedismo
type: Concept
definition: Saltar de um avião usando um paraquedas. Competições de paraquedismo: precisão de aterragem, volteio, individual ou por equipes.
in scheme: mediatopic
created: 2009-10-22T02:00:00+00:00
modified: 2021-02-18T12:00:00+00:00
broader: disciplina de competição

polo
type: Concept
definition: Com ajuda de um taco, duas equipes de 4 cavaleiros tentam introduzir uma bola de bambu no gol adversário, em campo de 250m de comprimento e 150m de largura. O jogo é dividido em 4, 6 ou 8 períodos de 7min e 30s chamados *chukkas*.
in scheme: mediatopic
created: 2009-10-22T02:00:00+00:00
modified: 2021-02-18T12:00:00+00:00
broader: disciplina de competição

bilhar
type: Concept
definition: Jogo disputado com um taco e diferente número de bolas em mesa revestida com pano de feltro e dotada de buracos com bolsas.
in scheme: mediatopic
created: 2009-10-22T02:00:00+00:00
modified: 2021-02-18T12:00:00+00:00
broad match: http://cv.iptc.org/newscodes/subjectcode/15010000
has facet: billiardtype
broader: disciplina de competição

motonáutica
type: Concept
definition: Corridas de barcos a motor em rios ou lagos.
in scheme: mediatopic
created: 2009-10-22T02:00:00+00:00
modified: 2021-02-18T12:00:00+00:00
broader: disciplina de competição

rodeio
type: Concept
definition: Disciplina em que cavalos ou bois selvagens podem ser montados e domados.
in scheme: mediatopic
created: 2009-10-22T02:00:00+00:00
modified: 2021-02-18T12:00:00+00:00
broader: disciplina de competição
narrower: bareback
narrower: barrel racing
narrower: bull riding
narrower: bulldogging
narrower: calf roping
narrower: goat roping
narrower: saddle bronc

bareback
type: Concept
definition: Disciplina de rodeio.
in scheme: mediatopic
created: 2009-10-22T02:00:00+00:00
modified: 2021-07-12T12:00:00+00:00
broader: rodeio

barrel racing
type: Concept
definition: Disciplina de rodeio.
in scheme: mediatopic
created: 2009-10-22T02:00:00+00:00
modified: 2021-07-12T12:00:00+00:00
broader: rodeio

bull riding
type: Concept
definition: Disciplina de rodeio.
in scheme: mediatopic
created: 2009-10-22T02:00:00+00:00
modified: 2021-07-12T12:00:00+00:00
broader: rodeio

bulldogging
type: Concept
definition: Disciplina de rodeio.
in scheme: mediatopic
created: 2009-10-22T02:00:00+00:00
modified: 2021-07-12T12:00:00+00:00
broader: rodeio

calf roping
type: Concept
definition: Disciplina de rodeio.
in scheme: mediatopic
created: 2009-10-22T02:00:00+00:00
modified: 2021-07-12T12:00:00+00:00
broader: rodeio

goat roping
type: Concept
definition: Disciplina de rodeio.
in scheme: mediatopic
created: 2009-10-22T02:00:00+00:00
modified: 2021-07-12T12:00:00+00:00
broader: rodeio

saddle bronc
type: Concept
definition: Disciplina de rodeio.
in scheme: mediatopic
created: 2009-10-22T02:00:00+00:00
modified: 2021-07-12T12:00:00+00:00
broader: rodeio

hóquei em patins
type: Concept
definition: Esporte de equipe semelhante ao hóquei no gelo, executado sobre patins de 4 rodas, com tacos e uma bola.
in scheme: mediatopic
created: 2009-10-22T02:00:00+00:00
modified: 2021-02-18T12:00:00+00:00
broader: esportes sobre patins

remo
type: Concept
definition: Corrida de barcos em águas calmas com embarcações de 1, 2, 4 ou 8 remadores.
in scheme: mediatopic
created: 2009-10-22T02:00:00+00:00
modified: 2021-02-18T12:00:00+00:00
has facet: rowingtype
broader: disciplina de competição
narrower: quatro com timoneiro
narrower: dois com timoneiro
narrower: quatro sem timoneiro
narrower: dois sem timoneiro
narrower: double sculls
narrower: oito com timoneiro
narrower: quadruple sculls
narrower: skiff

quatro com timoneiro
type: Concept
definition: Barco de quatro pessoas com apenas um remo cada uma e com um companheiro de equipe para dar instruções.
in scheme: mediatopic
created: 2009-10-22T02:00:00+00:00
modified: 2021-12-21T12:00:00+00:00
retired: 2015-02-24T12:00:00+00:00
broad match: http://cv.iptc.org/newscodes/subjectcode/15047000
broader: remo

dois com timoneiro
type: Concept
definition: Barco de duas pessoas com apenas um remo cada uma e com um companheiro de equipe para dar instruções.
in scheme: mediatopic
created: 2009-10-22T02:00:00+00:00
modified: 2021-12-21T12:00:00+00:00
retired: 2015-02-24T12:00:00+00:00
broad match: http://cv.iptc.org/newscodes/subjectcode/15047000
broader: remo

quatro sem timoneiro
type: Concept
definition: Barco de quatro pessoas com apenas um remo cada uma e sem companheiro de equipe para dar instruções.
in scheme: mediatopic
created: 2009-10-22T02:00:00+00:00
modified: 2021-12-21T12:00:00+00:00
retired: 2015-02-24T12:00:00+00:00
broader: remo

dois sem timoneiro
type: Concept
definition: Barco de duas pessoas com apenas um remo cada uma e sem companheiro de equipe para dar instruções.
in scheme: mediatopic
created: 2009-10-22T02:00:00+00:00
modified: 2021-12-21T12:00:00+00:00
retired: 2015-02-24T12:00:00+00:00
broader: remo

double sculls
type: Concept
definition: Barco de duas pessoas com dois remos cada uma.
in scheme: mediatopic
created: 2009-10-22T02:00:00+00:00
modified: 2021-12-21T12:00:00+00:00
retired: 2015-02-24T12:00:00+00:00
broader: remo

oito com timoneiro
type: Concept
definition: Barco de oito pessoas com apenas um remo cada uma e com um companheiro de equipe para dar instruções.
in scheme: mediatopic
created: 2009-10-22T02:00:00+00:00
modified: 2021-12-21T12:00:00+00:00
retired: 2015-02-24T12:00:00+00:00
broad match: http://cv.iptc.org/newscodes/subjectcode/15047006
broader: remo

quadruple sculls
type: Concept
definition: Barco de quatro pessoas com dois remos cada uma e sem companheiro de equipe para dar instruções.
in scheme: mediatopic
created: 2009-10-22T02:00:00+00:00
modified: 2021-12-21T12:00:00+00:00
retired: 2015-02-24T12:00:00+00:00
broader: remo

skiff
type: Concept
definition: Barco de uma pessoa com dois remos.
in scheme: mediatopic
created: 2009-10-22T02:00:00+00:00
modified: 2021-12-21T12:00:00+00:00
retired: 2015-02-24T12:00:00+00:00
broader: remo

rúgbi de 13
type: Concept
definition: Jogo de bola em campo gramado opondo duas equipes de 13 jogadores, que tentam marcar ensaios e penalidades correndo e passando uma bola oval com as mãos e os pés.
in scheme: mediatopic
created: 2009-10-22T02:00:00+00:00
modified: 2021-07-12T12:00:00+00:00
broader: rúgbi

rúgbi de 15
type: Concept
definition: Jogo de bola em campo gramado opondo duas equipes de 15 jogadores, que tentam marcar ensaios e penalidades correndo e passando uma bola oval com as mãos e os pés.
in scheme: mediatopic
created: 2009-10-22T02:00:00+00:00
modified: 2021-02-18T12:00:00+00:00
broader: rúgbi

rúgbi de 7
type: Concept
definition: Jogo de bola em campo gramado opondo duas equipes de 7 jogadores, que tentam marcar ensaios e penalidades correndo e passando uma bola oval com as mãos e os pés.
in scheme: mediatopic
created: 2009-10-22T02:00:00+00:00
modified: 2021-07-12T12:00:00+00:00
broader: rúgbi

vela
type: Concept
definition: Corrida de barcos a vela em percurso assinalado com boias.
in scheme: mediatopic
created: 2009-10-22T02:00:00+00:00
modified: 2021-02-18T12:00:00+00:00
has facet: sailingtype
broader: disciplina de competição
narrower: multicasco
narrower: dinghy
narrower: keelboat
narrower: regata a vela
narrower: regata oceânica
narrower: corrida de volta ao mundo
narrower: regata em solitário
narrower: non-stop em solitário

multicasco
type: Concept
definition: Embarcação de vários cascos.
in scheme: mediatopic
created: 2009-10-22T02:00:00+00:00
modified: 2021-05-05T12:00:00+00:00
retired: 2017-07-04T12:00:00+00:00
broader: vela

dinghy
type: Concept
definition: Embarcação de casco simples sem quilha fixa.
in scheme: mediatopic
created: 2009-10-22T02:00:00+00:00
modified: 2021-02-18T12:00:00+00:00
retired: 2017-07-04T12:00:00+00:00
broad match: http://cv.iptc.org/newscodes/subjectcode/15050013
broader: vela

keelboat
type: Concept
definition: Embarcação de casco simples com quilha fixa.
in scheme: mediatopic
created: 2009-10-22T02:00:00+00:00
modified: 2021-05-05T12:00:00+00:00
retired: 2017-07-04T12:00:00+00:00
broad match: http://cv.iptc.org/newscodes/subjectcode/15050013
broader: vela

regata a vela
type: Concept
definition: Evento com embarcação dotada de vela.
in scheme: mediatopic
created: 2009-10-22T02:00:00+00:00
modified: 2021-05-05T12:00:00+00:00
retired: 2017-07-04T12:00:00+00:00
broad match: http://cv.iptc.org/newscodes/subjectcode/15050000
broader: vela

regata oceânica
type: Concept
definition: Corrida de embarcações à volta do mundo através dos oceanos.
in scheme: mediatopic
created: 2009-10-22T02:00:00+00:00
modified: 2021-05-05T12:00:00+00:00
retired: 2017-07-04T12:00:00+00:00
broad match: http://cv.iptc.org/newscodes/subjectcode/15050000
broader: vela

corrida de volta ao mundo
type: Concept
definition: Corrida de embarcações em mar aberto à volta do mundo.
in scheme: mediatopic
created: 2009-10-22T02:00:00+00:00
modified: 2021-05-05T12:00:00+00:00
retired: 2017-07-04T12:00:00+00:00
broader: vela

regata em solitário
type: Concept
definition: Corrida de embarcações com um só tripulante à volta do mundo através dos oceanos.
in scheme: mediatopic
created: 2009-10-22T02:00:00+00:00
modified: 2021-05-05T12:00:00+00:00
retired: 2017-07-04T12:00:00+00:00
broad match: http://cv.iptc.org/newscodes/subjectcode/15050000
broader: vela

non-stop em solitário
type: Concept
definition: Corrida à volta do mundo feita no sentido horário ou anti-horário e sem parar em qualquer porto entre o início e o fim da corrida.
in scheme: mediatopic
created: 2009-10-22T02:00:00+00:00
modified: 2021-02-18T12:00:00+00:00
retired: 2017-07-04T12:00:00+00:00
broad match: http://cv.iptc.org/newscodes/subjectcode/15050012
broader: vela

sepak takraw
type: Concept
definition: Jogo semelhante ao vôlei mas em que não se usam as mãos e a bola é feita de ratã ou de bambu.
in scheme: mediatopic
created: 2009-10-22T02:00:00+00:00
modified: 2021-02-18T12:00:00+00:00
broader: disciplina de competição

shinty
type: Concept
definition: Jogo de bola que envolve 2 equipes com tacos curvos chamados *camans*. O objetivo é marcar gols, introduzindo a pequena bola de couro no gol.
in scheme: mediatopic
created: 2009-10-22T02:00:00+00:00
modified: 2021-02-18T12:00:00+00:00
broad match: http://cv.iptc.org/newscodes/subjectcode/15000000
broader: disciplina de competição

tiro
type: Concept
definition: Esporte de precisão que usa revólver, carabina ou espingarda.
in scheme: mediatopic
created: 2009-10-22T02:00:00+00:00
modified: 2023-10-02T12:00:00+00:00
has facet: shootingtype
broader: disciplina de competição
narrower: pistola
narrower: carabina
narrower: alvo móvel
narrower: espingarda
narrower: tiro ao prato

pistola
type: Concept
definition: Prova de tiro com pistola.
in scheme: mediatopic
created: 2009-10-22T02:00:00+00:00
modified: 2021-02-18T12:00:00+00:00
retired: 2017-07-04T12:00:00+00:00
broad match: http://cv.iptc.org/newscodes/subjectcode/15051001
broader: tiro

carabina
type: Concept
definition: Prova de tiro com carabina.
in scheme: mediatopic
created: 2009-10-22T02:00:00+00:00
modified: 2021-05-05T12:00:00+00:00
retired: 2017-07-04T12:00:00+00:00
broad match: http://cv.iptc.org/newscodes/subjectcode/15051002
broader: tiro

alvo móvel
type: Concept
definition: Prova de tiro com uma arma de pressão e um alvo que se move para os lados.
in scheme: mediatopic
created: 2009-10-22T02:00:00+00:00
modified: 2021-05-05T12:00:00+00:00
retired: 2017-07-04T12:00:00+00:00
broad match: http://cv.iptc.org/newscodes/subjectcode/15051003
broader: tiro

espingarda
type: Concept
definition: Prova de tiro com espingarda.
in scheme: mediatopic
created: 2009-10-22T02:00:00+00:00
modified: 2021-05-05T12:00:00+00:00
retired: 2017-07-04T12:00:00+00:00
broad match: http://cv.iptc.org/newscodes/subjectcode/15051004
broader: tiro

tiro ao prato
type: Concept
definition: Prova de tiro em que o atirador dispara contra alvos lançados ao ar, conhecidos como pratos.
in scheme: mediatopic
created: 2009-10-22T02:00:00+00:00
modified: 2021-05-05T12:00:00+00:00
retired: 2017-07-04T12:00:00+00:00
broad match: http://cv.iptc.org/newscodes/subjectcode/15051005
broader: tiro

skeleton
type: Concept
definition: No skeleton, o esquiador, deitado de barriga para baixo num trenó especial, tenta descer o mais rápido possível uma pista de gelo.
in scheme: mediatopic
created: 2009-10-22T02:00:00+00:00
modified: 2021-02-18T12:00:00+00:00
broader: disciplina de competição

esqui
type: Concept
definition: Esporte de inverno na neve que usa diferentes tipos de esquis.
in scheme: mediatopic
created: 2009-10-22T02:00:00+00:00
modified: 2021-02-18T12:00:00+00:00
broad match: http://cv.iptc.org/newscodes/subjectcode/15000000
broader: disciplina de competição
narrower: esqui alpino
narrower: esqui estilo livre
narrower: esqui na grama
narrower: esqui nórdico
narrower: saltos de esqui
narrower: esqui de fundo
narrower: combinado nórdico
narrower: telemark
narrower: http://cv.iptc.org/newscodes/mediatopic/20001390

esqui alpino
type: Concept
definition: Esquiar por uma encosta abaixo, em pistas cobertas de neve, usando técnicas e equipamento alpinos. As pistas têm pórticos espaçados de acordo com a disciplina envolvida.
in scheme: mediatopic
created: 2009-10-22T02:00:00+00:00
modified: 2021-02-18T12:00:00+00:00
has facet: alpineskiingtype
broader: esqui

esqui estilo livre
type: Concept
definition: Os esquiadores realizam uma série de figuras acrobáticas após saltar de uma rampa. Mistura de *moguls* (bossas ou lombas na pista), saltos e balé em esqui.
in scheme: mediatopic
created: 2009-10-22T02:00:00+00:00
modified: 2022-02-03T12:00:00+00:00
has facet: freestyleskiingtype
broader: esqui

esqui na grama
type: Concept
definition: Esqui alpino em patins com rodas sobre grama.
in scheme: mediatopic
created: 2009-10-22T02:00:00+00:00
modified: 2021-02-18T12:00:00+00:00
broader: esqui

esqui nórdico
type: Concept
definition: Modalidade de esqui praticada na natureza e baseado na força e na resistência. Há eventos clássicos e de estilo livre, com largada coletiva ou individual.
in scheme: mediatopic
created: 2009-10-22T02:00:00+00:00
modified: 2021-02-18T12:00:00+00:00
retired: 2019-08-01T12:00:00+00:00
has facet: nordicskiingtype
broader: esqui

saltos de esqui
type: Concept
definition: Os esquiadores ganham velocidade descendo uma rampa coberta de neve e saltam o mais longe possível, sendo avaliados pela distância coberta, pelo estilo de voo e pela qualidade da recepção.
in scheme: mediatopic
created: 2009-10-22T02:00:00+00:00
modified: 2021-02-18T12:00:00+00:00
broader: esqui

salto em queda livre
type: Concept
definition: Competições de paraquedismo envolvendo salto em queda livre.
in scheme: mediatopic
created: 2009-10-22T02:00:00+00:00
modified: 2021-02-18T12:00:00+00:00
broader: disciplina de competição

sinuca
type: Concept
definition: Esporte de taco e bolas disputado sobre uma mesa e com uma ordem específica para as jogar.
in scheme: mediatopic
created: 2009-10-22T02:00:00+00:00
modified: 2021-02-18T12:00:00+00:00
has facet: billiardtype
broader: disciplina de competição

snowboard
type: Concept
definition: Esporte que consiste em manter o equilíbrio em cima de uma prancha que desliza por uma descida coberta de neve.
in scheme: mediatopic
created: 2009-10-22T02:00:00+00:00
modified: 2021-02-18T12:00:00+00:00
has facet: snowboardingtype
broader: disciplina de competição

futebol
type: Concept
definition: Jogo de bola disputado entre duas equipes de 11 jogadores que, durante 90 minutos, tentam chutar ou cabecear a bola para o gol adversário.
in scheme: mediatopic
created: 2009-10-22T02:00:00+00:00
modified: 2024-09-26T12:00:00+00:00
broader: disciplina de competição
narrower: http://cv.iptc.org/newscodes/mediatopic/20001393
narrower: http://cv.iptc.org/newscodes/mediatopic/20001394

softball
type: Concept
definition: Jogo semelhante ao beisebol mas com uma bola maior e mais leve, um bastão mais fino, espaços mais curtos entre as bases e menos entradas.
in scheme: mediatopic
created: 2009-10-22T02:00:00+00:00
modified: 2021-02-18T12:00:00+00:00
broader: disciplina de competição

patinação (velocidade)
type: Concept
definition: Corridas disputadas por 2 patinadores em pista oval de gelo.
in scheme: mediatopic
created: 2009-10-22T02:00:00+00:00
modified: 2021-03-31T12:00:00+00:00
broader: disciplina de competição

squash
type: Concept
definition: Jogo de estratégia e resistência, disputado individualmente ou por equipes de 2 jogadores, com raquete e bola de borracha, em quadra retangular fechada dos quatro lados.
in scheme: mediatopic
created: 2009-10-22T02:00:00+00:00
modified: 2021-02-18T12:00:00+00:00
broader: disciplina de competição

sumô
type: Concept
definition: Esporte de combate de origem japonesa, baseado na força e na rapidez, em que os lutadores tentam derrubar ou deixar o adversário fora da área de combate. Geralmente, é praticado no Japão, com muita cerimônia, e por homens de grande porte.
in scheme: mediatopic
created: 2009-10-22T02:00:00+00:00
modified: 2021-02-18T12:00:00+00:00
broader: disciplina de competição

surfe
type: Concept
definition: Esporte aquático em que os praticantes, equilibrados em cima de uma prancha, deslizam pelas ondas.
in scheme: mediatopic
created: 2009-10-22T02:00:00+00:00
modified: 2021-02-18T12:00:00+00:00
broader: disciplina de competição

natação
type: Concept
definition: Esporte aquático em que os atletas nadam o mais rápido possível em determinado estilo.
in scheme: mediatopic
created: 2009-10-22T02:00:00+00:00
modified: 2021-02-18T12:00:00+00:00
has facet: swimmingtype
broader: disciplina de competição
narrower: costas
narrower: peito
narrower: borboleta
narrower: livre
narrower: medley
narrower: maratona aquática
narrower: revezamento livre
narrower: revezamento medley
narrower: piscina curta

costas
type: Concept
definition: Estilo de nado em que o nadador, de costas para o fundo, bate as pernas e gira os braços para trás para progredir.
in scheme: mediatopic
created: 2009-10-22T02:00:00+00:00
modified: 2021-12-21T12:00:00+00:00
retired: 2015-02-24T12:00:00+00:00
broad match: http://cv.iptc.org/newscodes/subjectcode/15062000
broader: natação

peito
type: Concept
definition: Estilo de nado em que o nadador, de barriga para o fundo, realiza movimentos para a frente e para fora com os braços e para trás e para fora com as pernas.
in scheme: mediatopic
created: 2009-10-22T02:00:00+00:00
modified: 2021-12-21T12:00:00+00:00
retired: 2015-02-24T12:00:00+00:00
broad match: http://cv.iptc.org/newscodes/subjectcode/15062000
broader: natação

borboleta
type: Concept
definition: Estilo de nado em que o nadador mantém os ombros paralelos à água e projeta os braços para fora, como um moinho, com batimentos simultâneos das pernas, que permanecem juntas. É a prova de natação mais exigente.
in scheme: mediatopic
created: 2009-10-22T02:00:00+00:00
modified: 2021-12-21T12:00:00+00:00
retired: 2015-02-24T12:00:00+00:00
broad match: http://cv.iptc.org/newscodes/subjectcode/15062000
broader: natação

livre
type: Concept
definition: Prova em que o nadador pode escolher qualquer estilo, embora o crawl seja o estilo mais usado.
in scheme: mediatopic
created: 2009-10-22T02:00:00+00:00
modified: 2021-12-21T12:00:00+00:00
retired: 2015-02-24T12:00:00+00:00
broader: natação

medley
type: Concept
definition: Prova que combina os quatro estilos de nado em uma só corrida.
in scheme: mediatopic
created: 2009-10-22T02:00:00+00:00
modified: 2021-12-21T12:00:00+00:00
retired: 2015-02-24T12:00:00+00:00
broad match: http://cv.iptc.org/newscodes/subjectcode/15062000
broader: natação

maratona aquática
type: Concept
definition: Prova de natação de grandes distâncias em águas abertas.
in scheme: mediatopic
created: 2009-10-22T02:00:00+00:00
modified: 2021-07-12T12:00:00+00:00
broad match: http://cv.iptc.org/newscodes/subjectcode/15062000
broader: natação

revezamento livre
type: Concept
definition: Uma equipe de nadadores faz uma prova de estafeta no estilo de nado à escolha de cada nadador.
in scheme: mediatopic
created: 2009-10-22T02:00:00+00:00
modified: 2021-12-21T12:00:00+00:00
retired: 2015-02-24T12:00:00+00:00
broad match: http://cv.iptc.org/newscodes/subjectcode/15062000
broader: natação

revezamento medley
type: Concept
definition: Prova de revezamento em que uma equipe de nadadores faz uma combinação de quatro estilos diferentes de nado.
in scheme: mediatopic
created: 2009-10-22T02:00:00+00:00
modified: 2021-12-21T12:00:00+00:00
retired: 2015-02-24T12:00:00+00:00
broad match: http://cv.iptc.org/newscodes/subjectcode/15062000
broader: natação

piscina curta
type: Concept
definition: Corridas realizadas em piscina de 25m de comprimento.
in scheme: mediatopic
created: 2009-10-22T02:00:00+00:00
modified: 2021-12-21T12:00:00+00:00
retired: 2015-02-24T12:00:00+00:00
broad match: http://cv.iptc.org/newscodes/subjectcode/15062000
broader: natação

sincronizada livre
type: Concept
definition: No programa livre, música, movimentos e sua ordem de execução não são predeterminados.
in scheme: mediatopic
created: 2009-10-22T02:00:00+00:00
modified: 2021-02-18T12:00:00+00:00
broader: nado sincronizado

sincronizada
type: Concept
definition: Os nadadores executam determinados movimentos sincronizados e artísticos na água, sendo avaliados por 10 juízes. No programa técnico, os nadadores devem executar uma série de figuras específicas segundo determinada ordem.
in scheme: mediatopic
created: 2009-10-22T02:00:00+00:00
modified: 2021-02-18T12:00:00+00:00
broader: nado sincronizado

tênis de mesa
type: Concept
definition: Esporte de raquete para 2 ou 4 jogadores, que rebatem uma bola leve para a área do adversário, praticado sobre mesa divida por uma rede.
in scheme: mediatopic
created: 2009-10-22T02:00:00+00:00
modified: 2021-03-15T12:00:00+00:00
broader: disciplina de competição

taekwondo
type: Concept
definition: Arte marcial de origem coreana.
in scheme: mediatopic
created: 2009-10-22T02:00:00+00:00
modified: 2021-02-18T12:00:00+00:00
broader: artes marciais

tênis
type: Concept
definition: Esporte em que 2 jogadores, ou 4 em pares, se defrontam em quadra dividida por rede, rebatendo com raquete uma bola de borracha para a área adversária.
in scheme: mediatopic
created: 2009-10-22T02:00:00+00:00
modified: 2021-02-18T12:00:00+00:00
broader: disciplina de competição

boliche
type: Concept
definition: Jogo que consiste em derrubar um conjunto de 10 pinos alinhados no final de uma pista através do lançamento de uma bola pesada. Se falhar, o jogador tem até 10 tentativas para derrubar todos os pinos.
in scheme: mediatopic
created: 2009-10-22T02:00:00+00:00
modified: 2021-02-18T12:00:00+00:00
broader: disciplina de competição

triatlo
type: Concept
definition: Prova de resistência que inclui três disciplinas diferentes - natação, ciclismo e corrida a pé - executadas em cadeia. As distâncias variam de acordo com a competição.
in scheme: mediatopic
created: 2009-10-22T02:00:00+00:00
modified: 2021-02-18T12:00:00+00:00
broader: disciplina de competição

cabo de guerra
type: Concept
definition: Duas equipes puxam de cada lado de uma corda.
in scheme: mediatopic
created: 2009-10-22T02:00:00+00:00
modified: 2021-02-18T12:00:00+00:00
broader: disciplina de competição

vôlei
type: Concept
definition: Jogo de bola que opõe duas equipes de 6 jogadores em quadra dividida ao meio por rede. Os jogadores usam as mãos para fazer passar a bola por cima da rede para cair na área adversária, marcando assim pontos.
in scheme: mediatopic
created: 2009-10-22T02:00:00+00:00
modified: 2021-02-18T12:00:00+00:00
broader: disciplina de competição
narrower: vôlei de praia

vôlei de praia
type: Concept
definition: Jogo de bola que opõe duas equipes de 2 jogadores ao ar livre, em campo de areia dividido ao meio por rede. A areia torna esta modalidade mais difícil do que o vôlei de interior.
in scheme: mediatopic
created: 2009-10-22T02:00:00+00:00
modified: 2021-02-18T12:00:00+00:00
broader: vôlei

polo aquático
type: Concept
definition: Esporte náutico praticado em piscina e disputador por duas equipes de 7 nadadores, que só podem usar uma mão para passar a bola ou nadar com ela antes de arremessar ao gol adversário.
in scheme: mediatopic
created: 2009-10-22T02:00:00+00:00
modified: 2021-02-18T12:00:00+00:00
broader: disciplina de competição

esqui náutico
type: Concept
definition: Com um ou dois esquis, os participantes são puxados por uma embarcação a motor ao longo da superfície da água.
in scheme: mediatopic
created: 2009-10-22T02:00:00+00:00
modified: 2021-02-18T12:00:00+00:00
has facet: waterskiingtype
broader: disciplina de competição

halterofilismo
type: Concept
definition: Teste de força em que os atletas tentam levantar o máximo de peso possível.
in scheme: mediatopic
created: 2009-10-22T02:00:00+00:00
modified: 2021-07-12T12:00:00+00:00
has facet: weightliftingtype
broader: disciplina de competição
narrower: arremesso
narrower: levantamento de peso básico
narrower: arranco

arremesso
type: Concept
definition: A barra de pesos é primeiro levantada até os ombros e só depois arremessada acima da cabeça, posição que o atleta deve manter durante alguns segundos com as pernas esticadas.
in scheme: mediatopic
created: 2009-10-22T02:00:00+00:00
modified: 2021-07-12T12:00:00+00:00
retired: 2017-07-04T12:00:00+00:00
broader: halterofilismo

levantamento de peso básico
type: Concept
definition: Teste de força em que os atletas tentam levantar o máximo de peso possível.
in scheme: mediatopic
created: 2009-10-22T02:00:00+00:00
modified: 2021-02-18T12:00:00+00:00
retired: 2017-07-04T12:00:00+00:00
broader: halterofilismo

arranco
type: Concept
definition: A barra de pesos deve ser levantada do solo até acima da cabeça com um só movimento.
in scheme: mediatopic
created: 2009-10-22T02:00:00+00:00
modified: 2021-07-12T12:00:00+00:00
retired: 2017-07-04T12:00:00+00:00
broader: halterofilismo

windsurf
type: Concept
definition: Competição de prancha a vela em que os participantes devem completar o mais rápido possível um percurso aquático demarcado.
in scheme: mediatopic
created: 2009-10-22T02:00:00+00:00
modified: 2021-02-18T12:00:00+00:00
has facet: windsurfingtype
broader: disciplina de competição

luta livre
type: Concept
definition: Esporte de combate em que cada lutador tenta ganhar derrubando o adversário ou segurando os seus ombros para o manter no solo.
in scheme: mediatopic
created: 2009-10-22T02:00:00+00:00
modified: 2021-02-18T12:00:00+00:00
has facet: weightclasstype
broader: disciplina de competição
narrower: estilo livre
narrower: greco-romana
narrower: luta suíça

estilo livre
type: Concept
definition: Estilo de luta onde é permitido agarrar com as pernas.
in scheme: mediatopic
created: 2009-10-22T02:00:00+00:00
modified: 2021-02-18T12:00:00+00:00
broader: luta livre

greco-romana
type: Concept
definition: Estilo de luta onde só é permitido agarrar entre a cintura e a cabeça.
in scheme: mediatopic
created: 2009-10-22T02:00:00+00:00
modified: 2021-02-18T12:00:00+00:00
broader: luta livre

luta suíça
type: Concept
definition: Esporte tradicional suíço, semelhante à luta livre, mas com regras específicas.
in scheme: mediatopic
created: 2009-10-22T02:00:00+00:00
modified: 2021-02-18T12:00:00+00:00
broader: luta livre

wushu
type: Concept
definition: Arte marcial tradicional chinesa.
in scheme: mediatopic
created: 2009-10-22T02:00:00+00:00
modified: 2021-02-18T12:00:00+00:00
broader: artes marciais

medidas disciplinares no esporte
type: Concept
definition: Ações, incluindo multas e suspensões, atribuídas por equipes e organizações esportivas.
in scheme: mediatopic
created: 2009-10-22T02:00:00+00:00
modified: 2021-02-18T12:00:00+00:00
broader: esporte

dopagem (geral)
type: Concept
definition: Utilização de substâncias proibidas para aumentar a competitividade no esporte.
in scheme: mediatopic
created: 2009-10-22T02:00:00+00:00
modified: 2022-09-23T12:00:00+00:00
broad match: http://cv.iptc.org/newscodes/subjectcode/15000000
broader: esporte
narrower: dopagem
narrower: exame antidoping
narrower: uso de medicamentos no esporte

dopagem
type: Concept
definition: Utilização de substâncias proibidas para aumentar a competitividade no esporte.
in scheme: mediatopic
created: 2009-10-22T02:00:00+00:00
modified: 2022-09-23T12:00:00+00:00
retired: 2022-09-23T12:00:00+00:00
broad match: http://cv.iptc.org/newscodes/subjectcode/15000000
broader: dopagem (geral)

exame antidoping
type: Concept
definition: Meios e formas de verificar o uso de drogas no esporte.
in scheme: mediatopic
created: 2009-10-22T02:00:00+00:00
modified: 2022-09-23T12:00:00+00:00
retired: 2022-09-23T12:00:00+00:00
broad match: http://cv.iptc.org/newscodes/subjectcode/15000000
broader: dopagem (geral)

uso de medicamentos no esporte
type: Concept
definition: Uso de medicamentos no esporte por razões médicas, de acordo com o estipulado pelos reguladores esportivos.
in scheme: mediatopic
created: 2009-10-22T02:00:00+00:00
modified: 2022-09-23T12:00:00+00:00
retired: 2022-09-23T12:00:00+00:00
broad match: http://cv.iptc.org/newscodes/subjectcode/15000000
broader: dopagem (geral)

eventos esportivos
type: Concept
definition: Evento com uma ou mais competições esportivas.
in scheme: mediatopic
created: 2009-10-22T02:00:00+00:00
modified: 2021-07-12T12:00:00+00:00
broader: esporte
narrower: campeonato continental
narrower: copa continental
narrower: jogos continentais
narrower: campeonato internacional
narrower: copa internacional
narrower: jogos internacionais
narrower: campeonato nacional
narrower: copa nacional
narrower: jogos nacionais
narrower: campeonato regional
narrower: copa regional
narrower: jogos regionais
narrower: campeonato do mundo
narrower: copa do mundo
narrower: jogos mundiais
narrower: jogos olímpicos
narrower: jogos paraolímpicos
narrower: http://cv.iptc.org/newscodes/mediatopic/20001341
narrower: http://cv.iptc.org/newscodes/mediatopic/20001342
narrower: http://cv.iptc.org/newscodes/mediatopic/20001343

campeonato continental
type: Concept
definition: Competição em que podem participar indivíduos ou equipes de países de um continente. Designa-se por *Campeonato*.
in scheme: mediatopic
created: 2009-10-22T02:00:00+00:00
modified: 2021-12-17T12:00:00+00:00
retired: 2021-12-17T12:00:00+00:00
broad match: http://cv.iptc.org/newscodes/subjectcode/15073028
broader: eventos esportivos

copa continental
type: Concept
definition: Competição em que podem participar indivíduos ou equipes de países de um continente. Designa-se por *Copa*.
in scheme: mediatopic
created: 2009-10-22T02:00:00+00:00
modified: 2021-12-17T12:00:00+00:00
retired: 2021-12-17T12:00:00+00:00
broader: eventos esportivos

jogos continentais
type: Concept
definition: Competição em que podem participar indivíduos ou equipes de países de um continente. Designa-se por *Jogos*.
in scheme: mediatopic
created: 2009-10-22T02:00:00+00:00
modified: 2021-12-17T12:00:00+00:00
retired: 2021-12-17T12:00:00+00:00
broad match: http://cv.iptc.org/newscodes/subjectcode/15073000
broader: eventos esportivos

campeonato internacional
type: Concept
definition: Competição em que podem participar indivíduos ou equipes de diferentes países. Designa-se por *Campeonato*.
in scheme: mediatopic
created: 2009-10-22T02:00:00+00:00
modified: 2021-12-17T12:00:00+00:00
retired: 2021-12-17T12:00:00+00:00
broad match: http://cv.iptc.org/newscodes/subjectcode/15073000
broader: eventos esportivos

copa internacional
type: Concept
definition: Competição em que podem participar indivíduos ou equipes de diferentes países. Designa-se por *Copa*.
in scheme: mediatopic
created: 2009-10-22T02:00:00+00:00
modified: 2021-12-17T12:00:00+00:00
retired: 2021-12-17T12:00:00+00:00
broader: eventos esportivos

jogos internacionais
type: Concept
definition: Competição em que podem participar indivíduos ou equipes de diferentes países. Designa-se por *Jogos*.
in scheme: mediatopic
created: 2009-10-22T02:00:00+00:00
modified: 2021-12-17T12:00:00+00:00
retired: 2021-12-17T12:00:00+00:00
broad match: http://cv.iptc.org/newscodes/subjectcode/15073000
broader: eventos esportivos

campeonato nacional
type: Concept
definition: Competição em que podem participar indivíduos ou equipes de um país. Designa-se por *Campeonato*.
in scheme: mediatopic
created: 2009-10-22T02:00:00+00:00
modified: 2021-12-17T12:00:00+00:00
retired: 2021-12-17T12:00:00+00:00
broad match: http://cv.iptc.org/newscodes/subjectcode/15073000
broader: eventos esportivos

copa nacional
type: Concept
definition: Competição em que podem participar indivíduos ou equipes de um país. Designa-se por *Copa*.
in scheme: mediatopic
created: 2009-10-22T02:00:00+00:00
modified: 2021-12-17T12:00:00+00:00
retired: 2021-12-17T12:00:00+00:00
broader: eventos esportivos

jogos nacionais
type: Concept
definition: Competição em que podem participar indivíduos ou equipes de um país. Designa-se por *Jogos*.
in scheme: mediatopic
created: 2009-10-22T02:00:00+00:00
modified: 2021-12-17T12:00:00+00:00
retired: 2021-12-17T12:00:00+00:00
broad match: http://cv.iptc.org/newscodes/subjectcode/15073000
broader: eventos esportivos

campeonato regional
type: Concept
definition: Competição em que podem participar indivíduos ou equipes de uma região. Designa-se por *Campeonato*.
in scheme: mediatopic
created: 2009-10-22T02:00:00+00:00
modified: 2021-12-17T12:00:00+00:00
retired: 2021-12-17T12:00:00+00:00
broader: eventos esportivos

copa regional
type: Concept
definition: Competição em que podem participar indivíduos ou equipes de uma região. Designa-se por *Copa*.
in scheme: mediatopic
created: 2009-10-22T02:00:00+00:00
modified: 2021-12-17T12:00:00+00:00
retired: 2021-12-17T12:00:00+00:00
broader: eventos esportivos

jogos regionais
type: Concept
definition: Competição em que podem participar indivíduos ou equipes de uma região. Designa-se por *Jogos*.
in scheme: mediatopic
created: 2009-10-22T02:00:00+00:00
modified: 2021-12-17T12:00:00+00:00
retired: 2021-12-17T12:00:00+00:00
broad match: http://cv.iptc.org/newscodes/subjectcode/15073000
broader: eventos esportivos

campeonato do mundo
type: Concept
definition: Competição em que podem participar indivíduos ou equipes dos cinco continentes. Designa-se por *Campeonato do Mundo*.
in scheme: mediatopic
created: 2009-10-22T02:00:00+00:00
modified: 2021-12-17T12:00:00+00:00
retired: 2021-12-17T12:00:00+00:00
broader: eventos esportivos

copa do mundo
type: Concept
definition: Competição em que podem participar indivíduos ou equipes dos cinco continentes. Designa-se por *Copa do Mundo*.
in scheme: mediatopic
created: 2009-10-22T02:00:00+00:00
modified: 2021-12-17T12:00:00+00:00
retired: 2021-12-17T12:00:00+00:00
broader: eventos esportivos

jogos mundiais
type: Concept
definition: Competição em que podem participar indivíduos ou equipes dos cinco continentes. Designa-se por *Jogos Mundiais*.
in scheme: mediatopic
created: 2009-10-22T02:00:00+00:00
modified: 2021-12-17T12:00:00+00:00
retired: 2021-12-17T12:00:00+00:00
broader: eventos esportivos

indústria do esporte
type: Concept
definition: Questões comerciais relacionadas ao esporte.
in scheme: mediatopic
created: 2009-10-22T02:00:00+00:00
modified: 2021-02-18T12:00:00+00:00
broad match: http://cv.iptc.org/newscodes/subjectcode/15000000
broader: esporte

organizações esportivas
type: Concept
definition: Organizações responsáveis por um evento esportivo.
in scheme: mediatopic
created: 2009-10-22T02:00:00+00:00
modified: 2023-10-02T12:00:00+00:00
broader: esporte

instalação esportiva
type: Concept
definition: Construção (edifício, estrutura ou recinto) devidamente preparada para receber eventos esportivos.
in scheme: mediatopic
created: 2009-10-22T02:00:00+00:00
modified: 2021-03-31T12:00:00+00:00
broad match: http://cv.iptc.org/newscodes/subjectcode/15000000
broader: esporte

previsão meteorológica
type: Concept
definition: Previsão do tempo meteorológico a curto e a longo prazo.
in scheme: mediatopic
created: 2009-10-22T02:00:00+00:00
modified: 2021-02-18T12:00:00+00:00
broader: meteorologia

fenômenos climáticos
type: Concept
definition: Fenômenos meteorológicos de curta ou longa duração, dignos de estudo, relatórios ou assessoria pública, como mudanças climáticas, tempestades, ondas de calor ou tornados.
in scheme: mediatopic
created: 2009-10-22T02:00:00+00:00
modified: 2021-05-05T12:00:00+00:00
broad match: http://cv.iptc.org/newscodes/subjectcode/17003001
broader: meteorologia

estatísticas climáticas
type: Concept
definition: Fatos numéricos sobre o tempo, como temperatura, pressão atmosférica, níveis dos rios, umidade, marés altas e marés baixas etc.
in scheme: mediatopic
created: 2009-10-22T02:00:00+00:00
modified: 2021-02-18T12:00:00+00:00
broader: meteorologia

alerta meteorológico
type: Concept
definition: Alertas gerais à população sobre a aproximação de mau tempo.
in scheme: mediatopic
created: 2009-10-22T02:00:00+00:00
modified: 2021-02-18T12:00:00+00:00
broader: meteorologia

política cultural
type: Concept
definition: Políticas governamentais relativas a assuntos culturais.
in scheme: mediatopic
created: 2012-10-04T12:00:00+00:00
modified: 2025-03-31T12:00:00+00:00
broader: política governamental

musical
type: Concept
definition: Gênero de teatro musical no qual o canto e a dança são parte essencial da narrativa.
in scheme: mediatopic
created: 2012-10-04T12:00:00+00:00
modified: 2021-09-30T12:00:00+00:00
broader: teatro

opereta
type: Concept
definition: Gênero de teatro musical de tema leve ou bem-humorado em que parte do libreto é geralmente falada em vez de cantada.
in scheme: mediatopic
created: 2012-10-04T12:00:00+00:00
modified: 2021-09-30T12:00:00+00:00
broader: teatro

exposição artística
type: Concept
definition: Apresentação temporária de arte em museus, salas de arte ou galerias.
in scheme: mediatopic
created: 2012-10-04T12:00:00+00:00
modified: 2023-03-31T12:00:00+00:00
broader: cultura

feira profissional
type: Concept
definition: Exposição organizada para exibir e comercializar bens ou serviços de determinado setor profissional.
in scheme: mediatopic
created: 2012-10-04T12:00:00+00:00
modified: 2023-03-31T12:00:00+00:00
broader: http://cv.iptc.org/newscodes/mediatopic/20001371

recomendação de ações
type: Concept
definition: Recomendação de um analista para ações específicas. Pode incluir o preço-alvo do analista para uma ação.
in scheme: mediatopic
created: 2012-10-04T12:00:00+00:00
modified: 2023-03-31T12:00:00+00:00
retired: 2023-03-31T12:00:00+00:00
broader: ações
narrower: recomendação de compra
narrower: recomendação de manutenção
narrower: recomendação de venda

recomendação de compra
type: Concept
definition: Recomendação de um analista para comprar ações específicas. Pode incluir o preço-alvo do analista para uma ação.
in scheme: mediatopic
created: 2012-10-04T12:00:00+00:00
modified: 2023-03-31T12:00:00+00:00
retired: 2023-03-31T12:00:00+00:00
broader: recomendação de ações

recomendação de manutenção
type: Concept
definition: Recomendação de um analista para manter ações específicas. Pode incluir o preço-alvo do analista para uma ação.
in scheme: mediatopic
created: 2012-10-04T12:00:00+00:00
modified: 2023-03-31T12:00:00+00:00
retired: 2023-03-31T12:00:00+00:00
broader: recomendação de ações

recomendação de venda
type: Concept
definition: Recomendação de um analista para vender ações específicas. Pode incluir o preço-alvo do analista para uma ação.
in scheme: mediatopic
created: 2012-10-04T12:00:00+00:00
modified: 2023-03-31T12:00:00+00:00
retired: 2023-03-31T12:00:00+00:00
broader: recomendação de ações

hot stock
type: Concept
definition: Movimentos de preço assinaláveis de determinada ação.
in scheme: mediatopic
created: 2012-10-04T12:00:00+00:00
modified: 2023-03-31T12:00:00+00:00
retired: 2023-03-31T12:00:00+00:00
broader: ações

montanhismo
type: Concept
definition: Atividades esportivas em montanhas, incluindo escalada e caminhada.
in scheme: mediatopic
created: 2012-10-04T12:00:00+00:00
modified: 2023-10-02T12:00:00+00:00
broader: atividades recreativas ao ar livre

festa
type: Concept
definition: Evento social que reúne pessoas convidadas, geralmente com comida, bebida, dança ou jogos.
in scheme: mediatopic
created: 2012-10-04T12:00:00+00:00
modified: 2021-07-12T12:00:00+00:00
broader: estilo de vida

serviço alternativo
type: Concept
definition: Serviço não remunerado feito por um civil para a comunidade.
in scheme: mediatopic
created: 2012-10-04T12:00:00+00:00
modified: 2021-07-12T12:00:00+00:00
retired: 2025-03-31T12:00:00+00:00
broader: serviços públicos

serviço militar
type: Concept
definition: Serviço obrigatório nas forças militares nacionais por um período limitado de tempo.
in scheme: mediatopic
created: 2012-10-04T12:00:00+00:00
modified: 2021-07-12T12:00:00+00:00
broader: forças armadas

política de integração
type: Concept
definition: Políticas para melhorar a coexistência de grupos da sociedade.
in scheme: mediatopic
created: 2012-10-04T12:00:00+00:00
modified: 2025-03-31T12:00:00+00:00
retired: 2025-03-31T12:00:00+00:00
broader: política governamental

políticas esportivas
type: Concept
definition: Políticas governamentais relativas ao esporte.
in scheme: mediatopic
created: 2012-10-04T12:00:00+00:00
modified: 2025-03-31T12:00:00+00:00
broader: política governamental

transferência
type: Concept
definition: Mudança de um membro de uma equipe para outra.
in scheme: mediatopic
created: 2012-10-04T12:00:00+00:00
modified: 2021-07-12T12:00:00+00:00
broader: esporte

esqui de fundo
type: Concept
definition: Modalidade de esqui praticada na natureza, em terreno relativamente plano e coberto de neve, com esquis estreitos.
in scheme: mediatopic
created: 2014-01-17T12:00:00+00:00
modified: 2021-02-18T12:00:00+00:00
broader: esqui

combinado nórdico
type: Concept
definition: Competição de dois dias que combina saltos de esqui e esqui de fundo.
in scheme: mediatopic
created: 2014-01-20T12:00:00+00:00
modified: 2021-02-18T12:00:00+00:00
broader: esqui

patinação de pista curta
type: Concept
definition: Corridas de 4 ou mais patinadores em pista oval de gelo. Provas de qualificação, semifinais e finais determinam os vencedores.
in scheme: mediatopic
created: 2014-01-20T12:00:00+00:00
modified: 2021-02-18T12:00:00+00:00
broader: disciplina de competição

ginástica artística
type: Concept
definition: Modalidade de ginástica em que os atletas realizam movimentos artísticos e acrobáticos em diferentes aparelhos. Existem 6 disciplinas para homens e 4 disciplinas para mulheres.
in scheme: mediatopic
created: 2014-04-11T12:00:00+00:00
modified: 2021-07-12T12:00:00+00:00
has facet: artisticgymtype
broader: ginástica
narrower: trave
narrower: solo
narrower: barra
narrower: barras paralelas
narrower: cavalo com alças
narrower: argolas
narrower: barras assimétricas
narrower: salto

telemark
type: Concept
definition: Modalidade de esqui que combina corridas de esqui de descida livre e de fundo com técnicas e equipamentos exclusivos, como o calcanhar solto do esqui.
in scheme: mediatopic
created: 2014-11-07T12:00:00+00:00
modified: 2021-07-12T12:00:00+00:00
broader: esqui

xadrez
type: Concept
definition: Jogo de estratégia entre dois jogadores no qual se utiliza um tabuleiro dividido em casas alternadamente claras e escuras, com 16 peças para cada jogador, que se jogam com movimentos específicos que dependem da sua identidade.
in scheme: mediatopic
created: 2014-11-07T12:00:00+00:00
modified: 2021-07-12T12:00:00+00:00
broader: disciplina de competição

esportes sobre patins
type: Concept
definition: Várias competições que usam equipamento sobre patins, como patins de rodas, patins em linha ou esqueites.
in scheme: mediatopic
created: 2014-11-07T12:00:00+00:00
modified: 2021-07-12T12:00:00+00:00
broader: disciplina de competição
narrower: hóquei em patins
narrower: skate

skate
type: Concept
definition: Competições envolvendo manobras e acrobacias realizadas em skate usando várias rampas e outros obstáculos.
in scheme: mediatopic
created: 2014-11-07T12:00:00+00:00
modified: 2021-07-12T12:00:00+00:00
broader: esportes sobre patins

artes marciais
type: Concept
definition: Sistemas codificados e tradições de práticas de combate, praticadas por uma variedade de razões: autodefesa, competição, saúde e condicionamento físico, entretenimento, bem como desenvolvimento mental, físico e espiritual.
in scheme: mediatopic
created: 2015-08-27T12:00:00+00:00
modified: 2021-07-12T12:00:00+00:00
broader: disciplina de competição
narrower: judô
narrower: jukendo
narrower: caratê
narrower: kendo
narrower: kyudo
narrower: naginata
narrower: taekwondo
narrower: wushu
narrower: artes marciais mistas
narrower: krav maga
narrower: kickboxing
narrower: sambo

empreendedorismo
type: Concept
definition: O processo de projetar, lançar e executar um novo negócio.
in scheme: mediatopic
created: 2016-04-04T12:00:00+00:00
modified: 2024-03-28T12:00:00+00:00
broader: empresas

contrato público
type: Concept
definition: Contratos escritos feitos entre empresas e autoridades públicas para a execução de obras, o fornecimento de produtos ou a prestação de serviços.
in scheme: mediatopic
created: 2016-04-04T12:00:00+00:00
modified: 2021-07-12T12:00:00+00:00
broader: estratégia e marketing

artesanato
type: Concept
definition: Produtos ou serviços realizados com métodos e ferramentas simples, por oposição à produção industrial em massa.
in scheme: mediatopic
created: 2016-04-04T12:00:00+00:00
modified: 2023-03-31T12:00:00+00:00
broader: bens de consumo

internet das coisas
type: Concept
definition: Rede de objetos e utensílios interligados por protocolos de comunicação, usando microchips, sensores eletrônicos e comunicação pela Internet.
in scheme: mediatopic
created: 2016-04-04T12:00:00+00:00
modified: 2023-03-31T12:00:00+00:00
retired: 2023-03-31T12:00:00+00:00
broader: informática e tecnologias de informação

gestão de ativos
type: Concept
definition: Gestão de ativos ou de fundos para aumentar a renda, investindo em ações, títulos, fundos mútuos, fundos multimercado etc.
in scheme: mediatopic
created: 2016-04-04T12:00:00+00:00
modified: 2023-03-31T12:00:00+00:00
broader: http://cv.iptc.org/newscodes/mediatopic/20001370

gestão de relacionamento com o cliente
type: Concept
definition: Criação e manutenção de uma relação com os clientes para aumentar as vendas.
in scheme: mediatopic
created: 2016-04-04T12:00:00+00:00
modified: 2023-03-31T12:00:00+00:00
broader: estratégia e marketing

sistema de pagamento
type: Concept
definition: Serviços para a execução de pagamentos, incluindo dinheiro, cheque, cartão de crédito, cartão de débito, débito direto, transferência eletrônica de fundos, internet banking, pagamento eletrônico e móvel.
in scheme: mediatopic
created: 2016-04-04T12:00:00+00:00
modified: 2023-03-31T12:00:00+00:00
broader: http://cv.iptc.org/newscodes/mediatopic/20001371

bens de produção
type: Concept
definition: Bens duráveis utilizados na produção de outros bens ou serviços.
in scheme: mediatopic
created: 2016-04-04T12:00:00+00:00
modified: 2023-03-31T12:00:00+00:00
retired: 2023-03-31T12:00:00+00:00
broader: indústria metalomecânica e engenharia

construção ferroviária
type: Concept
definition: Fabricantes e fornecedores de material circulante, ferrovias, sistemas de sinalização, manutenção e reparação.
in scheme: mediatopic
created: 2016-04-04T12:00:00+00:00
modified: 2023-03-31T12:00:00+00:00
broader: indústria metalomecânica e engenharia

equipamento médico
type: Concept
definition: Fabricação de dispositivos médicos e cirúrgicos para diagnóstico e tratamento.
in scheme: mediatopic
created: 2016-04-04T12:00:00+00:00
modified: 2023-03-31T12:00:00+00:00
broader: http://cv.iptc.org/newscodes/mediatopic/20001354

produtos e serviços para animais de estimação
type: Concept
definition: Produtos de higiene, cuidados e alimentação para animais de estimação.
in scheme: mediatopic
created: 2016-04-04T12:00:00+00:00
modified: 2023-03-31T12:00:00+00:00
broader: bens de consumo

cigarro eletrônico
type: Concept
definition: Dispositivo eletrônico dotado de bateria, atomizador e um cartucho com uma solução líquida com ou sem nicotina.
in scheme: mediatopic
created: 2016-04-04T12:00:00+00:00
modified: 2023-03-31T12:00:00+00:00
retired: 2023-03-31T12:00:00+00:00
broader: indústria transformadora

logística
type: Concept
definition: Gestão da cadeia de abastecimento, do inventário de estoque e do transporte de produtos.
in scheme: mediatopic
created: 2016-04-04T12:00:00+00:00
modified: 2023-03-31T12:00:00+00:00
broader: transportes

economia colaborativa
type: Concept
definition: Acesso a bens e serviços em redes colaborativas.
in scheme: mediatopic
created: 2016-04-04T12:00:00+00:00
modified: 2024-03-28T12:00:00+00:00
broader: economia (geral)

pequena e média empresa
type: Concept
definition: Uma pequena e média empresa (PME) é uma empresa cujo número de funcionários, saldo e volume de negócios não pode exceder certos limites definidos pelo país onde está localizada.
in scheme: mediatopic
created: 2016-04-04T12:00:00+00:00
modified: 2024-03-28T12:00:00+00:00
broader: empresas

agência reguladora
type: Concept
definition: Autoridade responsável pela regulamentação ou supervisão de um setor empresarial.
in scheme: mediatopic
created: 2016-04-04T12:00:00+00:00
modified: 2025-03-31T12:00:00+00:00
retired: 2025-03-31T12:00:00+00:00
broader: governo

política de desenvolvimento regional
type: Concept
definition: Ações públicas ou privadas realizadas com o objetivo de desenvolver uma região.
in scheme: mediatopic
created: 2016-04-04T12:00:00+00:00
modified: 2025-03-31T12:00:00+00:00
broader: política governamental

nado sincronizado
type: Concept
definition: Esporte em que os nadadores, em configurações individuais, em dueto ou por equipes, executam movimentos coordenados ou idênticos ao som de música. Eles são avaliados e recebem pontos pela posição do corpo, controle e grau de dificuldade dos movimentos.
in scheme: mediatopic
created: 2016-04-05T12:00:00+00:00
modified: 2021-07-12T12:00:00+00:00
broader: disciplina de competição
narrower: sincronizada livre
narrower: sincronizada

rúgbi
type: Concept
definition: Tipo de futebol desenvolvido em Rugby (Inglaterra) jogado com uma bola oval que pode ser chutada, carregada e passada de mão em mão. Os pontos são marcados quando uma equipe coloca a bola sobre a linha de meta da outra equipe ou chuta a bola entre os dois postes da baliza.
in scheme: mediatopic
created: 2016-04-05T12:00:00+00:00
modified: 2021-07-12T12:00:00+00:00
broader: disciplina de competição
narrower: rúgbi de 13
narrower: rúgbi de 15
narrower: rúgbi de 7

jogos olímpicos
type: Concept
definition: Evento esportivo internacional organizado pelo Comitê Olímpico Internacional e realizado a cada 4 anos no verão ou inverno.
in scheme: mediatopic
created: 2016-08-24T12:00:00+00:00
modified: 2021-12-17T12:00:00+00:00
broader: eventos esportivos

jogos paraolímpicos
type: Concept
definition: Evento esportivo internacional para atletas com deficiência organizado pelo Comitê Paraolímpico Internacional e realizado a cada 4 anos no verão ou inverno.
in scheme: mediatopic
created: 2016-08-24T12:00:00+00:00
modified: 2021-12-17T12:00:00+00:00
broader: eventos esportivos

série
type: Concept
definition: Conjunto ligado de episódios de programas fictícios ou não, exibidos sob o mesmo título.
in scheme: mediatopic
created: 2017-11-16T12:00:00+00:00
modified: 2021-07-12T12:00:00+00:00
broader: arte e entretenimento

drama (teatro)
type: Concept
definition: Gênero teatral em que peças dramáticas ou cômicas são representadas em palco.
in scheme: mediatopic
created: 2018-04-09T12:00:00+00:00
modified: 2021-07-12T12:00:00+00:00
broader: teatro

festival
type: Concept
definition: Eventos que exibem atividades artísticas e que ocorrem com regularidade, como festivais de dança, música, teatro, poesia ou comédia.
in scheme: mediatopic
created: 2018-04-09T12:00:00+00:00
modified: 2021-07-12T12:00:00+00:00
broader: arte e entretenimento
narrower: festivais de cinema

mídias sociais
type: Concept
definition: Tecnologia que permite a criação e partilha de informação online.
in scheme: mediatopic
created: 2018-04-09T12:00:00+00:00
modified: 2021-07-12T12:00:00+00:00
broader: mídia de massas
narrower: influenciadores

esporte eletrônico
type: Concept
definition: Competições de jogos de vídeo disputadas por jogadores profissionais.
in scheme: mediatopic
created: 2018-04-19T12:00:00+00:00
modified: 2021-07-12T12:00:00+00:00
broader: disciplina de competição

hip-hop
type: Concept
definition: Gênero musical surgido em comunidades afro-americanas dos Estados Unidos da década de 1970, que consiste em fazer rap, geralmente com um apoio musical eletrônico.
in scheme: mediatopic
created: 2019-04-06T12:00:00+00:00
modified: 2021-07-12T12:00:00+00:00
broader: gênero musical

R&B
type: Concept
definition: Gênero musical surgido em comunidades afro-americanas nos anos 1940 e com coros emotivos, cheios de alma.
in scheme: mediatopic
created: 2019-04-06T12:00:00+00:00
modified: 2021-07-12T12:00:00+00:00
broader: gênero musical

heavy metal
type: Concept
definition: Gênero de música rock pesada e agressiva surgida no final dos anos 1960 e início dos anos 1970.
in scheme: mediatopic
created: 2019-04-06T12:00:00+00:00
modified: 2021-07-12T12:00:00+00:00
broader: gênero musical

música de banda de dança
type: Concept
definition: Gênero musical de origem sueca, caracterizado por música inspirada em swing, schlager, country, jazz e rock, que frequentemente se dança em pares.
in scheme: mediatopic
created: 2019-04-06T12:00:00+00:00
modified: 2021-07-12T12:00:00+00:00
broader: gênero musical

música de dança eletrônica
type: Concept
definition: Gênero musical que usa instrumentos eletrônicos e que é feito principalmente para boates, raves e festivais.
in scheme: mediatopic
created: 2019-04-06T12:00:00+00:00
modified: 2021-07-12T12:00:00+00:00
broader: gênero musical

música para crianças
type: Concept
definition: Gênero musical com músicas compostas e executadas para crianças.
in scheme: mediatopic
created: 2019-04-06T12:00:00+00:00
modified: 2021-07-12T12:00:00+00:00
broader: gênero musical

stand-up
type: Concept
definition: Estilo de comédia em que um comediante, habitualmente de pé, conta uma série de piadas ou histórias à frente de um público ao vivo, falando diretamente para ele.
in scheme: mediatopic
created: 2019-04-06T12:00:00+00:00
modified: 2021-07-12T12:00:00+00:00
broader: teatro

cabaré
type: Concept
definition: Tipo de entretenimento teatral com música, canções, dança, récita ou representação, que é apresentado em clubes noturnos ou em restaurantes enquanto o público come ou bebe à mesa.
in scheme: mediatopic
created: 2019-04-06T12:00:00+00:00
modified: 2021-09-30T12:00:00+00:00
broader: teatro

influenciadores
type: Concept
definition: Pessoas que distribuem conteúdo em fóruns da Internet e mídias sociais e são seguidas por muitas pessoas, influenciando-as para comprar e usar produtos.
in scheme: mediatopic
created: 2019-04-06T12:00:00+00:00
modified: 2021-07-12T12:00:00+00:00
broader: mídias sociais

má conduta sexual
type: Concept
definition: Comportamento indesejado de natureza sexual que constitui uma ofensa menor do que a agressão sexual dolosa, particularmente quando o comportamento ocorre em contexto normalmente não sexual, ou quando há algum aspecto de poder ou autoridade pessoal envolvido.
in scheme: mediatopic
created: 2019-04-06T12:00:00+00:00
modified: 2024-07-01T12:00:00+00:00
broader: problemas sociais

fraude contábil
type: Concept
definition: Deturpação intencional ou alteração de registros contábeis relativos a vendas, receitas, despesas e outros fatores.
in scheme: mediatopic
created: 2019-04-06T12:00:00+00:00
modified: 2021-07-12T12:00:00+00:00
broader: crime econômico

sonegação fiscal
type: Concept
definition: Evasão ilegal de impostos por indivíduos, corporações e fundos.
in scheme: mediatopic
created: 2019-04-06T12:00:00+00:00
modified: 2021-07-12T12:00:00+00:00
broader: fraude

infração de trânsito
type: Concept
definition: Infrações rodoviárias graves que possam causar, ou que causaram, possível perigo, ferimento ou morte de pessoa ou pessoas, ou possível perigo ou danos significativos de propriedade.
in scheme: mediatopic
created: 2019-04-06T12:00:00+00:00
modified: 2021-07-12T12:00:00+00:00
broader: crime

direito administrativo
type: Concept
definition: Conjunto de leis que regulam o funcionamento das instituições administrativas governamentais.
in scheme: mediatopic
created: 2019-04-06T12:00:00+00:00
modified: 2021-07-12T12:00:00+00:00
broader: leis

tratamento psiquiátrico por ordem judicial
type: Concept
definition: Tratamento psiquiátrico imposto a pessoas com problemas de saúde mental em prisões e cadeias ou como condição de liberdade condicional ou de supervisão.
in scheme: mediatopic
created: 2019-04-06T12:00:00+00:00
modified: 2021-07-12T12:00:00+00:00
broader: pena/sentença

suspensão da pena
type: Concept
definition: Disposição legal que permite que um juiz suspenda, mediante condições, o cumprimento de uma sentença por uma pessoa que tenha sido considerada culpada de um crime.
in scheme: mediatopic
created: 2019-04-06T12:00:00+00:00
modified: 2021-07-12T12:00:00+00:00
broader: pena/sentença

investigação criminal arquivada
type: Concept
definition: Encerramento que a polícia e/ou os promotores fazem de investigação criminal por falta de conclusão.
in scheme: mediatopic
created: 2019-04-06T12:00:00+00:00
modified: 2021-07-12T12:00:00+00:00
broader: investigação (criminal)

atropelamento de animais selvagens
type: Concept
definition: Acidentes de trânsito envolvendo animais selvagens.
in scheme: mediatopic
created: 2019-04-06T12:00:00+00:00
modified: 2021-07-12T12:00:00+00:00
broader: acidente rodoviário

incêndio florestal
type: Concept
definition: Incêndio incontrolável em área de vegetação combustível no campo ou em zona rural.
in scheme: mediatopic
created: 2019-04-06T12:00:00+00:00
modified: 2021-07-12T12:00:00+00:00
broader: incêndios

artes têxteis
type: Concept
definition: Artes e ofícios que usam fibras vegetais, animais ou sintéticas para construir objetos práticos ou decorativos.
in scheme: mediatopic
created: 2019-04-06T12:00:00+00:00
modified: 2021-07-12T12:00:00+00:00
broader: artes visuais

marcenaria
type: Concept
definition: A atividade ou a arte de fazer objetos de madeira, como móveis ou armários.
in scheme: mediatopic
created: 2019-04-06T12:00:00+00:00
modified: 2021-07-12T12:00:00+00:00
broader: artes visuais

forjamento
type: Concept
definition: Modelagem de metal usando forças de compressão localizadas, como aquecimento e martelamento.
in scheme: mediatopic
created: 2019-04-06T12:00:00+00:00
modified: 2021-07-12T12:00:00+00:00
broader: artes visuais

trabalho autônomo
type: Concept
definition: Situação do indivíduo que trabalha para si mesmo como freelancer ou como empresário em vez de trabalhar para um empregador que lhe paga um salário.
in scheme: mediatopic
created: 2019-04-06T12:00:00+00:00
modified: 2021-07-12T12:00:00+00:00
broader: emprego

biocombustível
type: Concept
definition: Combustível produzido a partir de material orgânico, como o etanol.
in scheme: mediatopic
created: 2019-04-06T12:00:00+00:00
modified: 2023-03-31T12:00:00+00:00
broader: energia e recursos

energia geotérmica
type: Concept
definition: Energia térmica que é gerada a partir do calor proveniente do interior da Terra.
in scheme: mediatopic
created: 2019-04-06T12:00:00+00:00
modified: 2023-03-31T12:00:00+00:00
broader: energias alternativas

energia solar
type: Concept
definition: Eletricidade gerada e colhida a partir dos raios solares.
in scheme: mediatopic
created: 2019-04-06T12:00:00+00:00
modified: 2023-03-31T12:00:00+00:00
broader: energias alternativas

energia hidrelétrica
type: Concept
definition: Eletricidade produzida a partir de energia hídrica quando a água passa através de turbinas.
in scheme: mediatopic
created: 2019-04-06T12:00:00+00:00
modified: 2023-03-31T12:00:00+00:00
broader: energias alternativas

energia eólica
type: Concept
definition: Eletricidade gerada pela energia cinética do vento, geralmente produzida por moinhos de vento ou turbinas.
in scheme: mediatopic
created: 2019-04-06T12:00:00+00:00
modified: 2023-03-31T12:00:00+00:00
broader: energias alternativas

escolas religiosas
type: Concept
definition: Escolas que ensinam ou são guiadas pelos princípios de uma determinada fé religiosa.
in scheme: mediatopic
created: 2019-04-06T12:00:00+00:00
modified: 2021-09-30T12:00:00+00:00
broader: escolas

escolas públicas
type: Concept
definition: Escolas financiadas por fundos públicos, geralmente impostos cobrados pelo governo.
in scheme: mediatopic
created: 2019-04-06T12:00:00+00:00
modified: 2021-09-30T12:00:00+00:00
broader: escolas

escolas privadas
type: Concept
definition: Escolas financiadas por organizações e fundos privados.
in scheme: mediatopic
created: 2019-04-06T12:00:00+00:00
modified: 2021-09-30T12:00:00+00:00
broader: escolas

escolas independentes
type: Concept
definition: Escolas financiadas por dinheiro de impostos através do governo, mas administradas por empresas, organizações ou cooperativas.
in scheme: mediatopic
created: 2019-04-06T12:00:00+00:00
modified: 2021-09-30T12:00:00+00:00
broader: escolas

ensino profissional
type: Concept
definition: Educação que prepara os alunos, fornece experiência prática e treinamento em um campo ocupacional específico. Por vezes é designada por educação profissional ou educação técnica.
in scheme: mediatopic
created: 2019-04-06T12:00:00+00:00
modified: 2021-09-30T12:00:00+00:00
broader: educação

classificação
type: Concept
definition: Nota ou avaliação do desempenho de um aluno em um teste, tarefa ou determinado curso.
in scheme: mediatopic
created: 2019-04-06T12:00:00+00:00
modified: 2021-09-30T12:00:00+00:00
broader: educação

pandemia
type: Concept
definition: Epidemia de uma doença infecciosa que se espalhou por uma região ampla ou mesmo por todo o mundo.
in scheme: mediatopic
created: 2019-04-06T12:00:00+00:00
modified: 2022-06-14T12:00:00+00:00
retired: 2022-06-14T12:00:00+00:00
broader: epidemia

cura de desintoxicação
type: Concept
definition: Tratamento médico ou psicoterapêutico para a dependência de substâncias psicoativas, como álcool, medicamentos ou drogas.
in scheme: mediatopic
created: 2019-04-06T12:00:00+00:00
modified: 2022-06-14T12:00:00+00:00
broader: tratamento de saúde

medicina de família e comunidade
type: Concept
definition: Especialidade médica que se dedica ao tratamento de uma ampla gama de problemas médicos gerais e de seus sintomas.
in scheme: mediatopic
created: 2019-04-06T12:00:00+00:00
modified: 2022-06-14T12:00:00+00:00
retired: 2022-06-14T12:00:00+00:00
broader: especialização médica

serviço de emergência
type: Concept
definition: Atendimento de pacientes que chegam com uma emergência médica pelos próprios meios ou transportados por ambulância.
in scheme: mediatopic
created: 2019-04-06T12:00:00+00:00
modified: 2022-06-14T12:00:00+00:00
broader: tratamento de saúde

ortopedia
type: Concept
definition: Especialidade médica que se dedica ao estudo e tratamento dos problemas que envolvem o sistema musculoesquelético.
in scheme: mediatopic
created: 2019-04-06T12:00:00+00:00
modified: 2022-06-14T12:00:00+00:00
retired: 2022-06-14T12:00:00+00:00
broader: especialização médica

oncologia
type: Concept
definition: Especialidade médica que se dedica ao estudo, prevenção, diagnóstico e tratamento do câncer.
in scheme: mediatopic
created: 2019-04-06T12:00:00+00:00
modified: 2022-06-14T12:00:00+00:00
retired: 2022-06-14T12:00:00+00:00
broader: especialização médica

radiologia
type: Concept
definition: Especialidade médica que se dedica ao estudo e emprego de imagens médicas (como raios X) e de radiação para diagnosticar e tratar doenças no interior do corpo.
in scheme: mediatopic
created: 2019-04-06T12:00:00+00:00
modified: 2022-06-14T12:00:00+00:00
retired: 2022-06-14T12:00:00+00:00
broader: especialização médica

oftalmologia
type: Concept
definition: Especialidade médica que se dedica ao estudo e tratamento de doenças e transtornos dos olhos.
in scheme: mediatopic
created: 2019-04-06T12:00:00+00:00
modified: 2022-06-14T12:00:00+00:00
broader: especialização médica

medicina cirúrgica
type: Concept
definition: Especialidade médica que se dedica ao tratamento de lesões ou traumatismos por meio de incisão ou manipulação, especialmente com instrumentos, no corpo do paciente.
in scheme: mediatopic
created: 2019-04-06T12:00:00+00:00
modified: 2022-06-14T12:00:00+00:00
retired: 2022-06-14T12:00:00+00:00
broader: especialização médica

psiquiatria
type: Concept
definition: Especialidade médica que se dedica ao estudo, diagnóstico, prevenção e tratamento de transtornos mentais.
in scheme: mediatopic
created: 2019-04-06T12:00:00+00:00
modified: 2022-06-14T12:00:00+00:00
retired: 2022-06-14T12:00:00+00:00
broader: especialização médica

cirurgia
type: Concept
definition: Uso de incisões feitas por instrumentos médicos para investigar ou tratar uma condição médica ou lesão.
in scheme: mediatopic
created: 2019-04-06T12:00:00+00:00
modified: 2021-07-12T12:00:00+00:00
broader: tratamento de saúde

centro de saúde
type: Concept
definition: Unidade médica local ou consultório médico associado a uma prática de medicina geral, com um ou vários médicos, que se dedica ao tratamento ambulatorial ou reencaminha para um especialista ou hospital.
in scheme: mediatopic
created: 2019-04-06T12:00:00+00:00
modified: 2021-07-12T12:00:00+00:00
broader: estabelecimento de saúde

responsabilidade social corporativa
type: Concept
definition: Práticas comerciais de uma empresa que refletem políticas sociais, éticas e ambientais responsáveis.
in scheme: mediatopic
created: 2019-04-06T12:00:00+00:00
modified: 2023-03-31T12:00:00+00:00
broader: gestão empresarial

artes marciais mistas
type: Concept
definition: Esporte de combate de contato total que usa técnicas de vários esportes de combate e artes marciais.
in scheme: mediatopic
created: 2019-04-06T12:00:00+00:00
modified: 2021-07-12T12:00:00+00:00
broader: artes marciais

assistência a idosos
type: Concept
definition: Cuidados continuados prestados a idosos por instituições residenciais ou por apoio domiciliário.
in scheme: mediatopic
created: 2019-06-26T12:00:00+00:00
modified: 2021-07-12T12:00:00+00:00
broader: assistência social

cerimônia de batismo
type: Concept
definition: Evento em que um bebê, jovem ou adulto recebe um nome.
in scheme: mediatopic
created: 2019-06-26T12:00:00+00:00
modified: 2021-07-12T12:00:00+00:00
broader: cerimônia

formatura
type: Concept
definition: Cerimônia na qual uma pessoa recebe um diploma ou grau acadêmico.
in scheme: mediatopic
created: 2019-06-26T12:00:00+00:00
modified: 2021-07-12T12:00:00+00:00
broader: cerimônia

funeral e serviço fúnebre
type: Concept
definition: Cerimônia para fazer homenagem a uma pessoa falecida e / ou o enterro dos restos mortais dessa pessoa.
in scheme: mediatopic
created: 2019-06-26T12:00:00+00:00
modified: 2021-07-12T12:00:00+00:00
broader: cerimônia

casamento
type: Concept
definition: Cerimônia de casamento, bem como eventos e festas relacionados, como recepções de casamento, festas de noivado, chás de panela e despedidas de solteiro / solteira.
in scheme: mediatopic
created: 2019-06-26T12:00:00+00:00
modified: 2021-07-12T12:00:00+00:00
broader: cerimônia

efeméride
type: Concept
definition: Data de aniversário especial de um evento ou celebração de uma quantidade significativa de anos desde o nascimento de uma pessoa notável.
in scheme: mediatopic
created: 2019-06-26T12:00:00+00:00
modified: 2021-07-12T12:00:00+00:00
broader: interesse humano

aniversário
type: Concept
definition: Celebração realizada na data anual do nascimento de uma pessoa.
in scheme: mediatopic
created: 2019-06-26T12:00:00+00:00
modified: 2021-07-12T12:00:00+00:00
broader: interesse humano

exercício físico
type: Concept
definition: Atividade física com o objetivo de manter e melhorar a saúde e o bem-estar, ganhar resistência ou se divertir.
in scheme: mediatopic
created: 2019-06-26T12:00:00+00:00
modified: 2021-12-17T12:00:00+00:00
broader: http://cv.iptc.org/newscodes/mediatopic/20001339

culturismo
type: Concept
definition: Competições em que os participantes realizam poses específicas para exibir os músculos fortalecidos e ampliados através de exercícios intensos. Os concorrentes são julgados com base em critérios como simetria, musculosidade e condição física.
in scheme: mediatopic
created: 2019-06-26T12:00:00+00:00
modified: 2021-07-12T12:00:00+00:00
broader: disciplina de competição

equitação
type: Concept
definition: Andar a cavalo para lazer ou para exercícios leves.
in scheme: mediatopic
created: 2019-06-26T12:00:00+00:00
modified: 2021-07-12T12:00:00+00:00
broader: atividades recreativas ao ar livre

corrida de obstáculos (atletismo)
type: Concept
definition: Corrida de obstáculos no atletismo, que inclui barreiras e saltos de água.
in scheme: mediatopic
created: 2019-07-23T12:00:00+00:00
modified: 2021-07-12T12:00:00+00:00
broader: atletismo

indústria do petróleo e do gás
type: Concept
definition: Exploração, extração, refino, transporte e comercialização de derivados de petróleo e de gás natural.
in scheme: mediatopic
created: 2019-07-25T12:00:00+00:00
modified: 2023-03-31T12:00:00+00:00
broader: energia e recursos
narrower: gasóleo
narrower: querosene/parafina
narrower: gás natural
narrower: gasolina

serviços públicos
type: Concept
definition: Prestação de serviços básicos, como fornecimento de água e remoção de resíduos ao público.
in scheme: mediatopic
created: 2019-07-25T12:00:00+00:00
modified: 2023-03-31T12:00:00+00:00
broader: setor econômico
narrower: produção e distribuição de eletricidade
narrower: indústria de gestão de resíduos
narrower: abastecimento de água
narrower: climatização

projetos de infraestrutura
type: Concept
definition: Construção das instalações e dos sistemas básicos que servem um país, cidade ou outra área, como estradas, pontes, represas, túneis, telecomunicações e redes elétricas.
in scheme: mediatopic
created: 2019-07-25T12:00:00+00:00
modified: 2021-07-12T12:00:00+00:00
broader: construção e propriedades

construção comercial
type: Concept
definition: Construção de edifícios para comércio e negócios, como prédios de escritórios, lojas, restaurantes, hotéis e estádios.
in scheme: mediatopic
created: 2019-07-25T12:00:00+00:00
modified: 2023-03-31T12:00:00+00:00
retired: 2023-03-31T12:00:00+00:00
broader: construção e propriedades

colecionismo
type: Concept
definition: Atividade que consiste em procurar, localizar, adquirir, organizar, catalogar, exibir, armazenar ou manter itens de interesse para um colecionador individual.
in scheme: mediatopic
created: 2019-07-30T12:00:00+00:00
modified: 2021-07-12T12:00:00+00:00
broader: passatempo

cosmética
type: Concept
definition: Produtos aplicados no corpo para melhorar a aparência, como batom, delineador, base e esmalte, bem como as tendências em torno da aplicação desses produtos.
in scheme: mediatopic
created: 2019-07-30T12:00:00+00:00
modified: 2021-07-12T12:00:00+00:00
broader: moda

penteados
type: Concept
definition: Tendências relativas a cortes de cabelo e penteados.
in scheme: mediatopic
created: 2019-07-30T12:00:00+00:00
modified: 2021-07-12T12:00:00+00:00
broader: moda

modificação corporal
type: Concept
definition: Ações realizadas para alterar de modo permanente ou semipermanente a aparência do corpo, como piercings e tatuagens.
in scheme: mediatopic
created: 2019-07-30T12:00:00+00:00
modified: 2021-07-12T12:00:00+00:00
broader: tendências
narrower: tatuagem
narrower: piercing

tatuagem
type: Concept
definition: Tipo de modificação corporal em que se cria um desenho ou texto inserindo tinta, corantes e pigmentos na camada da derme da pele para alterar permanentemente o pigmento da pele.
in scheme: mediatopic
created: 2019-07-30T12:00:00+00:00
modified: 2021-07-12T12:00:00+00:00
broader: modificação corporal

piercing
type: Concept
definition: Tipo de modificação corporal que envolve a perfuração ou corte de uma parte do corpo humano, criando uma abertura na qual se podem inserir joias ou implantes.
in scheme: mediatopic
created: 2019-07-30T12:00:00+00:00
modified: 2021-07-12T12:00:00+00:00
broader: modificação corporal

cozinhar
type: Concept
definition: Interesse por preparar refeições ou cozinhados.
in scheme: mediatopic
created: 2019-07-30T12:00:00+00:00
modified: 2021-07-12T12:00:00+00:00
broader: interesse gastronômico

cerveja, vinho e bebidas espirituosas
type: Concept
definition: Interesse pelo consumo, pela produção e pela coleção de bebidas alcoólicas.
in scheme: mediatopic
created: 2019-07-30T12:00:00+00:00
modified: 2021-07-12T12:00:00+00:00
broader: interesse gastronômico

reforma de casas
type: Concept
definition: Interesse por reformar casas.
in scheme: mediatopic
created: 2019-07-30T12:00:00+00:00
modified: 2021-07-12T12:00:00+00:00
broader: casa e decoração

decoração de interiores
type: Concept
definition: Interesse pela decoração de um espaço interior.
in scheme: mediatopic
created: 2019-07-30T12:00:00+00:00
modified: 2021-07-12T12:00:00+00:00
broader: casa e decoração

jardinagem
type: Concept
definition: Interesse por trabalhar no jardim.
in scheme: mediatopic
created: 2019-07-30T12:00:00+00:00
modified: 2021-07-12T12:00:00+00:00
broader: casa e decoração

eletrônica de consumo
type: Concept
definition: Dispositivos eletrônicos, como computadores, smartphones ou televisores, projetados e vendidos para uso pessoal.
in scheme: mediatopic
created: 2019-08-02T12:00:00+00:00
modified: 2021-07-12T12:00:00+00:00
broader: bens de consumo

convenção partidária
type: Concept
definition: Reunião de um partido político para nomear um candidato, escolher um líder ou definir políticas.
in scheme: mediatopic
created: 2019-09-05T12:00:00+00:00
modified: 2025-03-31T12:00:00+00:00
broader: governo

comissão parlamentar
type: Concept
definition: Subgrupo legislativo que se centra em uma área ou ação específica.
in scheme: mediatopic
created: 2019-09-05T12:00:00+00:00
modified: 2025-03-31T12:00:00+00:00
broader: governo

chefe de governo
type: Concept
definition: Funcionário mais elevado do ramo executivo de um estado soberano, de um estado federado ou de uma colônia autônoma.
in scheme: mediatopic
created: 2019-09-05T12:00:00+00:00
modified: 2025-03-31T12:00:00+00:00
broader: governo

inquérito público
type: Concept
definition: Investigação oficial de eventos ou de ações, ordenada por um órgão governamental, incluindo comissões reais.
in scheme: mediatopic
created: 2019-09-05T12:00:00+00:00
modified: 2021-07-12T12:00:00+00:00
broader: governo

eleições na Igreja
type: Concept
definition: Eleições para escolher líderes para administrar organizações da igreja a vários níveis.
in scheme: mediatopic
created: 2019-09-05T12:00:00+00:00
modified: 2024-09-26T12:00:00+00:00
retired: 2024-09-26T12:00:00+00:00
broader: eleições

política de infraestruturas
type: Concept
definition: Políticas relativas ao desenvolvimento e manutenção das instalações fundamentais de um país, cidade ou outra área que possibilitam a atividade comercial, como redes de comunicação, de transporte e de distribuição.
in scheme: mediatopic
created: 2019-09-05T12:00:00+00:00
modified: 2025-03-31T12:00:00+00:00
broader: política governamental

política de governo local
type: Concept
definition: Políticas para o desenvolvimento e manutenção de uma área do governo local.
in scheme: mediatopic
created: 2019-09-05T12:00:00+00:00
modified: 2021-07-12T12:00:00+00:00
broader: política governamental

debates políticos
type: Concept
definition: Debates organizados entre candidatos políticos, que decorrem ao vivo em frente de uma audiência ou que são transmitidos.
in scheme: mediatopic
created: 2019-09-05T12:00:00+00:00
modified: 2021-07-12T12:00:00+00:00
broader: eleições

festa de solstício de verão
type: Concept
definition: Celebrações do norte da Europa que acompanham o solstício de verão.
in scheme: mediatopic
created: 2019-09-05T12:00:00+00:00
modified: 2021-07-12T12:00:00+00:00
broader: feriado

feriado nacional
type: Concept
definition: Dia determinado para celebrar uma nação.
in scheme: mediatopic
created: 2019-09-05T12:00:00+00:00
modified: 2021-07-12T12:00:00+00:00
broader: feriado

Dia de Ano Novo
type: Concept
definition: Celebração do fim de um ano civil e do início do próximo.
in scheme: mediatopic
created: 2019-09-05T12:00:00+00:00
modified: 2021-07-12T12:00:00+00:00
broader: feriado

Dia das Bruxas
type: Concept
definition: Celebração comemorada em vários países em 31 de outubro, com atividades que incluem pedir doçuras ou travessuras, usar fantasias, esculpir abóboras, visitar atrações assombradas, contar histórias assustadoras e assistir filmes de terror.
in scheme: mediatopic
created: 2019-09-05T12:00:00+00:00
modified: 2021-07-12T12:00:00+00:00
broader: férias

Dia de Todos os Santos
type: Concept
definition: Celebração cristã em homenagem a todos os santos, conhecidos e desconhecidos. O feriado também é conhecido como Festa de Todos os Santos ou Solenidade de Todos os Santos.
in scheme: mediatopic
created: 2019-09-05T12:00:00+00:00
modified: 2021-12-17T12:00:00+00:00
broader: festa ou feriado religioso

Noite de Santa Valburga
type: Concept
definition: Véspera do dia da festa cristã de Santa Valburga, abadessa do século VIII na Frância, celebrada na noite de 30 de abril e no dia 1 de maio.
in scheme: mediatopic
created: 2019-09-05T12:00:00+00:00
modified: 2021-07-12T12:00:00+00:00
broader: festa ou feriado religioso

batismo
type: Concept
definition: Rito religioso cristão, realizado através da aspersão de água benta na testa de uma pessoa ou de sua imersão na água, simbolizando a purificação e a admissão na Igreja.
in scheme: mediatopic
created: 2019-09-05T12:00:00+00:00
modified: 2021-12-17T12:00:00+00:00
broader: ritual

contracepção
type: Concept
definition: Conjunto de métodos ou dispositivos usados para impedir a gravidez.
in scheme: mediatopic
created: 2019-09-05T12:00:00+00:00
modified: 2021-07-12T12:00:00+00:00
broader: planejamento familiar

economia sob demanda
type: Concept
definition: Mercado de trabalho que consiste em fornecedores individuais de serviços com contratos de curto prazo ou freelance em oposição a empregos permanentes, como motoristas ou entregadores.
in scheme: mediatopic
created: 2019-10-07T12:00:00+00:00
modified: 2021-07-12T12:00:00+00:00
broader: mercado de trabalho

licença parental
type: Concept
definition: Licença para se ausentar do trabalho para poder dar à luz ou cuidar de uma criança.
in scheme: mediatopic
created: 2019-10-07T12:00:00+00:00
modified: 2021-07-12T12:00:00+00:00
broader: emprego

voluntariado
type: Concept
definition: Trabalho não remunerado realizado gratuitamente por indivíduos como um serviço aos outros.
in scheme: mediatopic
created: 2019-10-07T12:00:00+00:00
modified: 2021-07-12T12:00:00+00:00
broader: emprego

cooperativa
type: Concept
definition: Organização que pertence e é administrada conjuntamente por seus membros, que compartilham os lucros ou benefícios de seu trabalho.
in scheme: mediatopic
created: 2019-10-07T12:00:00+00:00
modified: 2021-07-12T12:00:00+00:00
broader: empresas

criptomoeda
type: Concept
definition: Meio de troca baseado na Internet que usa criptografia para realizar transações financeiras.
in scheme: mediatopic
created: 2019-10-07T12:00:00+00:00
modified: 2021-07-12T12:00:00+00:00
broader: valor cambial

furacão
type: Concept
definition: Tipo de tempestade, também chamado de ciclone tropical, que se forma sobre águas tropicais ou subtropicais.
in scheme: mediatopic
created: 2019-10-07T12:00:00+00:00
modified: 2021-07-12T12:00:00+00:00
broader: desastre meteorológico

raquetebol
type: Concept
definition: Esporte de raquete semelhante ao squash em que a bola deve quicar uma vez antes de ser atingida e com uma área maior de jogo.
in scheme: mediatopic
created: 2019-10-07T12:00:00+00:00
modified: 2021-07-12T12:00:00+00:00
broader: disciplina de competição

ringette
type: Concept
definition: Esporte de equipe praticado geralmente no gelo por patinadores usando um taco sem curvatura. Os jogadores passam e atiram um anel de borracha para colocá-lo no gol do adversário.
in scheme: mediatopic
created: 2019-10-07T12:00:00+00:00
modified: 2021-07-12T12:00:00+00:00
broader: disciplina de competição

contrabando e tráfico de pessoas
type: Concept
definition: Transporte ilegal de pessoas de um país ou local para outro. Quando o resultado é trabalho forçado ou exploração sexual, o crime é considerado tráfico.
in scheme: mediatopic
created: 2019-11-20T12:00:00+00:00
modified: 2021-07-12T12:00:00+00:00
broader: crime

bullying
type: Concept
definition: Realizar ações destinadas a prejudicar, coagir e intimidar outra pessoa considerada vulnerável. Essas ações podem ser realizadas pessoalmente ou online.
in scheme: mediatopic
created: 2019-11-20T12:00:00+00:00
modified: 2021-07-12T12:00:00+00:00
broader: problemas sociais

vandalismo
type: Concept
definition: Danificar ou destruir deliberadamente propriedade pública ou privada.
in scheme: mediatopic
created: 2019-11-20T12:00:00+00:00
modified: 2021-07-12T12:00:00+00:00
broader: crime

braço de ferro
type: Concept
definition: Tipo de luta em que dois participantes lutam braço a braço.
in scheme: mediatopic
created: 2019-11-25T12:00:00+00:00
modified: 2021-07-12T12:00:00+00:00
broader: disciplina de competição

supremo tribunal e tribunal superior
type: Concept
definition: Questões relativas a tribunais supremos ou superiores, incluindo nomeações e decisões.
in scheme: mediatopic
created: 2019-11-25T12:00:00+00:00
modified: 2021-07-12T12:00:00+00:00
broader: tribunal

povo indígena
type: Concept
definition: Pessoas que são os proprietários e conservadores originais de determinada região, também conhecidos como povos nativos, primeiros povos ou povos indígenas, em contraste com grupos que se fixaram, ocuparam ou colonizaram a área mais recentemente.
in scheme: mediatopic
created: 2019-11-25T12:00:00+00:00
modified: 2021-07-12T12:00:00+00:00
broader: humanidade

canais de vendas
type: Concept
definition: Formas indiretas ou diretas de levar produtos ou serviços ao mercado para que possam ser adquiridos pelos consumidores.
in scheme: mediatopic
created: 2019-11-25T12:00:00+00:00
modified: 2023-03-31T12:00:00+00:00
broader: setor econômico
narrower: varejo
narrower: mercado atacadista
narrower: venda por leilão

habitação social
type: Concept
definition: Habitação que pertence ou é administrada por um governo ou por uma organização sem fins lucrativos e alugada a inquilinos com o objetivo de tornar a habitação acessível. A elegibilidade para esse tipo de alojamento varia de país para país.
in scheme: mediatopic
created: 2020-08-05T12:00:00+00:00
modified: 2021-07-12T12:00:00+00:00
broader: assistência social

climatização
type: Concept
definition: Negócio de fornecimento de calor ou refrigeração para residências privadas e edifícios comerciais.
in scheme: mediatopic
created: 2020-08-05T12:00:00+00:00
modified: 2023-03-31T12:00:00+00:00
broader: serviços públicos

incentivo ao desenvolvimento econômico
type: Concept
definition: Financiamento, programas de incentivos financeiros e subsídios para estimular empresas e partes da economia.
in scheme: mediatopic
created: 2020-08-05T12:00:00+00:00
modified: 2025-03-31T12:00:00+00:00
broader: política econômica

serviço de streaming
type: Concept
definition: Fornecedores de entretenimento (música, filmes, séries, etc.) que disponibilizam o conteúdo por meio de uma conexão de Internet ao computador, TV ou dispositivo móvel do assinante.
in scheme: mediatopic
created: 2020-08-05T12:00:00+00:00
modified: 2023-03-31T12:00:00+00:00
broader: mídia

crowdfunding
type: Concept
definition: Financiamento de um projeto ou empreendimento através da angariação de pequenas quantias de dinheiro de um grande número de pessoas, geralmente pela Internet.
in scheme: mediatopic
created: 2020-08-05T12:00:00+00:00
modified: 2023-03-31T12:00:00+00:00
broader: financiamento e oferta de ações

terceirização
type: Concept
definition: Prática de negócios que consiste na transferência de serviços ou funções a terceiros.
in scheme: mediatopic
created: 2020-08-05T12:00:00+00:00
modified: 2021-07-12T12:00:00+00:00
broader: estratégia e marketing

centro comercial
type: Concept
definition: Edifício de grandes dimensões ou série de edifícios conectados que reúnem uma variedade de lojas de varejo e de comida.
in scheme: mediatopic
created: 2020-08-05T12:00:00+00:00
modified: 2021-07-12T12:00:00+00:00
broader: varejo

zona comercial
type: Concept
definition: Principais ruas de varejo de vilas ou cidades, com lojas e restaurantes individuais.
in scheme: mediatopic
created: 2020-08-05T12:00:00+00:00
modified: 2021-07-12T12:00:00+00:00
broader: varejo

inteligência artificial
type: Concept
definition: Uso de computadores para simular o funcionamento do cérebro humano aplicando algoritmos e métodos estatísticos, heurísticos ou de aprendizado automático a grandes conjuntos de dados. Permite uma grande variedade de funções automáticas, como reconhecimento e categorização de imagens.
in scheme: mediatopic
created: 2020-08-05T12:00:00+00:00
modified: 2021-07-12T12:00:00+00:00
broader: tecnologias de informação

vigilância
type: Concept
definition: Monitorar atividades individuais por meio do uso de câmeras e dados, a fim de prevenir ou descobrir atividades criminosas.
in scheme: mediatopic
created: 2020-08-05T12:00:00+00:00
modified: 2021-07-12T12:00:00+00:00
broader: forças policiais

privacidade
type: Concept
definition: Direito de um indivíduo ou grupo manter privadas suas informações pessoais.
in scheme: mediatopic
created: 2020-08-05T12:00:00+00:00
modified: 2021-07-12T12:00:00+00:00
broader: direitos fundamentais

conquistas esportivas
type: Concept
definition: Recordes ou honras ganhos por atletas por seu desempenho.
in scheme: mediatopic
created: 2021-02-18T12:00:00+00:00
modified: 2021-07-12T12:00:00+00:00
broader: esporte
narrower: recorde esportivo
narrower: medalha esportiva
narrower: prêmio esportivo

recorde esportivo
type: Concept
definition: O melhor desempenho de um atleta em determinada área.
in scheme: mediatopic
created: 2021-02-18T12:00:00+00:00
modified: 2022-09-23T12:00:00+00:00
broader: conquistas esportivas

medalha esportiva
type: Concept
definition: Honra concedida a um atleta ou a uma equipe pelo lugar alcançado em uma competição esportiva, como os Jogos Olímpicos.
in scheme: mediatopic
created: 2021-02-18T12:00:00+00:00
modified: 2022-09-23T12:00:00+00:00
broad match: Q15229207
broader: conquistas esportivas

prêmio esportivo
type: Concept
definition: Prêmio ou honra atribuídos a um atleta em reconhecimento de sua carreira.
in scheme: mediatopic
created: 2021-02-18T12:00:00+00:00
modified: 2022-09-23T12:00:00+00:00
broader: conquistas esportivas

padel
type: Concept
definition: Esporte de raquete, disputado por duas duplas frente a frente em recinto fechado.
in scheme: mediatopic
created: 2021-02-18T12:00:00+00:00
modified: 2021-07-12T12:00:00+00:00
broader: disciplina de competição

kite
type: Concept
definition: Esporte radical em que o praticante aproveita a força do vento para se impulsionar na água, em terra ou na neve sobre uma prancha ou esquis. Variações desse esporte incluem kitesurf/kiteboard, snowkite ou landkite.
in scheme: mediatopic
created: 2021-02-18T12:00:00+00:00
modified: 2021-07-12T12:00:00+00:00
broader: disciplina de competição

stand up paddle (SUP)
type: Concept
definition: Esporte aquático em que o praticante fica de pé sobre uma prancha e usa um remo para se deslocar na água.
in scheme: mediatopic
created: 2021-02-18T12:00:00+00:00
modified: 2021-07-12T12:00:00+00:00
broader: disciplina de competição

krav maga
type: Concept
definition: Sistema de luta e autodefesa que combina elementos do aikido, boxe, judô, caratê e luta livre.
in scheme: mediatopic
created: 2021-02-18T12:00:00+00:00
modified: 2021-07-12T12:00:00+00:00
broader: artes marciais

cheerleading
type: Concept
definition: Equipes de cheerleaders que competem entre si realizando uma rotina que inclui acrobacias, saltos e tumbling ao som de música. As equipes são julgadas pela dificuldade e pela execução dos exercícios.
in scheme: mediatopic
created: 2021-02-18T12:00:00+00:00
modified: 2021-07-12T12:00:00+00:00
broader: disciplina de competição

kickboxing
type: Concept
definition: Esporte de combate em pé baseado em chutes e socos no adversário.
in scheme: mediatopic
created: 2021-02-18T12:00:00+00:00
modified: 2021-07-12T12:00:00+00:00
broader: artes marciais

sambo
type: Concept
definition: Estilo de arte marcial originário da União Soviética que é reconhecido como uma forma de luta livre amadora.
in scheme: mediatopic
created: 2021-02-18T12:00:00+00:00
modified: 2021-07-12T12:00:00+00:00
broader: artes marciais

liderança política
type: Concept
definition: Os líderes de um partido político.
in scheme: mediatopic
created: 2021-02-18T12:00:00+00:00
modified: 2025-03-31T12:00:00+00:00
broader: governo

tiroteios
type: Concept
definition: Atos de violência cometidos por indivíduos com recurso a armas de fogo.
in scheme: mediatopic
created: 2021-02-18T12:00:00+00:00
modified: 2021-07-12T12:00:00+00:00
broader: crime

maus-tratos a animais
type: Concept
definition: Comportamento cruel ou negligente imposto por humanos a animais.
in scheme: mediatopic
created: 2021-02-18T12:00:00+00:00
modified: 2021-07-12T12:00:00+00:00
broader: crime

jardim zoológico
type: Concept
definition: Parque onde os visitantes podem ver animais selvagens e domesticados que se encontram em jaulas ou em áreas fechadas.
in scheme: mediatopic
created: 2021-02-18T12:00:00+00:00
modified: 2021-07-12T12:00:00+00:00
broader: lugar de lazer

conflitos fronteiriços
type: Concept
definition: Litígios diplomáticos entre países por causa de uma fronteira, por vezes envolvendo conflitos militares.
in scheme: mediatopic
created: 2021-02-18T12:00:00+00:00
modified: 2025-03-31T12:00:00+00:00
broader: relações internacionais

assistência infantil
type: Concept
definition: Serviços e instalações para acolher crianças enquanto os pais estão trabalhando ou ausentes, como creches ou jardins de infância.
in scheme: mediatopic
created: 2021-02-18T12:00:00+00:00
modified: 2021-07-12T12:00:00+00:00
broader: assistência social

pragas
type: Concept
definition: Animais ou insetos que invadem um espaço humano e causam destruição ou condições insalubres.
in scheme: mediatopic
created: 2021-02-18T12:00:00+00:00
modified: 2025-10-09T12:00:00+00:00
broader: animais

desinformação e informação errada
type: Concept
definition: Disseminação de informação falsa ou incorreta, independentemente da intenção.
in scheme: mediatopic
created: 2021-02-18T12:00:00+00:00
modified: 2021-07-12T12:00:00+00:00
broader: mídia de massas

http://cv.iptc.org/newscodes/mediatopic/20001320
type: Concept
in scheme: mediatopic
created: 2021-05-05T12:00:00+00:00
modified: 2021-12-21T12:00:00+00:00
broader: crime

http://cv.iptc.org/newscodes/mediatopic/20001321
type: Concept
in scheme: mediatopic
created: 2021-05-05T12:00:00+00:00
modified: 2021-12-21T12:00:00+00:00
broader: acidente (geral)

http://cv.iptc.org/newscodes/mediatopic/20001322
type: Concept
in scheme: mediatopic
created: 2021-05-05T12:00:00+00:00
modified: 2021-12-21T12:00:00+00:00
broader: doenças e condições

http://cv.iptc.org/newscodes/mediatopic/20001323
type: Concept
in scheme: mediatopic
created: 2021-05-05T12:00:00+00:00
modified: 2021-12-21T12:00:00+00:00
broader: esporte

http://cv.iptc.org/newscodes/mediatopic/20001324
type: Concept
in scheme: mediatopic
created: 2021-05-05T12:00:00+00:00
modified: 2021-12-21T12:00:00+00:00
broader: esporte

http://cv.iptc.org/newscodes/mediatopic/20001325
type: Concept
in scheme: mediatopic
created: 2021-05-05T12:00:00+00:00
modified: 2024-03-28T12:00:00+00:00
broader: esporte

http://cv.iptc.org/newscodes/mediatopic/20001326
type: Concept
in scheme: mediatopic
created: 2021-05-05T12:00:00+00:00
modified: 2021-12-21T12:00:00+00:00
broader: direitos fundamentais

http://cv.iptc.org/newscodes/mediatopic/20001327
type: Concept
in scheme: mediatopic
created: 2021-05-05T12:00:00+00:00
modified: 2021-12-21T12:00:00+00:00
broader: humanidade

http://cv.iptc.org/newscodes/mediatopic/20001328
type: Concept
in scheme: mediatopic
created: 2021-05-05T12:00:00+00:00
modified: 2021-12-21T12:00:00+00:00
broader: humanidade

http://cv.iptc.org/newscodes/mediatopic/20001329
type: Concept
in scheme: mediatopic
created: 2021-07-12T12:00:00+00:00
modified: 2021-12-21T12:00:00+00:00
broader: disciplina de competição

http://cv.iptc.org/newscodes/mediatopic/20001330
type: Concept
in scheme: mediatopic
created: 2021-07-12T12:00:00+00:00
modified: 2021-12-21T12:00:00+00:00
broader: disciplina de competição

http://cv.iptc.org/newscodes/mediatopic/20001331
type: Concept
in scheme: mediatopic
created: 2021-07-12T12:00:00+00:00
modified: 2021-12-21T12:00:00+00:00
broader: disciplina de competição

http://cv.iptc.org/newscodes/mediatopic/20001332
type: Concept
in scheme: mediatopic
created: 2021-07-12T12:00:00+00:00
modified: 2024-03-28T12:00:00+00:00
broader: ciclismo

http://cv.iptc.org/newscodes/mediatopic/20001333
type: Concept
in scheme: mediatopic
created: 2021-07-12T12:00:00+00:00
modified: 2021-12-21T12:00:00+00:00
broader: disciplina de competição

http://cv.iptc.org/newscodes/mediatopic/20001334
type: Concept
in scheme: mediatopic
created: 2021-07-12T12:00:00+00:00
modified: 2021-12-21T12:00:00+00:00
broader: disciplina de competição

http://cv.iptc.org/newscodes/mediatopic/20001335
type: Concept
in scheme: mediatopic
created: 2021-07-12T12:00:00+00:00
modified: 2021-12-21T12:00:00+00:00
broader: disciplina de competição

http://cv.iptc.org/newscodes/mediatopic/20001336
type: Concept
in scheme: mediatopic
created: 2021-07-12T12:00:00+00:00
modified: 2021-12-21T12:00:00+00:00
broader: disciplina de competição

http://cv.iptc.org/newscodes/mediatopic/20001337
type: Concept
in scheme: mediatopic
created: 2021-09-30T12:00:00+00:00
modified: 2021-12-21T12:00:00+00:00
broader: educação

http://cv.iptc.org/newscodes/mediatopic/20001338
type: Concept
in scheme: mediatopic
created: 2021-12-17T12:00:00+00:00
modified: 2025-03-31T12:00:00+00:00
broader: política governamental

http://cv.iptc.org/newscodes/mediatopic/20001339
type: Concept
in scheme: mediatopic
created: 2021-12-17T12:00:00+00:00
modified: 2021-12-21T12:00:00+00:00
broader: estilo de vida e lazer
narrower: exercício físico
narrower: http://cv.iptc.org/newscodes/mediatopic/20001340

http://cv.iptc.org/newscodes/mediatopic/20001340
type: Concept
in scheme: mediatopic
created: 2021-12-17T12:00:00+00:00
modified: 2021-12-21T12:00:00+00:00
broader: http://cv.iptc.org/newscodes/mediatopic/20001339

http://cv.iptc.org/newscodes/mediatopic/20001341
type: Concept
in scheme: mediatopic
created: 2021-12-17T12:00:00+00:00
modified: 2021-12-21T12:00:00+00:00
broader: eventos esportivos

http://cv.iptc.org/newscodes/mediatopic/20001342
type: Concept
in scheme: mediatopic
created: 2021-12-17T12:00:00+00:00
modified: 2021-12-21T12:00:00+00:00
broader: eventos esportivos

http://cv.iptc.org/newscodes/mediatopic/20001343
type: Concept
in scheme: mediatopic
created: 2021-12-17T12:00:00+00:00
modified: 2021-12-21T12:00:00+00:00
broader: eventos esportivos

http://cv.iptc.org/newscodes/mediatopic/20001344
type: Concept
in scheme: mediatopic
created: 2021-12-17T12:00:00+00:00
modified: 2021-12-21T12:00:00+00:00
broader: cristianismo

http://cv.iptc.org/newscodes/mediatopic/20001345
type: Concept
in scheme: mediatopic
created: 2021-12-17T12:00:00+00:00
modified: 2021-12-21T12:00:00+00:00
broader: ritual

http://cv.iptc.org/newscodes/mediatopic/20001346
type: Concept
in scheme: mediatopic
created: 2021-12-17T12:00:00+00:00
modified: 2021-12-21T12:00:00+00:00
broader: ritual

http://cv.iptc.org/newscodes/mediatopic/20001347
type: Concept
in scheme: mediatopic
created: 2021-12-17T12:00:00+00:00
modified: 2021-12-21T12:00:00+00:00
broader: islã

http://cv.iptc.org/newscodes/mediatopic/20001348
type: Concept
in scheme: mediatopic
created: 2021-12-17T12:00:00+00:00
modified: 2021-12-21T12:00:00+00:00
broader: islã

http://cv.iptc.org/newscodes/mediatopic/20001349
type: Concept
in scheme: mediatopic
created: 2021-12-17T12:00:00+00:00
modified: 2021-12-21T12:00:00+00:00
broader: crenças religiosas

http://cv.iptc.org/newscodes/mediatopic/20001350
type: Concept
in scheme: mediatopic
created: 2021-12-17T12:00:00+00:00
modified: 2021-12-21T12:00:00+00:00
broader: festa ou feriado religioso

http://cv.iptc.org/newscodes/mediatopic/20001351
type: Concept
in scheme: mediatopic
created: 2021-12-17T12:00:00+00:00
modified: 2021-12-21T12:00:00+00:00
broader: judaísmo

http://cv.iptc.org/newscodes/mediatopic/20001352
type: Concept
in scheme: mediatopic
created: 2021-12-17T12:00:00+00:00
modified: 2021-12-21T12:00:00+00:00
broader: festa ou feriado religioso

http://cv.iptc.org/newscodes/mediatopic/20001353
type: Concept
in scheme: mediatopic
created: 2022-02-03T12:00:00+00:00
modified: 2022-02-03T12:00:00+00:00
broader: desastre natural

http://cv.iptc.org/newscodes/mediatopic/20001354
type: Concept
in scheme: mediatopic
created: 2022-06-14T12:00:00+00:00
modified: 2022-06-14T12:00:00+00:00
broader: setor econômico
narrower: biotecnologia
narrower: indústria farmacêutica
narrower: prestador de serviços de saúde
narrower: equipamento médico

http://cv.iptc.org/newscodes/mediatopic/20001355
type: Concept
in scheme: mediatopic
created: 2022-06-14T12:00:00+00:00
modified: 2022-06-14T12:00:00+00:00
broader: doenças e condições

http://cv.iptc.org/newscodes/mediatopic/20001356
type: Concept
in scheme: mediatopic
created: 2022-06-14T12:00:00+00:00
modified: 2022-06-14T12:00:00+00:00
broader: distúrbios mentais e comportamentais

http://cv.iptc.org/newscodes/mediatopic/20001357
type: Concept
in scheme: mediatopic
created: 2022-06-14T12:00:00+00:00
modified: 2022-06-14T12:00:00+00:00
broader: distúrbios mentais e comportamentais

http://cv.iptc.org/newscodes/mediatopic/20001358
type: Concept
in scheme: mediatopic
created: 2022-06-14T12:00:00+00:00
modified: 2022-06-14T12:00:00+00:00
broader: saúde

http://cv.iptc.org/newscodes/mediatopic/20001359
type: Concept
in scheme: mediatopic
created: 2022-06-14T12:00:00+00:00
modified: 2022-06-14T12:00:00+00:00
broader: família

http://cv.iptc.org/newscodes/mediatopic/20001360
type: Concept
in scheme: mediatopic
created: 2022-09-23T12:00:00+00:00
modified: 2022-09-23T12:00:00+00:00
broader: comunidades

http://cv.iptc.org/newscodes/mediatopic/20001361
type: Concept
in scheme: mediatopic
created: 2022-09-23T12:00:00+00:00
modified: 2022-09-23T12:00:00+00:00
broader: conflito, guerra e paz

http://cv.iptc.org/newscodes/mediatopic/20001362
type: Concept
in scheme: mediatopic
created: 2022-09-23T12:00:00+00:00
modified: 2022-09-23T12:00:00+00:00
broader: transportes

http://cv.iptc.org/newscodes/mediatopic/20001363
type: Concept
in scheme: mediatopic
created: 2022-09-23T12:00:00+00:00
modified: 2022-09-23T12:00:00+00:00
broader: transportes

http://cv.iptc.org/newscodes/mediatopic/20001364
type: Concept
in scheme: mediatopic
created: 2022-09-23T12:00:00+00:00
modified: 2022-09-23T12:00:00+00:00
broader: transportes

http://cv.iptc.org/newscodes/mediatopic/20001365
type: Concept
in scheme: mediatopic
created: 2023-03-31T12:00:00+00:00
modified: 2023-03-31T12:00:00+00:00
broader: informação sobre empresas
narrower: contabilidade e auditoria
narrower: notação de risco
narrower: lucros
narrower: previsão de lucros
narrower: demonstração financeira

http://cv.iptc.org/newscodes/mediatopic/20001366
type: Concept
in scheme: mediatopic
created: 2023-03-31T12:00:00+00:00
modified: 2023-03-31T12:00:00+00:00
broader: informação sobre empresas
narrower: spin-off
narrower: joint venture
narrower: aquisição alavancada
narrower: operação de compra
narrower: fusão e aquisição

http://cv.iptc.org/newscodes/mediatopic/20001367
type: Concept
in scheme: mediatopic
created: 2023-03-31T12:00:00+00:00
modified: 2023-03-31T12:00:00+00:00
broader: construção e propriedades

http://cv.iptc.org/newscodes/mediatopic/20001368
type: Concept
in scheme: mediatopic
created: 2023-03-31T12:00:00+00:00
modified: 2023-03-31T12:00:00+00:00
broader: construção e propriedades

http://cv.iptc.org/newscodes/mediatopic/20001369
type: Concept
in scheme: mediatopic
created: 2023-03-31T12:00:00+00:00
modified: 2023-03-31T12:00:00+00:00
broader: mídia

http://cv.iptc.org/newscodes/mediatopic/20001370
type: Concept
in scheme: mediatopic
created: 2023-03-31T12:00:00+00:00
modified: 2023-03-31T12:00:00+00:00
broader: setor econômico
narrower: serviços de contabilidade e auditoria
narrower: banca
narrower: seguros
narrower: serviços de investimento
narrower: investimentos pessoais
narrower: corretagem
narrower: empréstimos
narrower: gestão de ativos

http://cv.iptc.org/newscodes/mediatopic/20001371
type: Concept
in scheme: mediatopic
created: 2023-03-31T12:00:00+00:00
modified: 2023-03-31T12:00:00+00:00
broader: setor econômico
narrower: serviço de consultoria
narrower: agência de emprego
narrower: serviços de limpeza
narrower: serviços jurídicos
narrower: serviços pessoais
narrower: serviços de locação
narrower: serviços de expedição
narrower: serviços de casamento
narrower: feira profissional
narrower: sistema de pagamento
narrower: http://cv.iptc.org/newscodes/mediatopic/20001396

http://cv.iptc.org/newscodes/mediatopic/20001372
type: Concept
in scheme: mediatopic
created: 2023-03-31T12:00:00+00:00
modified: 2023-03-31T12:00:00+00:00
broader: mídia

http://cv.iptc.org/newscodes/mediatopic/20001373
type: Concept
in scheme: mediatopic
created: 2023-03-31T12:00:00+00:00
modified: 2023-03-31T12:00:00+00:00
broader: sociedade

http://cv.iptc.org/newscodes/mediatopic/20001374
type: Concept
in scheme: mediatopic
created: 2023-10-02T12:00:00+00:00
modified: 2025-10-09T12:00:00+00:00
broader: ambiente

http://cv.iptc.org/newscodes/mediatopic/20001375
type: Concept
in scheme: mediatopic
created: 2023-10-02T12:00:00+00:00
modified: 2023-10-02T12:00:00+00:00
broader: salários e benefícios

http://cv.iptc.org/newscodes/mediatopic/20001376
type: Concept
in scheme: mediatopic
created: 2024-03-28T12:00:00+00:00
modified: 2024-03-28T12:00:00+00:00
broader: financiamento e oferta de ações

http://cv.iptc.org/newscodes/mediatopic/20001377
type: Concept
in scheme: mediatopic
created: 2024-03-28T12:00:00+00:00
modified: 2024-03-28T12:00:00+00:00
broader: conflito, guerra e paz
narrower: desaparecidos em combate
narrower: prisioneiros de guerra
narrower: http://cv.iptc.org/newscodes/mediatopic/20001378

http://cv.iptc.org/newscodes/mediatopic/20001378
type: Concept
in scheme: mediatopic
created: 2024-03-28T12:00:00+00:00
modified: 2024-03-28T12:00:00+00:00
retired: 2024-07-01T12:00:00+00:00
broader: http://cv.iptc.org/newscodes/mediatopic/20001377

http://cv.iptc.org/newscodes/mediatopic/20001379
type: Concept
in scheme: mediatopic
created: 2024-05-09T12:00:00+00:00
modified: 2024-05-09T12:00:00+00:00
broader: dança rítmica

http://cv.iptc.org/newscodes/mediatopic/20001380
type: Concept
in scheme: mediatopic
created: 2024-09-26T12:00:00+00:00
modified: 2024-09-26T12:00:00+00:00
broader: eleições

http://cv.iptc.org/newscodes/mediatopic/20001381
type: Concept
in scheme: mediatopic
created: 2024-09-26T12:00:00+00:00
modified: 2024-09-26T12:00:00+00:00
broader: eleições

http://cv.iptc.org/newscodes/mediatopic/20001382
type: Concept
in scheme: mediatopic
created: 2024-09-26T12:00:00+00:00
modified: 2024-09-26T12:00:00+00:00
broader: eleições

http://cv.iptc.org/newscodes/mediatopic/20001383
type: Concept
in scheme: mediatopic
created: 2025-03-31T12:00:00+00:00
modified: 2025-03-31T12:00:00+00:00
broader: política governamental

http://cv.iptc.org/newscodes/mediatopic/20001384
type: Concept
in scheme: mediatopic
created: 2025-03-31T12:00:00+00:00
modified: 2025-03-31T12:00:00+00:00
broader: governo

http://cv.iptc.org/newscodes/mediatopic/20001385
type: Concept
in scheme: mediatopic
created: 2025-03-31T12:00:00+00:00
modified: 2025-03-31T12:00:00+00:00
broader: governo

http://cv.iptc.org/newscodes/mediatopic/20001386
type: Concept
in scheme: mediatopic
created: 2025-03-31T12:00:00+00:00
modified: 2025-03-31T12:00:00+00:00
broader: sistemas políticos

http://cv.iptc.org/newscodes/mediatopic/20001387
type: Concept
in scheme: mediatopic
created: 2025-03-31T12:00:00+00:00
modified: 2025-03-31T12:00:00+00:00
broader: sistemas políticos

http://cv.iptc.org/newscodes/mediatopic/20001388
type: Concept
in scheme: mediatopic
created: 2025-03-31T12:00:00+00:00
modified: 2025-03-31T12:00:00+00:00
broader: sistemas políticos

http://cv.iptc.org/newscodes/mediatopic/20001389
type: Concept
in scheme: mediatopic
created: 2025-03-31T12:00:00+00:00
modified: 2025-03-31T12:00:00+00:00
broader: sistemas políticos

http://cv.iptc.org/newscodes/mediatopic/20001390
type: Concept
in scheme: mediatopic
created: 2025-03-31T12:00:00+00:00
modified: 2025-03-31T12:00:00+00:00
broader: esqui

http://cv.iptc.org/newscodes/mediatopic/20001391
type: Concept
in scheme: mediatopic
created: 2025-06-30T12:00:00+00:00
modified: 2025-06-30T12:00:00+00:00
broader: estilo de vida

http://cv.iptc.org/newscodes/mediatopic/20001392
type: Concept
in scheme: mediatopic
created: 2025-06-30T12:00:00+00:00
modified: 2025-06-30T12:00:00+00:00
broader: lugar de lazer

http://cv.iptc.org/newscodes/mediatopic/20001393
type: Concept
in scheme: mediatopic
created: 2025-10-09T12:00:00+00:00
modified: 2025-10-09T12:00:00+00:00
broader: futebol

http://cv.iptc.org/newscodes/mediatopic/20001394
type: Concept
in scheme: mediatopic
created: 2025-10-09T12:00:00+00:00
modified: 2026-07-09T12:00:00+00:00
broader: futebol

http://cv.iptc.org/newscodes/mediatopic/20001395
type: Concept
in scheme: mediatopic
created: 2025-10-09T12:00:00+00:00
modified: 2025-10-09T12:00:00+00:00
broader: produtos químicos

http://cv.iptc.org/newscodes/mediatopic/20001396
type: Concept
in scheme: mediatopic
created: 2026-07-02T12:00:00+00:00
modified: 2026-07-02T12:00:00+00:00
broader: http://cv.iptc.org/newscodes/mediatopic/20001371