mediatopic
type: ConceptScheme
pref scheme alias: medtop
authority: http://www.iptc.org
rights holder: IPTC, International Press Telecommunications Council - https://iptc.org
licence link: http://creativecommons.org/licenses/by/4.0/
date released: 2026-07-02T12:00:00+00:00
has top concept: Kultur, Kunst, Unterhaltung und Medien
has top concept: Justiz, Kriminalität
has top concept: Katastrophe und Unglück
has top concept: Wirtschaft und Finanzen
has top concept: Erziehung, Ausbildung
has top concept: Umwelt
has top concept: Medizin, Gesundheit
has top concept: Vermischtes
has top concept: Arbeit, Soziales
has top concept: Freizeit, Modernes Leben
has top concept: Politik
has top concept: Religion, Weltanschauung
has top concept: Wissenschaft, Technik, Forschung
has top concept: Gesellschaft, Bevölkerung
has top concept: Sport
has top concept: Krise, Krieg, Konflikte
has top concept: Wetter

Kultur, Kunst, Unterhaltung und Medien
type: Concept
definition: Alle Formen von Kunst, Unterhaltung, Kulturerbe und Medien
in scheme: mediatopic
created: 2009-10-22T02:00:00+00:00
modified: 2021-02-18T12:00:00+00:00
narrower: Kunst und Unterhaltung
narrower: Kultur
narrower: Massenmedien

Kunst und Unterhaltung
type: Concept
definition: Alle Formen von Kunst und Unterhaltung
in scheme: mediatopic
created: 2009-10-22T02:00:00+00:00
modified: 2021-02-18T12:00:00+00:00
broader: Kultur, Kunst, Unterhaltung und Medien
narrower: Animation
narrower: Comic
narrower: Film
narrower: Tanz
narrower: Mode
narrower: Literatur
narrower: Musik
narrower: Theater
narrower: Bildende Kunst
narrower: Serie
narrower: Festival
broad match: http://cv.iptc.org/newscodes/subjectcode/01000000

Kultur
type: Concept
definition: Die Ideen, Bräuche, Künste und Traditionen einer bestimmten Gruppe von Menschen
in scheme: mediatopic
created: 2009-10-22T02:00:00+00:00
modified: 2021-02-18T12:00:00+00:00
broader: Kultur, Kunst, Unterhaltung und Medien
narrower: Kulturgeschichte
narrower: Brauchtum
narrower: Fest (Kultur)
narrower: Sprache
narrower: Bibliothek und Museum
narrower: Denkmal und Gedenkstätte
narrower: Kunstausstellung

Massenmedien
type: Concept
definition: Medien, die ein großes Publikum erreichen
in scheme: mediatopic
created: 2009-10-22T02:00:00+00:00
modified: 2021-02-18T12:00:00+00:00
broader: Kultur, Kunst, Unterhaltung und Medien
narrower: Nachrichtensender
narrower: Zeitung
narrower: Online Medien
narrower: Zeitschrift
narrower: Radio
narrower: Fernsehen
narrower: Soziale Medien
narrower: Desinformation und Fehlinformation

Justiz, Kriminalität
type: Concept
definition: Festlegung und/oder Verlautbarung von Verhaltensregeln einer Gesellschaft, die Durchsetzung dieser Regeln, ihre Verstöße und die Bestrafung der Täter. Organisationen und Einheiten, die mit diesen Aktivitäten betraut sind
in scheme: mediatopic
created: 2009-10-22T02:00:00+00:00
modified: 2021-05-05T12:00:00+00:00
narrower: Kriminalität
narrower: Justiz
narrower: Rechtsprechung
narrower: Gesetz
narrower: Sicherheitskräfte (BGS, LKA, BKA)

Kriminalität
type: Concept
definition: Verletzung von etablierten Gesetzen durch Individuen, Firmen und Organisationen
in scheme: mediatopic
created: 2009-10-22T02:00:00+00:00
modified: 2021-02-18T12:00:00+00:00
broader: Justiz, Kriminalität
narrower: Völkermord
narrower: Brandstiftung
narrower: Gewalt
narrower: Computerkriminalität
narrower: Firmenkriminalität
narrower: Korruption
narrower: Drogenkriminalität
narrower: Betrug
narrower: Entführung
narrower: Mord
narrower: Geiselnahme
narrower: Organisierte Kriminalität
narrower: Terrorismus
narrower: Diebstahl
narrower: Kriegsverbrechen
narrower: Verkehrsdelikte
narrower: Menschenhandel
narrower: Vandalismus
narrower: Schießerei
narrower: Tierquälerei
narrower: Folter

Justiz
type: Concept
definition: System, das eingesetzt wird zum Umgang mit Kriminalität und Kriminellen
in scheme: mediatopic
created: 2009-10-22T02:00:00+00:00
modified: 2021-02-18T12:00:00+00:00
broader: Justiz, Kriminalität
narrower: Gericht
narrower: Außergerichtliche Einigung
narrower: Anklage

Rechtsprechung
type: Concept
definition: Die gerechte Anwendung von Gesetzen und Regularien
in scheme: mediatopic
created: 2009-10-22T02:00:00+00:00
retired: 2023-10-02T12:00:00+00:00
modified: 2023-10-02T12:00:00+00:00
broader: Justiz, Kriminalität

Gesetz
type: Concept
definition: Die systematische Aufzeichnung von Verhaltensvorschriften
in scheme: mediatopic
created: 2009-10-22T02:00:00+00:00
modified: 2021-02-18T12:00:00+00:00
broader: Justiz, Kriminalität
narrower: Bürgerliches Gesetzbuch
narrower: Strafgesetzbuch
narrower: Internationales Recht
narrower: Verwaltungsrecht

Sicherheitskräfte (BGS, LKA, BKA)
type: Concept
definition: Tätigkeitsbereiche, die eingebunden sind in Präventivmaßnahmen zur Verhinderung von Verstößen gegen gültige Gesetze, oder die Gesetzesbrecher vor Gericht zu bringen.
in scheme: mediatopic
created: 2009-10-22T02:00:00+00:00
modified: 2021-02-18T12:00:00+00:00
broader: Justiz, Kriminalität
narrower: Untersuchungshaft
narrower: Strafanzeige
narrower: Polizei
narrower: Überwachung

Katastrophe und Unglück
type: Concept
definition: Von Menschen erzeugte oder naturgegebene Ereignisse, die zu Todesfällen oder Verletzungen von Lebewesen und/oder der Zerstörung von Objekten oder Eigentum führen
in scheme: mediatopic
created: 2009-10-22T02:00:00+00:00
modified: 2021-05-05T12:00:00+00:00
narrower: Unglück
narrower: Katastrophe
narrower: Notfall
narrower: Katastrophenschutz
narrower: Hilfsorganisation

Unglück
type: Concept
definition: Jedes ungeplante Ereignis mit ungewollten Konsequenzen
in scheme: mediatopic
created: 2009-10-22T02:00:00+00:00
modified: 2021-02-18T12:00:00+00:00
broader: Katastrophe und Unglück
narrower: Explosion
narrower: Industrieunglück
narrower: Transportunglück
narrower: Konstruktionsfehler
narrower: Ertrinken

Katastrophe
type: Concept
definition: Ernsthaftes und plötzliches Leid
in scheme: mediatopic
created: 2009-10-22T02:00:00+00:00
modified: 2021-02-18T12:00:00+00:00
broader: Katastrophe und Unglück
narrower: Hunger
narrower: Feuer
narrower: Naturkatastrophe

Notfall
type: Concept
definition: Ein plötzliches, unerwartetes Ereignis, was eine sofortige Reaktion erfordert, um schwere Folgen zu verhindern
in scheme: mediatopic
created: 2009-10-22T02:00:00+00:00
retired: 2015-08-27T12:00:00+00:00
modified: 2021-12-21T12:00:00+00:00
broader: Katastrophe und Unglück
narrower: Transportnotfall

Katastrophenschutz
type: Concept
definition: Vorbereitung auf Aktionen, um mit unvorhergesehenen Ereignissen umgehen zu können
in scheme: mediatopic
created: 2009-10-22T02:00:00+00:00
retired: 2019-12-11T12:00:00+00:00
modified: 2021-02-18T12:00:00+00:00
broader: Katastrophe und Unglück

Hilfsorganisation
type: Concept
definition: Organisationen, die jenen Hilfe anbieten, die Mangel an Nahrungsmitteln, Wasser oder Unterkunft haben
in scheme: mediatopic
created: 2009-10-22T02:00:00+00:00
modified: 2021-02-18T12:00:00+00:00
broader: Katastrophe und Unglück
broad match: http://cv.iptc.org/newscodes/subjectcode/03012000

Wirtschaft und Finanzen
type: Concept
definition: Alle Inhalte, die Planung, Produktion und Austausch von Vermögen betreffen
in scheme: mediatopic
created: 2009-10-22T02:00:00+00:00
modified: 2021-07-12T12:00:00+00:00
narrower: Firmeninformation
narrower: Branchen
narrower: Wirtschaft
narrower: Unternehmen
narrower: Markt und Börse

Firmeninformation
type: Concept
definition: Information über einzelne Firmen, Konzerne und Wohltätigkeitsorganisationen
in scheme: mediatopic
created: 2009-10-22T02:00:00+00:00
modified: 2021-05-05T12:00:00+00:00
broader: Wirtschaft und Finanzen
narrower: Unternehmenszahlen
narrower: Aktien
narrower: Personal
narrower: Marketing
narrower: Unternehmensrecht
narrower: Geschäftsbericht und Leistung
narrower: Unternehmensumstrukturierung

Branchen
type: Concept
definition: Gruppierung der Wirtschaftszweige durch Produkte oder Dienstleistungen
in scheme: mediatopic
created: 2009-10-22T02:00:00+00:00
modified: 2023-03-31T12:00:00+00:00
broader: Wirtschaft und Finanzen
narrower: Agrar
narrower: Fischindustrie
narrower: Forstwirtschaft
narrower: Chemie
narrower: Kunststoff
narrower: Computer und Informationstechnologie
narrower: Bau
narrower: Konsumgüter
narrower: Energie
narrower: Dienstleistung
narrower: Metall- und Technische Industrie
narrower: Medien
narrower: Metall und Mineralien
narrower: Verarbeitende Industrie
narrower: Tourismus und Freizeit
narrower: Transport
narrower: Versorgungsunternehmen
narrower: Vertriebskanäle
narrower: Gesundheitsindustrie
narrower: Finanzdienstleistung
narrower: Unternehmensdienstleistung
broad match: http://cv.iptc.org/newscodes/subjectcode/04000000

Wirtschaft
type: Concept
definition: Inhalte grundsätzlicher Art über Handel und Ökonomie
in scheme: mediatopic
created: 2009-10-22T02:00:00+00:00
modified: 2024-03-28T12:00:00+00:00
broader: Wirtschaft und Finanzen
narrower: Volkswirtschaft
narrower: Zentralbank
narrower: Währung
narrower: Private Wirtschaftsorganisation
narrower: Schwellenland
narrower: Internationale Wirtschaftsorganisation
narrower: Welthandel
narrower: Geld- und Finanzpolitik
narrower: Investmentfond
narrower: gemeinsame Wirtschaft

Unternehmen
type: Concept
definition: Zusammenschlüsse, die ein Produkt oder Dienstleistung anbieten, mit der Absicht diese gewinnbringend zu verkaufen.
in scheme: mediatopic
created: 2009-10-22T02:00:00+00:00
modified: 2024-03-28T12:00:00+00:00
broader: Wirtschaft und Finanzen
narrower: Unternehmertum
narrower: kleine und mittlere Unternehmen
narrower: Kooperative

Markt und Börse
type: Concept
definition: Oganisierte Körperschaften, die Aktien, Währungen, Rohstoffe und andere Güter kaufen und verkaufen.
in scheme: mediatopic
created: 2009-10-22T02:00:00+00:00
modified: 2024-03-28T12:00:00+00:00
broader: Wirtschaft und Finanzen
narrower: Warenbörse
narrower: Kapitalmarkt
narrower: Devisenmarkt
narrower: Kreditmarkt

Erziehung, Ausbildung
type: Concept
definition: Alle Aspekte der Förderung von Wissen für den Menschen von der Geburt bis zum Tod.
in scheme: mediatopic
created: 2009-10-22T02:00:00+00:00
modified: 2021-09-30T12:00:00+00:00
narrower: Eltern
narrower: Religionserziehung
narrower: Schule
narrower: Erziehung
narrower: Lehren und Lernen
narrower: Lehrplan
narrower: Prüfung
narrower: Aufnhameprüfung/Abschluss
narrower: Schüler
narrower: Lehrender
narrower: Berufsausbildung
narrower: pädagogische Einstufung
narrower: E-Learning

Eltern
type: Concept
definition: Elterngruppen, die sich für die Schule engagieren
in scheme: mediatopic
created: 2009-10-22T02:00:00+00:00
modified: 2021-09-30T12:00:00+00:00
broader: Erziehung, Ausbildung

Religionserziehung
type: Concept
definition: Einführung durch Gläubige in eine bestimmte oder andere Glaubensrichtungen, oft aber nicht immer in Schulen durch religiöse Institutionen.
in scheme: mediatopic
created: 2009-10-22T02:00:00+00:00
modified: 2021-09-30T12:00:00+00:00
broader: Erziehung, Ausbildung

Schule
type: Concept
definition: Gebäude oder Einrichtung, wo verschiedenartige Ausbildung angeboten wird.
in scheme: mediatopic
created: 2009-10-22T02:00:00+00:00
modified: 2021-09-30T12:00:00+00:00
broader: Erziehung, Ausbildung
narrower: Grundschule
narrower: Weiterbildung
narrower: Erwachsenenbildung
narrower: Gymnasium
narrower: Hochschule
narrower: Haupt-und Realschule
narrower: Vorschule/Kindergarten
narrower: Religionsschulen
narrower: Öffentliche Schulen
narrower: Privatschulen
narrower: Freie Schulen

Erziehung
type: Concept
definition: Soziale Kompetenz, die Eltern und andere vermitteln, während man heranwächst
in scheme: mediatopic
created: 2009-10-22T02:00:00+00:00
modified: 2024-07-01T12:00:00+00:00
broader: Erziehung, Ausbildung
broad match: http://cv.iptc.org/newscodes/subjectcode/05008000

Lehren und Lernen
type: Concept
definition: Beide Eckpfeiler des Gleichgewichts in der Ausbildung
in scheme: mediatopic
created: 2009-10-22T02:00:00+00:00
retired: 2021-09-30T12:00:00+00:00
modified: 2021-09-30T12:00:00+00:00
broader: Erziehung, Ausbildung

Lehrplan
type: Concept
definition: Unterrichtseinheiten einer Bildungseinrichtung und deren Regularien
in scheme: mediatopic
created: 2009-10-22T02:00:00+00:00
modified: 2021-09-30T12:00:00+00:00
broader: Erziehung, Ausbildung

Prüfung
type: Concept
definition: Messung und Bewertung der Fertigkeiten von Schülern.
in scheme: mediatopic
created: 2009-10-22T02:00:00+00:00
modified: 2021-09-30T12:00:00+00:00
broader: Erziehung, Ausbildung
broad match: http://cv.iptc.org/newscodes/subjectcode/05010004

Aufnhameprüfung/Abschluss
type: Concept
definition: Prüfungen für die Aufnahme ins Gymnasium, zur Universität, Fachhochschulen und allen anderen Bildungseinrichtungen, inklusive Vorbereitung, die den Schülern bei der Examensprüfung helfen auch für weiterführende Schulen
in scheme: mediatopic
created: 2009-10-22T02:00:00+00:00
modified: 2021-09-30T12:00:00+00:00
broader: Erziehung, Ausbildung

Schüler
type: Concept
definition: Menschen jeden Alters die sich in einer strukturellen Umgebung befinden, nicht notwendigerweise ein Klassenraum, um etwas zu lernen.
in scheme: mediatopic
created: 2009-10-22T02:00:00+00:00
modified: 2021-09-30T12:00:00+00:00
broader: Erziehung, Ausbildung

Lehrender
type: Concept
definition: Menschen, die ihr Wissen anderen vermitteln
in scheme: mediatopic
created: 2009-10-22T02:00:00+00:00
modified: 2021-09-30T12:00:00+00:00
broader: Erziehung, Ausbildung

Berufsausbildung
type: Concept
definition: Eine Ausbildung, die die Studenten vorbereitet, bietet praktische Erfahrung und Ausbildung in einem bestimmten Berufsfeld. Sie wird manchmal auch als Berufsausbildung oder technische Ausbildung bezeichnet
in scheme: mediatopic
created: 2019-04-06T12:00:00+00:00
modified: 2021-09-30T12:00:00+00:00
broader: Erziehung, Ausbildung

pädagogische Einstufung
type: Concept
definition: Eine Note oder ein Maß für die Leistung eines Studenten in einem Test, einer Aufgabe oder in einem bestimmten Kurs
in scheme: mediatopic
created: 2019-04-06T12:00:00+00:00
modified: 2021-09-30T12:00:00+00:00
broader: Erziehung, Ausbildung

E-Learning
type: Concept
definition: Lernen, bei dem Schüler und Lehrer nicht physisch am selben Ort anwesend sind. Der Unterricht kann synchron oder asynchron erfolgen und nutzt Technologien wie Videokonferenzen, Online-Bewertungen und Videokonferenzen.
in scheme: mediatopic
created: 2021-09-30T12:00:00+00:00
modified: 2021-12-21T12:00:00+00:00
broader: Erziehung, Ausbildung

Umwelt
type: Concept
definition: Alle Aspekte des Schutzes, der Zerstörung und die Bedingungen des Ökosystems der Erde und ihrer Umgebung
in scheme: mediatopic
created: 2009-10-22T02:00:00+00:00
modified: 2025-10-09T12:00:00+00:00
narrower: Klimaveränderung
narrower: Naturschutz
narrower: Umweltverschmutzung
narrower: Ressourcen
narrower: Natur
narrower: Nachhaltigkeit

Klimaveränderung
type: Concept
definition: Signifikante Änderungen bei der Messung von Klima (wie Temperatur, Niederschlag oder Wind) über einen ausgedehnten Zeitraum
in scheme: mediatopic
created: 2009-10-22T02:00:00+00:00
modified: 2025-06-30T12:00:00+00:00
broader: Umwelt
narrower: Klimaerwärmung

Naturschutz
type: Concept
definition: Erhaltung der Wildnis, Flora und Fauna, inklusive aussterbender Arten.
in scheme: mediatopic
created: 2009-10-22T02:00:00+00:00
modified: 2025-06-30T12:00:00+00:00
broader: Umwelt
narrower: Energiesparen
narrower: Naturschutzgebiet

Umweltverschmutzung
type: Concept
definition: Verschmutzung von Luft, Wasser, Land etc. durch schädliche Stoffe
in scheme: mediatopic
created: 2009-10-22T02:00:00+00:00
modified: 2025-10-09T12:00:00+00:00
broader: Umwelt
narrower: Luftverschmutzung
narrower: Umweltsäuberung
narrower: Giftstoff
narrower: Abfall
narrower: Wasserverschmutzung

Ressourcen
type: Concept
definition: Umweltangelegenheiten bezogen auf die Ausbeutung der natürlichen Ressourcen durch die menschliche Verwertung.
in scheme: mediatopic
created: 2009-10-22T02:00:00+00:00
modified: 2025-06-30T12:00:00+00:00
broader: Umwelt
narrower: Rohstoff
narrower: Land
narrower: Bevölkerungsentwicklung
narrower: Erneuerbare Energien
narrower: Wasser

Natur
type: Concept
definition: Gesamtheit von Flora und Fauna
in scheme: mediatopic
created: 2009-10-22T02:00:00+00:00
modified: 2025-10-09T12:00:00+00:00
broader: Umwelt
narrower: Wald
narrower: Berg
narrower: Ozean
narrower: Fluß
narrower: Feuchtgebiet
narrower: Ökosystem
narrower: Artenschutz
narrower: Invasive Arten
narrower: Tier
narrower: Pflanze

Nachhaltigkeit
type: Concept
definition: Maßnahmen von Unternehmen, Regierungen und Einzelpersonen zur Bekämpfung der wichtigsten Umweltprobleme, einschließlich Klimawandel, Verlust der biologischen Vielfalt, Verlust von Ökosystemleistungen, Bodendegradation sowie Luft- und Wasserverschmutzung
in scheme: mediatopic
created: 2023-10-02T12:00:00+00:00
modified: 2025-10-09T12:00:00+00:00
broader: Umwelt

Medizin, Gesundheit
type: Concept
definition: Alle Aspekte des körperlichen und geistigen Wohlbefindens von Menschen.
in scheme: mediatopic
created: 2009-10-22T02:00:00+00:00
modified: 2022-06-14T12:00:00+00:00
narrower: Krankheit
narrower: Gesundheitseinrichtung
narrower: Gesundheitsorganisation
narrower: Medizinische Behandlung
narrower: Gesetzliche Krankenversicherung
narrower: Zusatzversicherung
narrower: Private Krankenversicherung
narrower: Medizin
narrower: Nicht-menschliche Krankheit
narrower: Öffentliche Gesundheit

Krankheit
type: Concept
definition: Jeder gesundheitsgefährdende oder zerstörerische Zustand
in scheme: mediatopic
created: 2009-10-22T02:00:00+00:00
modified: 2022-06-14T12:00:00+00:00
broader: Medizin, Gesundheit
narrower: Krebs
narrower: Ansteckende Krankheit
narrower: Herzkrankheit
narrower: Leiden
narrower: Invalidität
narrower: Krankheitsverlauf
narrower: Psychische Krankheit
narrower: Vergiftung
narrower: Entwicklungsstörung
broad match: http://cv.iptc.org/newscodes/subjectcode/07001000

Gesundheitseinrichtung
type: Concept
definition: Einrichtungen die genutzt werden für jede Art der Gesundheitsfürsorge
in scheme: mediatopic
created: 2009-10-22T02:00:00+00:00
modified: 2022-06-14T12:00:00+00:00
broader: Medizin, Gesundheit
narrower: Krankenhaus
narrower: Gesundheitsklinik
broad match: http://cv.iptc.org/newscodes/subjectcode/07010000

Gesundheitsorganisation
type: Concept
definition: Spezielle Gesundheitsorganisationen, inklusive professionelle Zusammenschlüsse, non-profit und internationale Gruppen.
in scheme: mediatopic
created: 2009-10-22T02:00:00+00:00
modified: 2022-06-14T12:00:00+00:00
broader: Medizin, Gesundheit

Medizinische Behandlung
type: Concept
definition: Behandlung von Krankheiten und Heilungsbedingungen
in scheme: mediatopic
created: 2009-10-22T02:00:00+00:00
modified: 2022-06-14T12:00:00+00:00
broader: Medizin, Gesundheit
narrower: Diät
narrower: Medizinische Droge
narrower: Droge auf Rezept
narrower: Medizinische Untersuchung
narrower: Medikament
narrower: Fitness
narrower: Vorsorge
narrower: Impfung
narrower: Therapie
narrower: Drogentherapie
narrower: Notfallversorgung
narrower: Chirurgie

Gesetzliche Krankenversicherung
type: Concept
definition: Gesundheitsfürsorge, die von der Regierung unterstützt wird
in scheme: mediatopic
created: 2009-10-22T02:00:00+00:00
modified: 2022-06-14T12:00:00+00:00
broader: Medizin, Gesundheit
narrower: Krankenversicherung
narrower: Pflegeversicherung

Zusatzversicherung
type: Concept
definition: Versicherung, die besondere medizinische Kosten übernimmt
in scheme: mediatopic
created: 2009-10-22T02:00:00+00:00
modified: 2022-06-14T12:00:00+00:00
broader: Medizin, Gesundheit

Private Krankenversicherung
type: Concept
definition: Gesundheitsfürsorge, die von privat finanzierten oder Versicherungsorganisationen unterstützt wird
in scheme: mediatopic
created: 2009-10-22T02:00:00+00:00
modified: 2022-06-14T12:00:00+00:00
broader: Medizin, Gesundheit

Medizin
type: Concept
definition: Beruf, der ein spezielles Studium in Diagnostik, Behandlung Pflege und Prävention von Krankheiten, Verletzungen und medizinische Bedingungen verlangt.
in scheme: mediatopic
created: 2009-10-22T02:00:00+00:00
modified: 2022-06-14T12:00:00+00:00
broader: Medizin, Gesundheit
narrower: Medizinischer Service
narrower: Medizinisches Spezialgebiet
narrower: Gesundheitspersonal
broad match: http://cv.iptc.org/newscodes/subjectcode/07006000

Nicht-menschliche Krankheit
type: Concept
definition: Jeder gesundheitsgefährdende oder zerstörerische Zustand der Tiere, Pflanzen oder Mikroorganismen betrifft
in scheme: mediatopic
created: 2009-10-22T02:00:00+00:00
retired: 2022-06-14T12:00:00+00:00
modified: 2022-06-14T12:00:00+00:00
broader: Medizin, Gesundheit
broad match: http://cv.iptc.org/newscodes/subjectcode/07001000

Öffentliche Gesundheit
type: Concept
definition: Organisierte öffentliche oder private Maßnahmen, die der Vorbeugung von Krankheiten, der Förderung der Gesundheit und der Verlängerung des Lebens der gesamten Bevölkerung dienen
in scheme: mediatopic
created: 2022-06-14T12:00:00+00:00
modified: 2022-06-14T12:00:00+00:00
broader: Medizin, Gesundheit

Vermischtes
type: Concept
definition: Artikel über Einzelpersonen, Gruppen, Tiere, Pflanzen oder andere Objekte mit Blick auf emotionale Aspekte
in scheme: mediatopic
created: 2009-10-22T02:00:00+00:00
modified: 2021-05-05T12:00:00+00:00
narrower: Erungenschaft
narrower: Auszeichnung und Preis
narrower: Rekord
narrower: Zeremonie
narrower: Leute
narrower: Missgeschick
narrower: Society
narrower: Prominenz
narrower: Jahrestag
narrower: Geburtstag

Erungenschaft
type: Concept
definition: Nicht-sportliche Leistungen eines Einzelnen oder einer Gruppe, Tiere, Pflanzen oder andere Objekte, wie Gewinnen eines Wettbewerbs etc.
in scheme: mediatopic
created: 2009-10-22T02:00:00+00:00
retired: 2021-05-05T12:00:00+00:00
modified: 2021-05-05T12:00:00+00:00
broader: Vermischtes

Auszeichnung und Preis
type: Concept
definition: Orden, Auszeichnungen und Preise inklusive der, die durch die Regierung vergeben werden.
in scheme: mediatopic
created: 2009-10-22T02:00:00+00:00
modified: 2021-05-05T12:00:00+00:00
broader: Vermischtes

Rekord
type: Concept
definition: Nicht-sportliche Leistung eines Einzelnen oder einer Gruppe, die neue Rekorde aufstellt, wie Rekord im Bücherlesen oder Luft anhalten.
in scheme: mediatopic
created: 2009-10-22T02:00:00+00:00
modified: 2021-05-05T12:00:00+00:00
broader: Vermischtes

Zeremonie
type: Concept
definition: Rituale nicht-religiöser Art wie Weihung, Kranzniederlegungen, Schiffstaufen etc.
in scheme: mediatopic
created: 2009-10-22T02:00:00+00:00
modified: 2021-05-05T12:00:00+00:00
broader: Vermischtes
narrower: Namenstag
narrower: Abschlussfeier
narrower: Beerdigung und Gedenkfeier
narrower: Hochzeit

Leute
type: Concept
definition: Einzelpersonen oder Gruppen mit Blick auf emotionale Aspekte
in scheme: mediatopic
created: 2009-10-22T02:00:00+00:00
retired: 2021-05-05T12:00:00+00:00
modified: 2021-02-18T12:00:00+00:00
broader: Vermischtes

Missgeschick
type: Concept
definition: Ungeschicktes Verhalten von Menschen
in scheme: mediatopic
created: 2009-10-22T02:00:00+00:00
modified: 2021-05-12T12:00:00+00:00
broader: Vermischtes

Society
type: Concept
definition: Leben und Verhalten bekannter Leute
in scheme: mediatopic
created: 2009-10-22T02:00:00+00:00
modified: 2021-05-05T12:00:00+00:00
broader: Vermischtes
narrower: Adel

Prominenz
type: Concept
definition: Leben und Verhalten berühmter Leute
in scheme: mediatopic
created: 2009-10-22T02:00:00+00:00
modified: 2021-05-05T12:00:00+00:00
broader: Vermischtes

Jahrestag
type: Concept
definition: Ein besonderer Jahrestag eines Ereignisses oder die Feier einer bedeutenden Anzahl von Jahren seit der Geburt einer bemerkenswerten Person
in scheme: mediatopic
created: 2019-06-26T12:00:00+00:00
modified: 2021-07-12T12:00:00+00:00
broader: Vermischtes

Geburtstag
type: Concept
definition: Eine Feier am jährlichen Geburtsdatum einer Person.
in scheme: mediatopic
created: 2019-06-26T12:00:00+00:00
modified: 2021-07-12T12:00:00+00:00
broader: Vermischtes

Arbeit, Soziales
type: Concept
definition: Soziale Aspekte, Organisationen, Regeln und Bedingungen bezogen auf die bezahlte Arbeit von menschlicher Leistung, für eine Generation des Wohlstands oder Belohnung für Dienstleistungen und die wirtschaftliche Unterstützung bei Arbeitslosigkeit
in scheme: mediatopic
created: 2009-10-22T02:00:00+00:00
modified: 2021-02-18T12:00:00+00:00
narrower: Beschäftigung
narrower: Arbeitsrecht
narrower: Arbeitsmarkt
narrower: Arbeitsbeziehung
narrower: Ruhestand
narrower: Arbeitslosigkeit
narrower: Gewerkschaft

Beschäftigung
type: Concept
definition: Arbeit für eine Organisation, in der Selbstständigkeit oder auch ehrenamtlich
in scheme: mediatopic
created: 2009-10-22T02:00:00+00:00
modified: 2021-02-18T12:00:00+00:00
broader: Arbeit, Soziales
narrower: Pendelverkehr
narrower: Ausbildung
narrower: Kinderarbeit
narrower: Arbeitnehmer
narrower: Arbeitgeber
narrower: Berufliche Bildung
narrower: Beruf
narrower: Lohn
narrower: Selbstständigkeit
narrower: Erziehungsurlaub
narrower: Ehrenamt

Arbeitsrecht
type: Concept
definition: Gesetze, die Beschäftigung und Arbeit regeln.
in scheme: mediatopic
created: 2009-10-22T02:00:00+00:00
modified: 2021-02-18T12:00:00+00:00
broader: Arbeit, Soziales
narrower: Arbeitssicherheit
broad match: http://cv.iptc.org/newscodes/subjectcode/09005000

Arbeitsmarkt
type: Concept
definition: Arbeitende und arbeitssuchende Bevölkerung.
in scheme: mediatopic
created: 2009-10-22T02:00:00+00:00
modified: 2021-02-18T12:00:00+00:00
broader: Arbeit, Soziales
narrower: Gig-Economy

Arbeitsbeziehung
type: Concept
definition: Das Geben und Nehmen zwischen Unternehmensführung und Beschäftigten
in scheme: mediatopic
created: 2009-10-22T02:00:00+00:00
modified: 2021-02-18T12:00:00+00:00
broader: Arbeit, Soziales
narrower: Tarifvertrag
narrower: Tarifkonflikt
broad match: http://cv.iptc.org/newscodes/subjectcode/09012000

Ruhestand
type: Concept
definition: Die Jahre nach der Berufstätigkeit.
in scheme: mediatopic
created: 2009-10-22T02:00:00+00:00
modified: 2021-02-18T12:00:00+00:00
broader: Arbeit, Soziales
narrower: Rente

Arbeitslosigkeit
type: Concept
definition: Das Fehlen von bezahlter Arbeit.
in scheme: mediatopic
created: 2009-10-22T02:00:00+00:00
modified: 2021-02-18T12:00:00+00:00
broader: Arbeit, Soziales
narrower: Personalabbau
narrower: Arbeitslosengeld

Gewerkschaft
type: Concept
definition: Etablierte Gruppen, um die Arbeiterschaft zu vertreten.
in scheme: mediatopic
created: 2009-10-22T02:00:00+00:00
modified: 2021-02-18T12:00:00+00:00
broader: Arbeit, Soziales

Freizeit, Modernes Leben
type: Concept
definition: Aktivitäten zum Vergnügen, zur Entspannung und Erholung, außerhalb von bezahlter Arbeit, inklusive Essen und Reisen
in scheme: mediatopic
created: 2009-10-22T02:00:00+00:00
modified: 2021-05-05T12:00:00+00:00
narrower: Freizeit
narrower: Lebensstil
narrower: Wellness

Freizeit
type: Concept
definition: Aktivitäten, die jemand in seiner freien Zeit ausübt.
in scheme: mediatopic
created: 2009-10-22T02:00:00+00:00
modified: 2021-02-18T12:00:00+00:00
broader: Freizeit, Modernes Leben
narrower: Verein
narrower: Spiel
narrower: Glücksspiel und Lotterie
narrower: Hobby
narrower: Urlaub
narrower: Veranstaltungsort
narrower: Freizeitaktivität
narrower: Reise
broad match: http://cv.iptc.org/newscodes/subjectcode/10010000

Lebensstil
type: Concept
definition: Lebensform und Kultur der eigenen Heimat
in scheme: mediatopic
created: 2009-10-22T02:00:00+00:00
modified: 2021-02-18T12:00:00+00:00
broader: Freizeit, Modernes Leben
narrower: Biologische Nahrungsmittel
narrower: Wohnungseinrichtung
narrower: Trend
narrower: Party
narrower: http://cv.iptc.org/newscodes/mediatopic/20001391
broad match: http://cv.iptc.org/newscodes/subjectcode/10000000

Wellness
type: Concept
definition: Das aktive Streben nach guter geistiger und körperlicher Gesundheit
in scheme: mediatopic
created: 2021-12-17T12:00:00+00:00
modified: 2021-12-21T12:00:00+00:00
broader: Freizeit, Modernes Leben
narrower: Bewegung und Fitness
narrower: Geistiges Wohlbefinden

Politik
type: Concept
definition: Lokale, regionale, nationale und internationale Übungen der Stärke oder zur Erlangung von Stärke, und die Beziehung zwischen regierenden Einheiten und Staaten
in scheme: mediatopic
created: 2009-10-22T02:00:00+00:00
modified: 2025-03-31T12:00:00+00:00
narrower: Wahl
narrower: Regierung
narrower: Regierungspolitik
narrower: Internationale Beziehung
narrower: Regierungsunabhängige Organisation
narrower: Krise
narrower: Politische Unruhen
narrower: Politik (allgemein)

Wahl
type: Concept
definition: Die Auswahl der Repräsentanten durch das Abgeben von Stimmen
in scheme: mediatopic
created: 2009-10-22T02:00:00+00:00
modified: 2024-09-26T12:00:00+00:00
broader: Politik
narrower: Bürgerinitiative
narrower: Wahlsystem
narrower: staatsübergreifende Wahl
narrower: Kommunalwahl
narrower: Bundestagswahl
narrower: Wahlkampf
narrower: Wahlkampffinanzierung
narrower: Kandidat
narrower: Vorwahl
narrower: Referendum
narrower: Landtagswahl/Bürgerschaftswahl
narrower: Stimmwahl
narrower: Kirchenwahlen
narrower: politische Debatten
narrower: Nachwahl
narrower: Abberufungswahl
narrower: Koalitionsverhandlung

Regierung
type: Concept
definition: Das regulierende System eines Landes
in scheme: mediatopic
created: 2009-10-22T02:00:00+00:00
modified: 2025-03-31T12:00:00+00:00
broader: Politik
narrower: Öffentlicher Dienst
narrower: Beamte
narrower: Ministerialbeamte
narrower: Verfassung (Gesetz)
narrower: Verteidigung
narrower: Bundeskabinett
narrower: Staatshaushalt
narrower: Ministerium
narrower: Staatsoberhaupt/Bundespräsident
narrower: Amtsvergehen
narrower: Kommune
narrower: Minister
narrower: Bundesregierung
narrower: Parlament
narrower: Bundesland/Kanton
narrower: Lobby
narrower: Politische Parteien und Bewegungen
narrower: Politikgeschichte
narrower: Politisches System
narrower: Regulierungsbehörde
narrower: politischer Konvent
narrower: politische Ausschüsse
narrower: Regierungschefs
narrower: öffentliche Untersuchung
narrower: Parteivorsitzende
narrower: Partei
narrower: Politische Bewegung und Zusammenschluss

Regierungspolitik
type: Concept
definition: Ein umfassender Plan oder Kurs der Regierung, um Entscheidungen und Aktionen zu einem gewünschten Ergebnis zu bringen und zu steuern
in scheme: mediatopic
created: 2009-10-22T02:00:00+00:00
modified: 2025-03-31T12:00:00+00:00
broader: Politik
narrower: Wirtschaftspolitik
narrower: Umweltpolitik
narrower: Gesundheitspolitik
narrower: Innere Sicherheit
narrower: Steuern
narrower: Innenpolitik
narrower: Datenschutz
narrower: Wohnungs- und Städtebaupolitik
narrower: Politik gegenüber indigener Bevölkerung
narrower: Sozialpolitik
narrower: Volkszählung
narrower: Waffenkontrolle
narrower: Planfeststellungsverfahren
narrower: Migration
narrower: Atompolitik
narrower: Regulierungsbehörde
narrower: Kulturpolitik
narrower: Integration
narrower: Sportpolitik
narrower: regionale Entwicklungspolitik
narrower: Infrastrukturpolitik
narrower: Kommunalpolitik
narrower: Bildungspolitik
narrower: Flächennutzungsplan
broad match: http://cv.iptc.org/newscodes/subjectcode/11006000

Internationale Beziehung
type: Concept
definition: Nicht gewalttätige Beziehungen zwischen zwei Staaten in Form von Verhandlungen, Verträgen und persönliche Treffen
in scheme: mediatopic
created: 2009-10-22T02:00:00+00:00
modified: 2025-03-31T12:00:00+00:00
broader: Politik
narrower: Diplomatie
narrower: Wirtschaftliche Sanktion
narrower: Auslandshilfe
narrower: Internationale Organisation
narrower: Flüchtling
narrower: Grenzstreitigkeit

Regierungsunabhängige Organisation
type: Concept
definition: Gruppen, offiziell außerhalb der Regierung stehend, die in einem größeren Themenspektrum Einfluss ausüben, demonstrieren, agieren wie Ökonomie, Umwelt, Gesundheit etc.
in scheme: mediatopic
created: 2009-10-22T02:00:00+00:00
modified: 2025-03-31T12:00:00+00:00
broader: Politik

Krise
type: Concept
definition: Konflikte aller Art, die sich zu einer Stufe entwickeln können, abhängig von Ereignissen, bei denen Regierungen gestürzt werden können, Kriege erklärt werden können, Börsenmärkte zusammenbrechen können, oder auch nicht.
in scheme: mediatopic
created: 2009-10-22T02:00:00+00:00
retired: 2025-03-31T12:00:00+00:00
modified: 2025-03-31T12:00:00+00:00
broader: Politik
broad match: http://cv.iptc.org/newscodes/subjectcode/16011000

Politische Unruhen
type: Concept
definition: Missverständnis zwischen politischen Gruppen, in der Regel organisiert, die manchmal in Verhaftungen münden.
in scheme: mediatopic
created: 2009-10-22T02:00:00+00:00
modified: 2025-03-31T12:00:00+00:00
broader: Politik

Politik (allgemein)
type: Concept
definition: Die Kunst oder Wissenschaft an Regierungsangelegenheiten teilzuhaben, der Zustand einer politischen Partei.
in scheme: mediatopic
created: 2009-10-22T02:00:00+00:00
retired: 2025-03-31T12:00:00+00:00
modified: 2025-03-31T12:00:00+00:00
broader: Politik

Religion, Weltanschauung
type: Concept
definition: Alle Aspekte des menschlichen Lebens, die Religion, Philosophie, Ethik und Spiritualität beinhalten.
in scheme: mediatopic
created: 2009-10-22T02:00:00+00:00
modified: 2021-12-21T12:00:00+00:00
narrower: Glaube
narrower: Interreligiöser Dialog
narrower: Religionskonfliktl
narrower: Religiöses Ereignis
narrower: Religionsfest oder Feiertag
narrower: Religionsritual
narrower: Religiöse Bauwerke
narrower: Beziehung Religion und Staat
narrower: Religiöses Oberhaupt
narrower: Religiöse Schriften

Glaube
type: Concept
definition: Anerkannte Glaubensinhalte der einzelnen Religionen
in scheme: mediatopic
created: 2009-10-22T02:00:00+00:00
modified: 2021-12-21T12:00:00+00:00
broader: Religion, Weltanschauung
narrower: Buddhismus
narrower: Christentum
narrower: Konfuzianismus
narrower: Kult und Sekte
narrower: Freimaurer
narrower: Hinduismus
narrower: Islam
narrower: Jainismus
narrower: Judentum
narrower: Naturreligion
narrower: Zoroastrismus
narrower: Scientology
narrower: Schintoismus
narrower: Sikhismus
narrower: Taoismus
narrower: Vereinigungsbewegung
narrower: Atheismus und Agnostizismus

Interreligiöser Dialog
type: Concept
definition: Jede Form des Austausches zwischen Religionen
in scheme: mediatopic
created: 2009-10-22T02:00:00+00:00
retired: 2021-12-17T12:00:00+00:00
modified: 2021-02-18T12:00:00+00:00
broader: Religion, Weltanschauung

Religionskonfliktl
type: Concept
definition: Konflikte, die religiöse Unterschiede miteinbeziehen
in scheme: mediatopic
created: 2009-10-22T02:00:00+00:00
modified: 2021-02-18T12:00:00+00:00
broader: Religion, Weltanschauung

Religiöses Ereignis
type: Concept
definition: Religiöse Ereignisse, aber keine Feste oder Feiertage.
in scheme: mediatopic
created: 2009-10-22T02:00:00+00:00
retired: 2021-12-17T12:00:00+00:00
modified: 2021-07-12T12:00:00+00:00
broader: Religion, Weltanschauung

Religionsfest oder Feiertag
type: Concept
definition: Feiertag oder religiöser Anlass, der manchmal auch ein öffentlicher Feiertag ist.
in scheme: mediatopic
created: 2009-10-22T02:00:00+00:00
modified: 2021-12-17T12:00:00+00:00
broader: Religion, Weltanschauung
narrower: Weihnachten
narrower: Ostern
narrower: Pfingsten
narrower: Ramadan
narrower: Jom Kippur
narrower: Allerheiligen
narrower: Walpurgisnacht
narrower: Eid al-Adha
narrower: Chanukka

Religionsritual
type: Concept
definition: Etablierte religiöse Rituale, wie Messen, Taufen, Priestertreffen.
in scheme: mediatopic
created: 2009-10-22T02:00:00+00:00
modified: 2021-12-17T12:00:00+00:00
broader: Religion, Weltanschauung
narrower: Taufe
narrower: Bar Mitzwa und Bat Mitzwa
narrower: Heiligsprechung

Religiöse Bauwerke
type: Concept
definition: Jede Einrichtung, wo eine Gruppe ihre religiösen Rituale zelebrieren kann, egal ob es eine Moschee, eine Kirche, ein Haus oder ein Zelt ist
in scheme: mediatopic
created: 2009-10-22T02:00:00+00:00
modified: 2021-12-17T12:00:00+00:00
broader: Religion, Weltanschauung
narrower: Kirche
narrower: Moschee
narrower: Synagoge
narrower: Tempel
broad match: http://cv.iptc.org/newscodes/subjectcode/12000000

Beziehung Religion und Staat
type: Concept
definition: Die rechtliche und soziale Trennung von Kirche und Staat
in scheme: mediatopic
created: 2009-10-22T02:00:00+00:00
modified: 2024-07-01T12:00:00+00:00
broader: Religion, Weltanschauung

Religiöses Oberhaupt
type: Concept
definition: Person oder Personen, die eine rituelle oder führende Rolle in ihrer jeweiligen Religion oder Kirche haben.
in scheme: mediatopic
created: 2009-10-22T02:00:00+00:00
modified: 2021-02-18T12:00:00+00:00
broader: Religion, Weltanschauung
narrower: Papst

Religiöse Schriften
type: Concept
definition: Schriften die heilig oder wichtig für eine Kirche oder Religion sind.
in scheme: mediatopic
created: 2009-10-22T02:00:00+00:00
modified: 2021-12-17T12:00:00+00:00
broader: Religion, Weltanschauung
narrower: Bibel
narrower: Koran
narrower: Thora

Wissenschaft, Technik, Forschung
type: Concept
definition: Alle Aspekte des menschlichen Verständnisses sowie der methodischen Erforschung der Natur-, Form- und Sozialwissenschaften, wie Astronomie, Linguistik oder Ökonomie
in scheme: mediatopic
created: 2009-10-22T02:00:00+00:00
modified: 2021-02-18T12:00:00+00:00
narrower: Biomedizin
narrower: Mathematik
narrower: Naturwissenschaft
narrower: Forschung
narrower: Wissenschaftliche Institutionen
narrower: Sozialwissenschaften
narrower: Standards
narrower: Technologie und Technik

Biomedizin
type: Concept
definition: Die Anwendung der biologisch basierten Wissenschaft auf medizinische Gebiete wie Forschung, Gesundheitsmonitoring oder medizinische Behandlung
in scheme: mediatopic
created: 2009-10-22T02:00:00+00:00
modified: 2021-02-18T12:00:00+00:00
broader: Wissenschaft, Technik, Forschung
narrower: Biotechnologie
broad match: http://cv.iptc.org/newscodes/subjectcode/13019000

Mathematik
type: Concept
definition: Das Studium von Struktur, Raum, Veränderung und Zahl in abstrakter Form, oft unter Verwendung symbolischer Logik und Sprache, einschließlich Themen wie Geometrie, Algebra oder Trigonometrie
in scheme: mediatopic
created: 2009-10-22T02:00:00+00:00
modified: 2021-02-18T12:00:00+00:00
broader: Wissenschaft, Technik, Forschung

Naturwissenschaft
type: Concept
definition: Die Wissenschaften, die sich mit Materie, Energie und der physikalischen Welt beschäftigen, einschließlich Physik, Biologie, Chemie und Astronomie
in scheme: mediatopic
created: 2009-10-22T02:00:00+00:00
modified: 2021-02-18T12:00:00+00:00
broader: Wissenschaft, Technik, Forschung
narrower: Astronomie
narrower: Biologie
narrower: Chemie
narrower: Kosmologie
narrower: Geologie
narrower: Gartenbau
narrower: Meeresforschung
narrower: Meteorologie
narrower: Physik

Forschung
type: Concept
definition: Methodische Untersuchungen von Ereignissen, Prozeduren etc. um zu erklären, wie sie entstehen oder um Lösungen zu finden für Probleme.
in scheme: mediatopic
created: 2009-10-22T02:00:00+00:00
modified: 2021-02-18T12:00:00+00:00
broader: Wissenschaft, Technik, Forschung
narrower: Forschung und Entwicklung
narrower: Medizinische Forschung
narrower: Wissenschaftliche Forschung
narrower: Wissenschaftliche Veröffentlichung

Wissenschaftliche Institutionen
type: Concept
definition: Institution, die wissenschaftliche Arbeiten durchführt oder regelt, wie die Nationale Akademie der Künste und Wissenschaften
in scheme: mediatopic
created: 2009-10-22T02:00:00+00:00
modified: 2021-02-18T12:00:00+00:00
broader: Wissenschaft, Technik, Forschung

Sozialwissenschaften
type: Concept
definition: Das Studium der menschlichen Gesellschaft in den Bereichen Linguistik, Anthropologie, Ökonomie und Soziologie
in scheme: mediatopic
created: 2009-10-22T02:00:00+00:00
modified: 2021-02-18T12:00:00+00:00
broader: Wissenschaft, Technik, Forschung
narrower: Anthropologie
narrower: Archäologie
narrower: Wirtschaftswissenschaft
narrower: Geografie
narrower: Geschichte
narrower: Informationswissenschaft
narrower: Jura
narrower: Linguistik
narrower: Philosophie
narrower: Politikwissenschaft
narrower: Psychologie
narrower: Soziologie

Standards
type: Concept
definition: National oder international etablierte Regeln für wissenschaftliche und technologische Studien und Entwicklungen, wie z.B. Kalibrierstandards für wissenschaftliche Werkzeuge oder Geräte
in scheme: mediatopic
created: 2009-10-22T02:00:00+00:00
modified: 2021-02-18T12:00:00+00:00
broader: Wissenschaft, Technik, Forschung

Technologie und Technik
type: Concept
definition: Studium und Praxis industrieller oder angewandter Wissenschaften wie Physik, Hydrodynamik oder Thermodynamik
in scheme: mediatopic
created: 2009-10-22T02:00:00+00:00
modified: 2021-02-18T12:00:00+00:00
broader: Wissenschaft, Technik, Forschung
narrower: Maschinenbau
narrower: Luft- und Raumfahrttechnik
narrower: Agrarwissenschaft
narrower: Ingenieurwesen
narrower: Eletrotechnik
narrower: Technologie zur Identitätsprüfung
narrower: Informatik
narrower: Materialwissenschaft
narrower: Mikroelektronik
broad match: http://cv.iptc.org/newscodes/subjectcode/13000000

Gesellschaft, Bevölkerung
type: Concept
definition: Aspekte des menschlichen Lebens, die die zwischenmenschlichen Beziehungen beeinflussen
in scheme: mediatopic
created: 2009-10-22T02:00:00+00:00
modified: 2021-02-18T12:00:00+00:00
narrower: Grundrechte
narrower: Gesellschaft
narrower: Bevölkerungsentwicklung
narrower: Einwanderung
narrower: Auswanderer
narrower: Diskriminierung
narrower: Familie
narrower: Bevölkerung
narrower: Soziale Bedingung
narrower: Soziales Problem
narrower: Wertvorstellung
narrower: Sozialfürsorge
narrower: Diversität, Gerechtigkeit und Integration

Grundrechte
type: Concept
definition: Die politischen, soziale und ökonomischen Rechte, die für alle Menschen gelten, meist in Gesetzen festgelegt
in scheme: mediatopic
created: 2009-10-22T02:00:00+00:00
modified: 2024-09-26T12:00:00+00:00
broader: Gesellschaft, Bevölkerung
narrower: Zivilrecht
narrower: Zensur
narrower: Religionsfreiheit
narrower: Pressefreiheit
narrower: Menschenrechte
narrower: Datenschutz
narrower: Frauenrechte
broad match: http://cv.iptc.org/newscodes/subjectcode/02007000

Gesellschaft
type: Concept
definition: Eine Gruppe von Einzelpersonen, die aktiv gemeinsame Werte oder Interessen teilen
in scheme: mediatopic
created: 2009-10-22T02:00:00+00:00
modified: 2021-02-18T12:00:00+00:00
broader: Gesellschaft, Bevölkerung
narrower: Soziales Netzwerk
narrower: gemeinschaftliche Gruppen
broad match: http://cv.iptc.org/newscodes/subjectcode/14024000

Bevölkerungsentwicklung
type: Concept
definition: Das Studium der Menschen, und hier ihr Leben und ihre Beziehungen
in scheme: mediatopic
created: 2009-10-22T02:00:00+00:00
modified: 2021-02-18T12:00:00+00:00
broader: Gesellschaft, Bevölkerung
narrower: Bevölkerungszahl

Einwanderung
type: Concept
definition: Bewegung von Individuen von einem Land in ein anderes
in scheme: mediatopic
created: 2009-10-22T02:00:00+00:00
modified: 2021-02-18T12:00:00+00:00
broader: Gesellschaft, Bevölkerung
narrower: Illegale Einwanderung

Auswanderer
type: Concept
definition: Menschen, die ihr Heimatland verlassen, alle Beziehung zu ihrem Heimatland abbrechen und deren Verbindungen mit anderen Emigranten
in scheme: mediatopic
created: 2009-10-22T02:00:00+00:00
modified: 2021-07-12T12:00:00+00:00
broader: Gesellschaft, Bevölkerung

Diskriminierung
type: Concept
definition: Verweigerung einer Dienstleistung für eine Person oder Personengruppe aufgrund der Rasse, Hautfarbe, sexuellen Identität, Religionszugehörigkeit, politischen Ansichten etc.
in scheme: mediatopic
created: 2009-10-22T02:00:00+00:00
modified: 2021-02-18T12:00:00+00:00
broader: Gesellschaft, Bevölkerung
narrower: Altersdiskriminierung
narrower: Rassismus
narrower: Religiöse Diskriminierung
narrower: Sexismus

Familie
type: Concept
definition: Eine Personengruppe, die durch Blut oder Heirat miteinander verwandt ist
in scheme: mediatopic
created: 2009-10-22T02:00:00+00:00
modified: 2021-02-18T12:00:00+00:00
broader: Gesellschaft, Bevölkerung
narrower: Adoption
narrower: Partnerwahl
narrower: Scheidung
narrower: Familienplanung
narrower: Heirat
narrower: Eltern und Kind
narrower: Schwangerschaft und Geburt

Bevölkerung
type: Concept
definition: Individuen als Ganzes, manchmal in verschiedene Klassen eingeteilt, wie Einheimische, Menschen einer Schicht etc.
in scheme: mediatopic
created: 2009-10-22T02:00:00+00:00
modified: 2025-06-30T12:00:00+00:00
broader: Gesellschaft, Bevölkerung
narrower: Erwachsener
narrower: Kind
narrower: Behinderung
narrower: Homosexuelle
narrower: Geschlecht
narrower: Kleinkind
narrower: Nationale oder ethische Minderheit
narrower: Strahlenopfer
narrower: Senior
narrower: Jugendlicher
narrower: indigene Völker
narrower: Frauen
narrower: Männer

Soziale Bedingung
type: Concept
definition: Probleme, die eine Reihe von Individuen in ihrem täglichen Leben betreffen, wie Unterkunft, Nahrung, Erziehung, persönliche Beziehungen
in scheme: mediatopic
created: 2009-10-22T02:00:00+00:00
modified: 2021-05-05T12:00:00+00:00
broader: Gesellschaft, Bevölkerung
narrower: Obdachlosigkeit
narrower: Armut

Soziales Problem
type: Concept
definition: Menschliche Lebensbedingungen
in scheme: mediatopic
created: 2009-10-22T02:00:00+00:00
modified: 2021-02-18T12:00:00+00:00
broader: Gesellschaft, Bevölkerung
narrower: Misshandlung
narrower: Sucht
narrower: Jugendkriminalität
narrower: Prostitution
narrower: Sklaverei
narrower: sexuelles Fehlverhalten
narrower: Mobbing
broad match: http://cv.iptc.org/newscodes/subjectcode/14025002

Wertvorstellung
type: Concept
definition: Persönliche Stufen sozialen Verhaltens
in scheme: mediatopic
created: 2009-10-22T02:00:00+00:00
modified: 2021-02-18T12:00:00+00:00
broader: Gesellschaft, Bevölkerung
narrower: Korruptes Verhalten
narrower: Tod und Sterben
narrower: Ethik
narrower: Pornografie
narrower: SexuellesVerhalten

Sozialfürsorge
type: Concept
definition: Grundsätzliche Unterstützung von Menschen, die Nahrungsmittel, Unterkunft, Gesundheit und andere Dienstleistungen benötigen
in scheme: mediatopic
created: 2009-10-22T02:00:00+00:00
modified: 2021-02-18T12:00:00+00:00
broader: Gesellschaft, Bevölkerung
narrower: Wohltätigkeit
narrower: Langzeitpflege
narrower: Sozialer Dienst
narrower: Altenpflege
narrower: Sozialer Wohnungsbau
narrower: Kinderbetreuung

Diversität, Gerechtigkeit und Integration
type: Concept
definition: Bemühungen zur Förderung fairer Behandlung und voller Beteiligung von Personengruppen, die in der Vergangenheit unterrepräsentiert oder aufgrund ihrer Identität oder Behinderung diskriminiert wurden
in scheme: mediatopic
created: 2023-03-31T12:00:00+00:00
modified: 2023-03-31T12:00:00+00:00
broader: Gesellschaft, Bevölkerung

Sport
type: Concept
definition: Im Wettkampf ausgeübte Betätigung mit körperlichen und/oder mentalen Leistungen. Organisationen und Körperschaften sind die Träger dieser Aktivitäten
in scheme: mediatopic
created: 2009-10-22T02:00:00+00:00
modified: 2021-02-18T12:00:00+00:00
narrower: Disziplin
narrower: Disziplinarmaßnahmen im Sport
narrower: Doping (allgemein)
narrower: Sportereignis
narrower: Sportindustrie
narrower: Sportorganisation
narrower: Sportstätte
narrower: Transfer
narrower: sportliche Leistung
narrower: Trainerteam
narrower: Vereinsführung
narrower: Schiedsrichter

Disziplin
type: Concept
definition: Verschiedene Arten von Sport, die in Wettkämpfen ausgetragen werden können
in scheme: mediatopic
created: 2009-10-22T02:00:00+00:00
modified: 2021-02-18T12:00:00+00:00
broader: Sport
narrower: American football
narrower: Bogenschießen
narrower: Leichtathletik
narrower: Australian rules football
narrower: Badminton
narrower: Bandy
narrower: Baseball
narrower: Basketball
narrower: Biathlon
narrower: Billard
narrower: Bob
narrower: Boules und Pètanque
narrower: Boxen
narrower: Stierkampf
narrower: Canadian Football
narrower: Kanu
narrower: Casting (Angeln)
narrower: Bergsteigen
narrower: Sportklettern
narrower: Kricket
narrower: Crocket
narrower: Curling
narrower: Radsport
narrower: Tanzen
narrower: Dart
narrower: Turm- und Brettspringen
narrower: Unterwassersport
narrower: Hunderennen
narrower: Duathlon
narrower: Pferdesport
narrower: Fechten
narrower: Feldhockey
narrower: Eiskunstlauf
narrower: Faustball
narrower: Unihockey
narrower: Frisbee
narrower: Gaelic football
narrower: Golf
narrower: Turnen
narrower: Handball (Team)
narrower: Hornussen
narrower: Pferderennen
narrower: Hurling
narrower: Eishockey
narrower: Inline Skating
narrower: Jai Alai (Pelota)
narrower: Kabaddi
narrower: Kajak
narrower: Lacrosse
narrower: Rodeln
narrower: Marathon
narrower: Moderner Fünfkampf
narrower: Motorboot
narrower: Motorsport
narrower: Motorradrennen
narrower: Netzball
narrower: Orientierung
narrower: Fallschirmspringen
narrower: Polo
narrower: Billiard
narrower: Motorbootsport
narrower: Rodeo
narrower: Rudern
narrower: Segeln
narrower: Sepak Takraw
narrower: Shinty
narrower: Schießen
narrower: Skeleton
narrower: Ski
narrower: Sky Diving
narrower: Snooker
narrower: Snowboard
narrower: Fußball

Disziplinarmaßnahmen im Sport
type: Concept
definition: Aktionen, einschließlich Geldstrafen und Suspensionen erhoben von Sportorganisationen und Teams
in scheme: mediatopic
created: 2009-10-22T02:00:00+00:00
modified: 2021-02-18T12:00:00+00:00
broader: Sport

Doping (allgemein)
type: Concept
definition: Medikamente werden genommen um die Wettbewerbsfähigkeit im Sport zu ermöglichen
in scheme: mediatopic
created: 2009-10-22T02:00:00+00:00
modified: 2022-09-23T12:00:00+00:00
broader: Sport
narrower: Doping
narrower: Drogentest
narrower: Medizinisches Doping
broad match: http://cv.iptc.org/newscodes/subjectcode/15000000

Sportereignis
type: Concept
definition: Sportliche Veranstaltung, bei der ein oder mehrere sportliche Wettkämpfe stattfinden
in scheme: mediatopic
created: 2009-10-22T02:00:00+00:00
modified: 2021-07-12T12:00:00+00:00
broader: Sport
narrower: Kontinentale Meisterschaft
narrower: Kontinentaler Cup
narrower: Kontinentale Spiele
narrower: Internationale Meisterschaft
narrower: Internationaler Cup
narrower: Internationale Spiele
narrower: Nationale Meisterschaft
narrower: Nationaler Cup
narrower: Nationale Spiele
narrower: Regionale Meisterschaft
narrower: Regionaler Cup
narrower: Regionale Spiele
narrower: Weltmeisterschaft
narrower: Weltcup
narrower: Weltspiele
narrower: Olympische Spiele
narrower: Paralympische Spiele
narrower: Sportsaison
narrower: Playoffs
narrower: Finale

Sportindustrie
type: Concept
definition: Kommerzielle Aspekte im Sport
in scheme: mediatopic
created: 2009-10-22T02:00:00+00:00
modified: 2021-02-18T12:00:00+00:00
broader: Sport
broad match: http://cv.iptc.org/newscodes/subjectcode/15000000

Sportorganisation
type: Concept
definition: Organisationen und Sportverbände
in scheme: mediatopic
created: 2009-10-22T02:00:00+00:00
modified: 2023-10-02T12:00:00+00:00
broader: Sport

Sportstätte
type: Concept
definition: Kommerzielle Einrichtungen für Sportereignisse
in scheme: mediatopic
created: 2009-10-22T02:00:00+00:00
modified: 2021-03-31T12:00:00+00:00
broader: Sport
broad match: http://cv.iptc.org/newscodes/subjectcode/15000000

Transfer
type: Concept
definition: Wechsel eine Teammitglieds von einem Team zu einem anderen
in scheme: mediatopic
created: 2012-10-04T12:00:00+00:00
modified: 2021-07-12T12:00:00+00:00
broader: Sport

sportliche Leistung
type: Concept
definition: Rekorde oder Ehrungen von Sportlern für ihre Leistungen
in scheme: mediatopic
created: 2021-02-18T12:00:00+00:00
modified: 2021-07-12T12:00:00+00:00
broader: Sport
narrower: Rekord
narrower: Medaille
narrower: sportliche Preise

Trainerteam
type: Concept
definition: Das Personal, das für das Training und das Management einer Sportmannschaft auf dem Spielfeld verantwortlich ist
in scheme: mediatopic
created: 2021-05-05T12:00:00+00:00
modified: 2021-12-21T12:00:00+00:00
broader: Sport

Vereinsführung
type: Concept
definition: Die Führungsspitze und die Eigentümer eines Sportvereins
in scheme: mediatopic
created: 2021-05-05T12:00:00+00:00
modified: 2021-12-21T12:00:00+00:00
broader: Sport

Schiedsrichter
type: Concept
definition: Schiedsrichter, Kampfrichter und anderes Personal, das die Regeln einer Sportart auf dem Spielfeld durchsetzt
in scheme: mediatopic
created: 2021-05-05T12:00:00+00:00
modified: 2024-03-28T12:00:00+00:00
broader: Sport

Krise, Krieg, Konflikte
type: Concept
definition: Sozial oder politisch motivierte Aktivitäten sowhl in Form von Protesten, Gewalttätigkeiten, Militäraktionen und geopolitischen Konflikten, als auch Aktivitäten zur Lösung dessen
in scheme: mediatopic
created: 2009-10-22T02:00:00+00:00
modified: 2021-02-18T12:00:00+00:00
narrower: Terroranschlag
narrower: Bewaffneter Konflikt
narrower: Unruhen
narrower: Staatsstreich
narrower: Massaker
narrower: Friedensprozess
narrower: Wiederaufbau
narrower: Cyberkrieg
narrower: Kriegsopfer
broad match: http://cv.iptc.org/newscodes/subjectcode/16000000

Terroranschlag
type: Concept
definition: Meist tödliche Gewalttat, um Angst und Schrecken in der Bevölkerung auszulösen
in scheme: mediatopic
created: 2009-10-22T02:00:00+00:00
modified: 2021-02-18T12:00:00+00:00
broader: Krise, Krieg, Konflikte
narrower: Bioterrorismus
narrower: Bombenattentat

Bewaffneter Konflikt
type: Concept
definition: Auseinandersetzungen zwischen gegensätzlichen Gruppen, unter Einsatz von Waffen
in scheme: mediatopic
created: 2009-10-22T02:00:00+00:00
modified: 2021-02-18T12:00:00+00:00
broader: Krise, Krieg, Konflikte
narrower: Guerilla
narrower: Internationale militärische Intervention
narrower: Militärische Besetzung
narrower: Krieg

Unruhen
type: Concept
definition: Kundgebungen, Streiks, Demonstrationen, Ausschreitungen oder ein anderer Aufruhr in der Bevölkerung, meist aus Protest gegen die Regierung oder gegen die Politik oder gegen Aktionen einer anderen Organisation
in scheme: mediatopic
created: 2009-10-22T02:00:00+00:00
modified: 2021-02-18T12:00:00+00:00
broader: Krise, Krieg, Konflikte
narrower: Demonstration
narrower: Rebellion
narrower: Revolution
narrower: Ausschreitung

Staatsstreich
type: Concept
definition: Der Sturz einer bestehenden Regierung durch eine organisierte militärische oder politische Gruppe
in scheme: mediatopic
created: 2009-10-22T02:00:00+00:00
modified: 2021-02-18T12:00:00+00:00
broader: Krise, Krieg, Konflikte

Massaker
type: Concept
definition: Der Massenmord an einer Gruppe von Menschen, meist Zivilisten, während einer kriegerischen Auseinandersetzung.
in scheme: mediatopic
created: 2009-10-22T02:00:00+00:00
modified: 2021-02-18T12:00:00+00:00
broader: Krise, Krieg, Konflikte

Friedensprozess
type: Concept
definition: Organisierte Aktivitäten um einen Konflikt oder Krieg zu beenden, üblicherweise unter Einsatz von Friedensverhandlungen und Friedensvereinbarungen
in scheme: mediatopic
created: 2009-10-22T02:00:00+00:00
modified: 2021-02-18T12:00:00+00:00
broader: Krise, Krieg, Konflikte
narrower: Friedenstruppe
narrower: Friedensverhandlung
narrower: Friedensplan
narrower: Friedensgespräche
narrower: Abrüstung
broad match: http://cv.iptc.org/newscodes/subjectcode/11002003

Wiederaufbau
type: Concept
definition: Aktivitäten zur Wiederherstellung der Gesellschaft, Wirtschaft oder des politischen Systems in einem Gebiet nach einem Krieg
in scheme: mediatopic
created: 2009-10-22T02:00:00+00:00
modified: 2021-02-18T12:00:00+00:00
broader: Krise, Krieg, Konflikte
narrower: Kampfmittelbeseitigung
broad match: http://cv.iptc.org/newscodes/subjectcode/11002000

Cyberkrieg
type: Concept
definition: Cyberangriffe oder mutmaßliche Angriffe, an denen eine staatliche Einrichtung entweder als Sponsor oder als Ziel beteiligt ist. Auch Präventivmaßnahmen gegen diese Art von Aktionen.
in scheme: mediatopic
created: 2022-09-23T12:00:00+00:00
modified: 2022-09-23T12:00:00+00:00
broader: Krise, Krieg, Konflikte

Kriegsopfer
type: Concept
definition: Personen, die in einem Krieg oder bewaffneten Konflikt verletzt oder getötet werden, einschließlich Zivilisten
in scheme: mediatopic
created: 2024-03-28T12:00:00+00:00
modified: 2024-03-28T12:00:00+00:00
broader: Krise, Krieg, Konflikte
narrower: Kriegsvermisste
narrower: Kriegsgefangene

Wetter
type: Concept
definition: Studien, Vorhersagen und Berichte meteorologischer Phänomene
in scheme: mediatopic
created: 2009-10-22T02:00:00+00:00
modified: 2021-02-18T12:00:00+00:00
narrower: Vorhersage
narrower: Wetterphänomene
narrower: Wetterstatistik
narrower: Unwetterwarnung

Vorhersage
type: Concept
definition: Vorhersage und Berichte über den Verlauf des Wetters sowohl für einen kürzeren als auch längeren, zukünftigen Zeitraum
in scheme: mediatopic
created: 2009-10-22T02:00:00+00:00
modified: 2021-02-18T12:00:00+00:00
broader: Wetter

Wetterphänomene
type: Concept
definition: Kurz- oder langfristige Beobachtungen von Wetterphänomenen die untersucht, berichtet oder auf die öffentlich hingewiesen werden soll, wie etwa Klimaänderungen, Unwetter, Hitzewellen oder Wirbelstürme
in scheme: mediatopic
created: 2009-10-22T02:00:00+00:00
modified: 2021-05-05T12:00:00+00:00
broader: Wetter
broad match: http://cv.iptc.org/newscodes/subjectcode/17003001

Wetterstatistik
type: Concept
definition: Numerische Daten über das Wetter, wie etwa Temperatur, Luftdruck, Luftfeuchtigkeit, Wasserstände, auch von Flut und Ebbe.
in scheme: mediatopic
created: 2009-10-22T02:00:00+00:00
modified: 2021-02-18T12:00:00+00:00
broader: Wetter

Unwetterwarnung
type: Concept
definition: Warnungen an die Bevölkerung eines bestimmten Gebietes vor heranziehendem Unwetter
in scheme: mediatopic
created: 2009-10-22T02:00:00+00:00
modified: 2021-02-18T12:00:00+00:00
broader: Wetter

Animation
type: Concept
definition: Erzählung in Form von Computergrafik, als Langfilm oder Kurzfilm
in scheme: mediatopic
created: 2009-10-22T02:00:00+00:00
modified: 2021-03-15T12:00:00+00:00
broader: Kunst und Unterhaltung

Comic
type: Concept
definition: Zeichnungen, wie Karikaturen und Comics, die oft Humor und Satire ausdrücken.
in scheme: mediatopic
created: 2009-10-22T02:00:00+00:00
modified: 2021-02-18T12:00:00+00:00
broader: Kunst und Unterhaltung

Film
type: Concept
definition: Erzählungen oder Berichte in Form eines Films, zum Beispiel Kurz- oder Langformen von Dokumentationen oder Spielfilmen
in scheme: mediatopic
created: 2009-10-22T02:00:00+00:00
modified: 2021-02-18T12:00:00+00:00
broader: Kunst und Unterhaltung

Tanz
type: Concept
definition: Eine Form der darstellenden Kunst, die aus gezielt ausgewählten Abfolgen von menschlicher Bewegung besteht
in scheme: mediatopic
created: 2009-10-22T02:00:00+00:00
modified: 2021-02-18T12:00:00+00:00
broader: Kunst und Unterhaltung
narrower: Ballett
narrower: Modern Dance
narrower: Standardtanz

Mode
type: Concept
definition: Stile und Trends von Kleidung, Fußbekleidung, Modezubehör, inklusive deren Entwürfe, Präsentation und Nutzung
in scheme: mediatopic
created: 2009-10-22T02:00:00+00:00
modified: 2021-02-18T12:00:00+00:00
broader: Kunst und Unterhaltung
narrower: Schmuck
narrower: Kosmetik
narrower: Friseur

Literatur
type: Concept
definition: Das Erzählen einer Geschichte in Schriftform
in scheme: mediatopic
created: 2009-10-22T02:00:00+00:00
modified: 2021-02-18T12:00:00+00:00
broader: Kunst und Unterhaltung
narrower: Drama (Literatur)
narrower: Fiktion
narrower: Non-Fiktion
narrower: Poesie

Musik
type: Concept
definition: Eine Form der darstellenden Kunst, die Instrumente oder Stimmen verwendet um unterschiedliche Klänge, Töne und Harmonien hörbar zu machen
in scheme: mediatopic
created: 2009-10-22T02:00:00+00:00
modified: 2021-02-18T12:00:00+00:00
broader: Kunst und Unterhaltung
narrower: Musikinstrument
narrower: Musikaufführung
narrower: Musikgenre

Theater
type: Concept
definition: Ein Form der darstellenden Kunst bei der Künstler eine Erzählung vor dem Publikum durch Dialog und Aktivitäten vermitteln
in scheme: mediatopic
created: 2009-10-22T02:00:00+00:00
modified: 2021-02-18T12:00:00+00:00
broader: Kunst und Unterhaltung
narrower: Oper
narrower: Musiktheater
narrower: Musical
narrower: Operette
narrower: Drama (Theater)
narrower: Stand-Up-Comedy
narrower: Cabaret

Bildende Kunst
type: Concept
definition: Kunstform, die vorrangig die visuellen Sinne anspricht, wie zum Beispiel Keramik, Zeichnungen, Malerei, Bildhauerei, Kunstdrucke, Fotografie, Video, Filme und Architektur
in scheme: mediatopic
created: 2009-10-22T02:00:00+00:00
modified: 2021-02-18T12:00:00+00:00
broader: Kunst und Unterhaltung
narrower: Architektur
narrower: Design (Bildende Kunst)
narrower: Zeichnen
narrower: Malerei
narrower: Fotografie
narrower: Bildhauerei
narrower: Textilkunst
narrower: Schreinern
narrower: Schmieden
broad match: http://cv.iptc.org/newscodes/subjectcode/01000000

Serie
type: Concept
definition: Eine Abfolge mehrerer Episoden von fiktiven oder dokumentarischen Inhalten die unter demselben Titel präsentiert werden
in scheme: mediatopic
created: 2017-11-16T12:00:00+00:00
modified: 2021-07-12T12:00:00+00:00
broader: Kunst und Unterhaltung

Festival
type: Concept
definition: Veranstaltungen bei der künstlerische Werke präsentiert werden, wie Tanz-, Musik-, Theater- oder Literaturfestivals. Sie finden meist regelmäßig statt.
in scheme: mediatopic
created: 2018-04-09T12:00:00+00:00
modified: 2021-07-12T12:00:00+00:00
broader: Kunst und Unterhaltung
narrower: Filmfestival

Filmfestival
type: Concept
definition: Alle Arten von nationalen und internationalen Filmfestivals
in scheme: mediatopic
created: 2009-10-22T02:00:00+00:00
modified: 2021-02-18T12:00:00+00:00
broader: Festival

Ballett
type: Concept
definition: Eine klassische Tanzform auf der Grundlage vorgegebener Bewegungen, Schrittfolgen und Körperhaltungen
in scheme: mediatopic
created: 2009-10-22T02:00:00+00:00
modified: 2021-02-18T12:00:00+00:00
broader: Tanz
broad match: http://cv.iptc.org/newscodes/subjectcode/01006000

Modern Dance
type: Concept
definition: Ein theatralischer Tanzstil, mehr geprägt von freiem Ausdruck als von vorgegebenen Bewegungen
in scheme: mediatopic
created: 2009-10-22T02:00:00+00:00
modified: 2021-02-18T12:00:00+00:00
broader: Tanz
broad match: http://cv.iptc.org/newscodes/subjectcode/01006000

Standardtanz
type: Concept
definition: Ein Tanzstild der das Leben und die Kultur einer bestimmten Gruppe von Menschen wiederspiegelt, so etwa der Volkstanz und Festtänze
in scheme: mediatopic
created: 2009-10-22T02:00:00+00:00
modified: 2021-02-18T12:00:00+00:00
broader: Tanz
broad match: http://cv.iptc.org/newscodes/subjectcode/01006000

Schmuck
type: Concept
definition: Dekorative Objekte, die als Ausdruck von Persönlichkeit und zur Verschönerung getragen werden, zum Beispiel Ringe, Halsketten oder Ohrringe
in scheme: mediatopic
created: 2009-10-22T02:00:00+00:00
modified: 2021-02-18T12:00:00+00:00
broader: Mode

Kosmetik
type: Concept
definition: Produkte, die zur Verbesserung des Aussehens auf den Körper aufgetragen werden, wie Lippenstift, Eyeliner, Grundierung und Nagellack, sowie die Trends bei der Anwendung dieser Produkte
in scheme: mediatopic
created: 2019-07-30T12:00:00+00:00
modified: 2021-07-12T12:00:00+00:00
broader: Mode

Friseur
type: Concept
definition: Trends rund um das Schneiden und Styling von Haaren.
in scheme: mediatopic
created: 2019-07-30T12:00:00+00:00
modified: 2021-07-12T12:00:00+00:00
broader: Mode

Drama (Literatur)
type: Concept
definition: Ein Werk, das geschrieben wurde um auf einer Bühne aufgeführt zu werden.
in scheme: mediatopic
created: 2009-10-22T02:00:00+00:00
modified: 2021-02-18T12:00:00+00:00
broader: Literatur
broad match: http://cv.iptc.org/newscodes/subjectcode/01010000

Fiktion
type: Concept
definition: Schriftliche Werke, die nicht auf Fakten beruhen, sondern aus der Vorstellungskraft des Autors entstehen
in scheme: mediatopic
created: 2009-10-22T02:00:00+00:00
modified: 2021-02-18T12:00:00+00:00
broader: Literatur

Non-Fiktion
type: Concept
definition: Schriftliche Werke, die auf Fakten beruhen
in scheme: mediatopic
created: 2009-10-22T02:00:00+00:00
modified: 2021-02-18T12:00:00+00:00
broader: Literatur
broad match: http://cv.iptc.org/newscodes/subjectcode/01010000

Poesie
type: Concept
definition: Schriftliche Werke, die auf die Ästhetik und die Rythmik von Sprache bauen um eine Botschaft oder Gefühle auszudrücken
in scheme: mediatopic
created: 2009-10-22T02:00:00+00:00
modified: 2021-02-18T12:00:00+00:00
broader: Literatur

Musikinstrument
type: Concept
definition: Objekte, mit denen Musik erzeugt werden kann
in scheme: mediatopic
created: 2009-10-22T02:00:00+00:00
modified: 2021-02-18T12:00:00+00:00
broader: Musik
broad match: http://cv.iptc.org/newscodes/subjectcode/01011000

Musikaufführung
type: Concept
definition: Musiker die vor einem Publikum spielen um dieses zu unterhalten
in scheme: mediatopic
created: 2009-10-22T02:00:00+00:00
modified: 2021-02-18T12:00:00+00:00
broader: Musik
broad match: http://cv.iptc.org/newscodes/subjectcode/01011000

Musikgenre
type: Concept
definition: Eine unterscheidbare Gattung von Musik
in scheme: mediatopic
created: 2009-10-22T02:00:00+00:00
modified: 2021-02-18T12:00:00+00:00
broader: Musik
narrower: Klassik
narrower: Country
narrower: Folk
narrower: Jazz
narrower: Pop
narrower: Rock'n' Roll
narrower: Hip Hop
narrower: Rhythm & Blues
narrower: Heavy Metal
narrower: Tanzbandmusik (Schweden)
narrower: Elektronische Tanzmusik
narrower: Kinderlieder
broad match: http://cv.iptc.org/newscodes/subjectcode/01011000

Klassik
type: Concept
definition: Eine Gattung von Musik, die auf Traditionen westlicher Musik basiert und sowohl religiöse als auch weltliche Musik umfasst, zum Beispiel Symphonien, Konzerte oder Sonaten
in scheme: mediatopic
created: 2009-10-22T02:00:00+00:00
modified: 2021-02-18T12:00:00+00:00
broader: Musikgenre

Country
type: Concept
definition: Eine Gattung von Musik, die aus den südlichen USA stammt, meisten in Form von Balladen oder Tanzmusik unter Verwendung von Instrumenten wie Banjos, Geigen und Gitarren.
in scheme: mediatopic
created: 2009-10-22T02:00:00+00:00
modified: 2021-02-18T12:00:00+00:00
broader: Musikgenre

Folk
type: Concept
definition: Eine Gattung von Musik, die sich aus überlieferten populären Kulturformen entwickelt hat, meist auf dem Erzählen von Geschichten basierend
in scheme: mediatopic
created: 2009-10-22T02:00:00+00:00
modified: 2021-02-18T12:00:00+00:00
broader: Musikgenre

Jazz
type: Concept
definition: Ein Gattung von Musik mit Wurzeln in Blues und Ragtime, die aus afro-amerikanischen Gemeinden in New Orleans (USA) im späten 19. und frühen 20. Jahrhundert hervorging
in scheme: mediatopic
created: 2009-10-22T02:00:00+00:00
modified: 2021-02-18T12:00:00+00:00
broader: Musikgenre

Pop
type: Concept
definition: Eine Gattung von Musik, die von vielen Gruppen in der Bevölkerung gehört wird und darauf abzielt, möglichst viele anzusprechen
in scheme: mediatopic
created: 2009-10-22T02:00:00+00:00
modified: 2021-02-18T12:00:00+00:00
broader: Musikgenre

Rock'n' Roll
type: Concept
definition: Eine Gattung einer Musik, die aus den USA der 1940er und 1950er Jahre stammt, entwickelt aus afroamerikanischen Musikstilen wie den Gospels, Jump Blues, Jazz, Boogie Woogie und Rythm and Blues
in scheme: mediatopic
created: 2009-10-22T02:00:00+00:00
modified: 2021-02-18T12:00:00+00:00
broader: Musikgenre

Hip Hop
type: Concept
definition: Ein Musikgenre, das in den 1970er Jahren in afroamerikanischen Gemeinden in den Vereinigten Staaten entwickelt wurde und aus Rap besteht, der gewöhnlich mit elektronischer Unterstützung gespielt wird.
in scheme: mediatopic
created: 2019-04-06T12:00:00+00:00
modified: 2021-07-12T12:00:00+00:00
broader: Musikgenre

Rhythm & Blues
type: Concept
definition: Eine Musikgattung, die in den 1940er Jahren in afroamerikanischen Gemeinschaften entstand und sich durch gefühlvollen Gesang auszeichnet.
in scheme: mediatopic
created: 2019-04-06T12:00:00+00:00
modified: 2021-07-12T12:00:00+00:00
broader: Musikgenre

Heavy Metal
type: Concept
definition: Ein Genre der lauten, aggressiven Rockmusik, das in den späten 1960er und frühen 1970er Jahren entwickelt wurde.
in scheme: mediatopic
created: 2019-04-06T12:00:00+00:00
modified: 2021-07-12T12:00:00+00:00
broader: Musikgenre

Tanzbandmusik (Schweden)
type: Concept
definition: Eine schwedische Musikgattung, die sich durch eine von Swing, Schlager, Country, Jazz und Rock inspirierte Musik auszeichnet, zu der oft paarweise getanzt wird
in scheme: mediatopic
created: 2019-04-06T12:00:00+00:00
modified: 2021-07-12T12:00:00+00:00
broader: Musikgenre

Elektronische Tanzmusik
type: Concept
definition: Ein Musikgenre, das elektronische Instrumente einsetzt und hauptsächlich für Nachtclubs, Raves und Festivals gemacht ist.
in scheme: mediatopic
created: 2019-04-06T12:00:00+00:00
modified: 2021-07-12T12:00:00+00:00
broader: Musikgenre

Kinderlieder
type: Concept
definition: Ein Musikgenre mit Liedern, die für Kinder komponiert und aufgeführt werden.
in scheme: mediatopic
created: 2019-04-06T12:00:00+00:00
modified: 2021-07-12T12:00:00+00:00
broader: Musikgenre

Oper
type: Concept
definition: Eine Form der darstellenden Kunst bei der Musiker und Sänger mit Ausbildung in klassischer Musik ein vertontes dramaturgisches Werk aufführen
in scheme: mediatopic
created: 2009-10-22T02:00:00+00:00
modified: 2021-09-30T12:00:00+00:00
broader: Theater
broad match: http://cv.iptc.org/newscodes/subjectcode/01017001

Musiktheater
type: Concept
definition: Ein Form der darstellenden Kunst, bei der Künstler eine Erzählung vor dem Publikum durch Lieder, Dialog und Aktivitäten vermitteln, wie etwa in Musicals und Operetten
in scheme: mediatopic
created: 2009-10-22T02:00:00+00:00
retired: 2021-09-30T12:00:00+00:00
modified: 2021-09-30T12:00:00+00:00
broader: Theater

Musical
type: Concept
definition: Eine Gattung von Musiktheater, in der das Singen und Tanzen ein wesentlicher Teil des Erzählens einer Geschichte sind.
in scheme: mediatopic
created: 2012-10-04T12:00:00+00:00
modified: 2021-09-30T12:00:00+00:00
broader: Theater

Operette
type: Concept
definition: Ein Gattung von Musiktheater, die meist ein leichtes und humorvolles Thema hat und bei der ein Teil des Librettos gesprochen und nicht gesungen wird
in scheme: mediatopic
created: 2012-10-04T12:00:00+00:00
modified: 2021-09-30T12:00:00+00:00
broader: Theater

Drama (Theater)
type: Concept
definition: Eine Gattung von Theater bei der dramatische oder unterhaltende Stücke auf einer Bühne aufgeführt werden.
in scheme: mediatopic
created: 2018-04-09T12:00:00+00:00
modified: 2021-07-12T12:00:00+00:00
broader: Theater

Stand-Up-Comedy
type: Concept
definition: Ein Comic-Stil, bei dem ein Komiker eine Reihe von Witzen oder Geschichten vor einem Live-Publikum vorträgt, wobei er sich in der Regel direkt an das Publikum wendet.
in scheme: mediatopic
created: 2019-04-06T12:00:00+00:00
modified: 2021-07-12T12:00:00+00:00
broader: Theater

Cabaret
type: Concept
definition: Eine Form der theatralischen Unterhaltung mit Musik, Gesang, Tanz, Rezitation oder Drama, die in einem Nachtclub oder Restaurant aufgeführt wird, während das Publikum an Tischen isst oder trinkt.
in scheme: mediatopic
created: 2019-04-06T12:00:00+00:00
modified: 2021-09-30T12:00:00+00:00
broader: Theater

Architektur
type: Concept
definition: Entwurf und Gestaltung von Gebäuden, Denkmälern und deren Umgebung
in scheme: mediatopic
created: 2009-10-22T02:00:00+00:00
modified: 2021-02-18T12:00:00+00:00
broader: Bildende Kunst

Design (Bildende Kunst)
type: Concept
definition: Eine Kunstdisziplin, die sich auf visuelle Kommunikation und Präsentation konzentriert, die daraus hervorgehenden Produkte reichen von Schmuckstücken bis zur Wohnraumgestaltung
in scheme: mediatopic
created: 2009-10-22T02:00:00+00:00
modified: 2021-02-18T12:00:00+00:00
broader: Bildende Kunst
broad match: http://cv.iptc.org/newscodes/subjectcode/01000000

Zeichnen
type: Concept
definition: Ein Form der bildenden Künste die sich auf die Verwendung von Bleistiften, Filzstiften, Federn und Tinte sowie Holzkohle konzentriert
in scheme: mediatopic
created: 2009-10-22T02:00:00+00:00
modified: 2021-02-18T12:00:00+00:00
broader: Bildende Kunst
broad match: http://cv.iptc.org/newscodes/subjectcode/01000000

Malerei
type: Concept
definition: Eine Form der bildenden Künste die sich auf die Verwendung von Ölfarbe, Wasserfarbe, Pastelkreide und anderen Farbstoffen konzentriert
in scheme: mediatopic
created: 2009-10-22T02:00:00+00:00
modified: 2021-02-18T12:00:00+00:00
broader: Bildende Kunst

Fotografie
type: Concept
definition: Eine Form der bildenden Künste, die fotografische Bilder verwendet
in scheme: mediatopic
created: 2009-10-22T02:00:00+00:00
modified: 2021-02-18T12:00:00+00:00
broader: Bildende Kunst

Bildhauerei
type: Concept
definition: Eine Form der bildenden Künste, die sich auf die Verwendung von Lehm, Stein, Holz und Metall zur Herstellung dreidimensionaler Werke konzentriert
in scheme: mediatopic
created: 2009-10-22T02:00:00+00:00
modified: 2021-05-05T12:00:00+00:00
broader: Bildende Kunst

Textilkunst
type: Concept
definition: Kunsthandwerk, bei dem pflanzliche, tierische oder synthetische Fasern zur Herstellung praktischer oder dekorativer Gegenstände verwendet werden
in scheme: mediatopic
created: 2019-04-06T12:00:00+00:00
modified: 2021-07-12T12:00:00+00:00
broader: Bildende Kunst

Schreinern
type: Concept
definition: Die Tätigkeit oder Fähigkeit, Gegenstände wie Möbel oder Schränke aus Holz herzustellen
in scheme: mediatopic
created: 2019-04-06T12:00:00+00:00
modified: 2021-07-12T12:00:00+00:00
broader: Bildende Kunst

Schmieden
type: Concept
definition: Die Formgebung von Metall mit Hilfe von lokalisierten Druckkräften, wie Erwärmung und Hämmern
in scheme: mediatopic
created: 2019-04-06T12:00:00+00:00
modified: 2021-07-12T12:00:00+00:00
broader: Bildende Kunst

Kulturgeschichte
type: Concept
definition: Die Geschichte der Entwicklung von Kunst und Kultur, wie beispielsweise die Entstehung der Höhlenmalerei, die Änderungen in der Sprache über die Zeit hinweg, die Entwicklung von Werten.
in scheme: mediatopic
created: 2009-10-22T02:00:00+00:00
modified: 2021-02-18T12:00:00+00:00
broader: Kultur

Brauchtum
type: Concept
definition: Eine spezielle Verhaltensweise oder ein Brauch, die sich für eine bestimmte Gruppe von Menschen über einen Zeitraum entwickelt haben
in scheme: mediatopic
created: 2009-10-22T02:00:00+00:00
modified: 2021-02-18T12:00:00+00:00
broader: Kultur

Fest (Kultur)
type: Concept
definition: Ein Ereignis, das von einer Gruppe gefeiert wird und das sich auf eine charakteristische Eigenschaft der Gruppe oder ihrer Religion oder Gebräuche konzentriert
in scheme: mediatopic
created: 2009-10-22T02:00:00+00:00
modified: 2021-02-18T12:00:00+00:00
broader: Kultur

Sprache
type: Concept
definition: Eine Form menschlicher Kommunikation, entweder gesprochen oder geschrieben, in der Wörter in einer strukturierten und allgemein gebräuchlichen Form verwendet werden
in scheme: mediatopic
created: 2009-10-22T02:00:00+00:00
modified: 2021-02-18T12:00:00+00:00
broader: Kultur

Bibliothek und Museum
type: Concept
definition: Einrichtungen, die Sammlungen von Büchern, Musik, Kunst oder Objekten aus der Vergangenheit beherbergen und wahlweise der Öffentlichkeit zur Besichtigung und Nutzung öffnen
in scheme: mediatopic
created: 2009-10-22T02:00:00+00:00
modified: 2021-05-05T12:00:00+00:00
broader: Kultur

Denkmal und Gedenkstätte
type: Concept
definition: Erinnerungen an historische Personen, Ereignisse in Form von Skulpturen, Statuen, und Bauten, sowie Stätten die sie umfassen
in scheme: mediatopic
created: 2009-10-22T02:00:00+00:00
modified: 2021-05-05T12:00:00+00:00
broader: Kultur
narrower: Sanierung

Kunstausstellung
type: Concept
definition: Zeitlich begrenzte Präsentation von Kunst in einem Museum, einer Kunsthalle oder Galerie
in scheme: mediatopic
created: 2012-10-04T12:00:00+00:00
modified: 2023-03-31T12:00:00+00:00
broader: Kultur

Sanierung
type: Concept
definition: Wiederherstellung von Eigentum/Bauwerken in einen ehemaligen Zustand durch Reinigung, Reparatur oder Wiederaufbau
in scheme: mediatopic
created: 2009-10-22T02:00:00+00:00
modified: 2023-03-31T12:00:00+00:00
broader: Denkmal und Gedenkstätte

Nachrichtensender
type: Concept
definition: Die Präsentation von Nachrichten gegenüber der Öffentlichkeit in unterschiedlichen Formen wie Fernsehen, Radion, Zeitungen, Magazinen, Webseiten oder Blogs
in scheme: mediatopic
created: 2009-10-22T02:00:00+00:00
modified: 2021-02-18T12:00:00+00:00
broader: Massenmedien

Zeitung
type: Concept
definition: Eine täglich oder wöchentlich erscheinende Publikation, die Lokal-, Regional- oder Weltnachrichten präsentiert sowie Features, Meinungsspalten, Comics und weitere Inhalte
in scheme: mediatopic
created: 2009-10-22T02:00:00+00:00
modified: 2021-02-18T12:00:00+00:00
broader: Massenmedien

Online Medien
type: Concept
definition: Eine Publikation, die Inhalte wie Artikel, Blogs, Fotos, Videos oder Musik über das Internet verbreitet.
in scheme: mediatopic
created: 2009-10-22T02:00:00+00:00
modified: 2021-05-05T12:00:00+00:00
broader: Massenmedien
broad match: http://cv.iptc.org/newscodes/subjectcode/01026000

Zeitschrift
type: Concept
definition: Eine Publikation, die üblicherweise wöchentlich, vierzehntägig, monatlich, quartalsweise oder jährlich erscheint, wie zum Beispiel Magazine, Zeitschriften oder Rundbriefe
in scheme: mediatopic
created: 2009-10-22T02:00:00+00:00
modified: 2021-02-18T12:00:00+00:00
broader: Massenmedien

Radio
type: Concept
definition: Die hörbare Form von Nachrichten, Unterhaltung oder Information, die über Rundfunk oder das Internet verbreitet wird.
in scheme: mediatopic
created: 2009-10-22T02:00:00+00:00
modified: 2021-02-18T12:00:00+00:00
broader: Massenmedien

Fernsehen
type: Concept
definition: Die sicht- und hörbare Videoform von Nachrichten, Unterhaltung oder Information, die über Rundfunk oder das Internet verbreitet wird.
in scheme: mediatopic
created: 2009-10-22T02:00:00+00:00
modified: 2021-02-18T12:00:00+00:00
broader: Massenmedien

Soziale Medien
type: Concept
definition: Inhalte, die geschaffen wurden um über soziale Netze des Internets verbreitet zu werden
in scheme: mediatopic
created: 2018-04-09T12:00:00+00:00
modified: 2021-07-12T12:00:00+00:00
broader: Massenmedien
narrower: Influencer

Desinformation und Fehlinformation
type: Concept
definition: Die Verbreitung von Falschinformationen unabhängig von der Absicht
in scheme: mediatopic
created: 2021-02-18T12:00:00+00:00
modified: 2021-07-12T12:00:00+00:00
broader: Massenmedien

Bioterrorismus
type: Concept
definition: Einsatz von biologischen Kampfstoffen, um Angst innerhalb der Bevölkerung auszulösen
in scheme: mediatopic
created: 2009-10-22T02:00:00+00:00
modified: 2021-02-18T12:00:00+00:00
broader: Terroranschlag

Bombenattentat
type: Concept
definition: Geplanter Einsatz von Sprengkörpern gegen Menschen, Gebäude oder andere Objekte
in scheme: mediatopic
created: 2009-10-22T02:00:00+00:00
modified: 2023-03-31T12:00:00+00:00
broader: Terroranschlag

Guerilla
type: Concept
definition: Regierungsfeindliche oder kriegerische Aktionen von Untergrundgruppen oder anderen nicht-staatlichen Kämpfern, in denen oft Hinterhalte, Sabotage, Überfälle oder Entführungen eingesetzt werden
in scheme: mediatopic
created: 2009-10-22T02:00:00+00:00
modified: 2021-02-18T12:00:00+00:00
broader: Bewaffneter Konflikt

Internationale militärische Intervention
type: Concept
definition: Zeitlich begrenzter Einsatz von internationalen Streitkräften in einem Land oder einer Region, welche(s) Hilfe von außen benötigt, zur Lösung einer Krise
in scheme: mediatopic
created: 2009-10-22T02:00:00+00:00
modified: 2021-02-18T12:00:00+00:00
broader: Bewaffneter Konflikt

Militärische Besetzung
type: Concept
definition: Die möglichst zeitlich begrenzte, gewaltsame Übernahme eines Landes oder einer Region durch den Einmarsch von Militärstreitkräften
in scheme: mediatopic
created: 2009-10-22T02:00:00+00:00
modified: 2021-02-18T12:00:00+00:00
broader: Bewaffneter Konflikt
broad match: http://cv.iptc.org/newscodes/subjectcode/16000000

Krieg
type: Concept
definition: Eine formale Feindschaftserklärung des einen Landes gegen ein anderes
in scheme: mediatopic
created: 2009-10-22T02:00:00+00:00
modified: 2021-02-18T12:00:00+00:00
broader: Bewaffneter Konflikt
narrower: Bürgerkrieg
narrower: Kriegsverbrechen

Friedenstruppe
type: Concept
definition: Militärstreitkräfte eines Landes oder mehrerer Länder, deren Aufgabe es ist, sich für den Frieden in einem Gebiet einzusetzen
in scheme: mediatopic
created: 2009-10-22T02:00:00+00:00
modified: 2024-03-28T12:00:00+00:00
broader: Friedensprozess

Kriegsvermisste
type: Concept
definition: Zivilisten und Soldaten, die nach Feindseligkeiten, einem Konflikt oder einer kriegerischen Auseinandersetzung vermisst werden
in scheme: mediatopic
created: 2009-10-22T02:00:00+00:00
modified: 2024-07-01T12:00:00+00:00
broader: Kriegsopfer

Bürgerkrieg
type: Concept
definition: Bewaffnete Auseinandersetzung zwischen den Bewohnern eines Landes oder einer seiner Regionen, in einigen Fällen mit dem Ziel deren Aufteilung
in scheme: mediatopic
created: 2009-10-22T02:00:00+00:00
modified: 2021-02-18T12:00:00+00:00
broader: Krieg

Kriegsverbrechen
type: Concept
definition: Kriminelle Handlungen und deren Strafverfolgung, die während eines Krieges oder bewaffneten Konfliktes begangen werden, gewöhnlich gegen Zivilisten oder Kriegsgefangene
in scheme: mediatopic
created: 2009-10-22T02:00:00+00:00
retired: 2016-04-05T12:00:00+00:00
modified: 2021-05-05T12:00:00+00:00
broader: Krieg

Demonstration
type: Concept
definition: Gewaltfrei und öffentlich geäußerte Kritik an einer Sache, Idee oder Politik in Form einer Massenveranstaltung.
in scheme: mediatopic
created: 2009-10-22T02:00:00+00:00
modified: 2026-07-02T12:00:00+00:00
broader: Unruhen

Rebellion
type: Concept
definition: Organisierte Aktionen zum Widerspruch gegen eine Regierung oder regierende Partei durch die Bewohner eines Landes, oft gewalttätig und mit dem Ziel eines Regierungsumsturzes
in scheme: mediatopic
created: 2009-10-22T02:00:00+00:00
modified: 2021-02-18T12:00:00+00:00
broader: Unruhen

Revolution
type: Concept
definition: Ein oft gewalttätiger Wechsel oder Umsturz der Regierung eines Landes oder von dessen politischen System durch Kräfte aus dem Land um ein neues System durchzusetzen.
in scheme: mediatopic
created: 2009-10-22T02:00:00+00:00
modified: 2021-02-18T12:00:00+00:00
broader: Unruhen

Ausschreitung
type: Concept
definition: Gewalttätige, zerstörerische Aktionen des zivilen Ungehorsams durch Personengruppen, oft in Reaktion auf einen Missstand oder als aktiver Widerstand, meist mit Verletzungen von Personen verbunden
in scheme: mediatopic
created: 2009-10-22T02:00:00+00:00
modified: 2021-02-18T12:00:00+00:00
broader: Unruhen

Völkermord
type: Concept
definition: Systematisches Töten einer Glaubensgemeinschaft, eines Volkstammes oder einer ethnischen Gruppe durch eine andere
in scheme: mediatopic
created: 2009-10-22T02:00:00+00:00
modified: 2024-03-28T12:00:00+00:00
broader: Kriminalität

Friedensverhandlung
type: Concept
definition: Person oder Organisation, die einen Friedensprozess einleitet und begleitet
in scheme: mediatopic
created: 2009-10-22T02:00:00+00:00
modified: 2021-07-12T12:00:00+00:00
broader: Friedensprozess
broad match: http://cv.iptc.org/newscodes/subjectcode/11002003

Friedensplan
type: Concept
definition: Eine Strategie um Frieden wiederherzustellen in einem Kriegs- oder Konfliktgebiet
in scheme: mediatopic
created: 2009-10-22T02:00:00+00:00
modified: 2021-02-18T12:00:00+00:00
broader: Friedensprozess
broad match: http://cv.iptc.org/newscodes/subjectcode/11002003

Friedensgespräche
type: Concept
definition: Gespräche zwischen Ländern, und Weltregionen die miteinander im Konflikt oder Krieg sind, um wieder Frieden zu erreichen
in scheme: mediatopic
created: 2009-10-22T02:00:00+00:00
modified: 2021-05-05T12:00:00+00:00
broader: Friedensprozess
broad match: http://cv.iptc.org/newscodes/subjectcode/11002003

Abrüstung
type: Concept
definition: Die Abschaffung oder Reduzierung des Bestandes an militärischen Waffen eines Landes
in scheme: mediatopic
created: 2009-10-22T02:00:00+00:00
modified: 2024-03-28T12:00:00+00:00
broader: Friedensprozess
broad match: http://cv.iptc.org/newscodes/subjectcode/11002000

Kampfmittelbeseitigung
type: Concept
definition: Das Entfernen oder Entschärfen von Waffen, wie Landminen oder Streubomben, die nach einem Krieg oder bewaffneten Konflikt auf öffentlichem Grund noch vorhanden sind.
in scheme: mediatopic
created: 2009-10-22T02:00:00+00:00
modified: 2021-02-18T12:00:00+00:00
broader: Wiederaufbau

Kriegsgefangene
type: Concept
definition: Menschen, die während eines Krieges oder eines bewaffneten Konflikts von den Gegnern gefangen gehalten werden
in scheme: mediatopic
created: 2009-10-22T02:00:00+00:00
modified: 2024-03-28T12:00:00+00:00
broader: Kriegsopfer

Brandstiftung
type: Concept
definition: Absichtliches in Brand stecken mit krimineller Intention
in scheme: mediatopic
created: 2009-10-22T02:00:00+00:00
modified: 2021-02-18T12:00:00+00:00
broader: Kriminalität

Gewalt
type: Concept
definition: Körperverletzung von Personen, Prügeleien, Streit und bedrohliches Verhalten
in scheme: mediatopic
created: 2009-10-22T02:00:00+00:00
modified: 2021-02-18T12:00:00+00:00
broader: Kriminalität
narrower: Sexuelle Gewalt

Computerkriminalität
type: Concept
definition: Diebstahl oder zerstörerisches Verhalten mithilfe eines Computers
in scheme: mediatopic
created: 2009-10-22T02:00:00+00:00
modified: 2023-03-31T12:00:00+00:00
broader: Kriminalität

Firmenkriminalität
type: Concept
definition: Untaten von Unternehmen oder Geschäftsführungen
in scheme: mediatopic
created: 2009-10-22T02:00:00+00:00
modified: 2021-02-18T12:00:00+00:00
broader: Kriminalität
narrower: Kartellverstoß
narrower: Vertragsbruch
narrower: Unterschlagung
narrower: Insiderhandel
narrower: Wettbewerbsverstoß
narrower: Wirtschaftskriminalität

Korruption
type: Concept
definition: Generelles Missverhalten in Geschäftsbeziehungen
in scheme: mediatopic
created: 2009-10-22T02:00:00+00:00
modified: 2021-02-18T12:00:00+00:00
broader: Kriminalität
narrower: Bestechung

Drogenkriminalität
type: Concept
definition: Alle Arten von Kriminalität im Zusammenhang mit Drogen
in scheme: mediatopic
created: 2009-10-22T02:00:00+00:00
modified: 2021-02-18T12:00:00+00:00
broader: Kriminalität
narrower: Drogenhandel
broad match: http://cv.iptc.org/newscodes/subjectcode/02001000

Betrug
type: Concept
definition: Absichtliche Täuschung, die die Rechte und das Eigentum anderer beschädigen
in scheme: mediatopic
created: 2009-10-22T02:00:00+00:00
modified: 2021-02-18T12:00:00+00:00
broader: Kriminalität
narrower: Steuerhinterziehung

Entführung
type: Concept
definition: Übernahme eines Transportfahrzeuges mit Gewalt
in scheme: mediatopic
created: 2009-10-22T02:00:00+00:00
modified: 2021-02-18T12:00:00+00:00
broader: Kriminalität
broad match: http://cv.iptc.org/newscodes/subjectcode/02001000

Mord
type: Concept
definition: Tod eines Menschen durch einen anderen
in scheme: mediatopic
created: 2009-10-22T02:00:00+00:00
modified: 2021-03-31T12:00:00+00:00
broader: Kriminalität

Geiselnahme
type: Concept
definition: Jemanden gegen seinen Willen widerrechtlich und gewaltsam gefangen nehmen, festhalten oder verschleppen
in scheme: mediatopic
created: 2009-10-22T02:00:00+00:00
modified: 2021-02-18T12:00:00+00:00
broader: Kriminalität

Organisierte Kriminalität
type: Concept
definition: Kriminelle Handlungen, die von Banden oder kriminellen Gruppen begangen wurden
in scheme: mediatopic
created: 2009-10-22T02:00:00+00:00
modified: 2021-02-18T12:00:00+00:00
broader: Kriminalität
narrower: Bandenkriminalität

Terrorismus
type: Concept
definition: Gewalt gegen Menschen, um Angst auszulösen mit der Absicht bestimmte politische oder ideologische Ziele zu erreichen
in scheme: mediatopic
created: 2009-10-22T02:00:00+00:00
modified: 2021-02-18T12:00:00+00:00
broader: Kriminalität

Diebstahl
type: Concept
definition: Ungesetzliche Beschaffung
in scheme: mediatopic
created: 2009-10-22T02:00:00+00:00
modified: 2021-05-05T12:00:00+00:00
broader: Kriminalität

Kriegsverbrechen
type: Concept
definition: Kriminelle Handlungen und deren Strafverfolgung, die während eines Krieges oder bewaffneten Konfliktes begangen werden, gewöhnlich gegen Zivilisten oder Kriegsgefangene
in scheme: mediatopic
created: 2009-10-22T02:00:00+00:00
modified: 2024-03-28T12:00:00+00:00
broader: Kriminalität

Verkehrsdelikte
type: Concept
definition: Schwere Verkehrsverstöße, die zur Gefährdung, Verletzung oder zum Tod einer Person oder von Personen oder zur Gefährdung oder zu erheblichen Sachschäden führen können oder geführt haben.
in scheme: mediatopic
created: 2019-04-06T12:00:00+00:00
modified: 2021-07-12T12:00:00+00:00
broader: Kriminalität

Menschenhandel
type: Concept
definition: Die illegale Beförderung von Menschen von einem Land oder Gebiet in ein anderes. Wenn das Ergebnis Zwangsarbeit oder sexuelle Ausbeutung ist, gilt das Verbrechen als Menschenhandel.
in scheme: mediatopic
created: 2019-11-20T12:00:00+00:00
modified: 2021-07-12T12:00:00+00:00
broader: Kriminalität

Vandalismus
type: Concept
definition: Absichtliches Beschädigen oder Zerstören von öffentlichem oder privatem Eigentum
in scheme: mediatopic
created: 2019-11-20T12:00:00+00:00
modified: 2021-07-12T12:00:00+00:00
broader: Kriminalität

Schießerei
type: Concept
definition: Eine Gewalttat, die von Einzelpersonen unter Verwendung von bewaffneten Waffen begangen wird
in scheme: mediatopic
created: 2021-02-18T12:00:00+00:00
modified: 2021-07-12T12:00:00+00:00
broader: Kriminalität

Tierquälerei
type: Concept
definition: Die Zufügung von Grausamkeit oder Vernachlässigung von Tieren durch Menschen
in scheme: mediatopic
created: 2021-02-18T12:00:00+00:00
modified: 2021-07-12T12:00:00+00:00
broader: Kriminalität

Folter
type: Concept
definition: Absichtliche Zufügung schwerer körperlicher oder seelischer Schmerzen, um das Opfer zu bestrafen oder es zu einer Handlung oder Auskunft zu bewegen
in scheme: mediatopic
created: 2021-05-05T12:00:00+00:00
modified: 2021-12-21T12:00:00+00:00
broader: Kriminalität

Sexuelle Gewalt
type: Concept
definition: Sexuelle Nötigung und Körperverletzung
in scheme: mediatopic
created: 2009-10-22T02:00:00+00:00
modified: 2021-02-18T12:00:00+00:00
broader: Gewalt

Kartellverstoß
type: Concept
definition: Verletzung von Gesetzen gegen Monopole
in scheme: mediatopic
created: 2009-10-22T02:00:00+00:00
modified: 2021-05-05T12:00:00+00:00
broader: Firmenkriminalität

Vertragsbruch
type: Concept
definition: Bruch von legalen Verträgen zwischen Unternehmen und mit Kunden
in scheme: mediatopic
created: 2009-10-22T02:00:00+00:00
modified: 2021-02-18T12:00:00+00:00
broader: Firmenkriminalität

Unterschlagung
type: Concept
definition: Absichtlicher Diebstahl von anvertrautem Geld
in scheme: mediatopic
created: 2009-10-22T02:00:00+00:00
modified: 2021-02-18T12:00:00+00:00
broader: Firmenkriminalität

Insiderhandel
type: Concept
definition: Handel mit Aktien durch Personen, die Zugang zu internen und zu dem Zeitpunkt unveröffentlichten Informationen haben
in scheme: mediatopic
created: 2009-10-22T02:00:00+00:00
modified: 2021-02-18T12:00:00+00:00
broader: Firmenkriminalität

Wettbewerbsverstoß
type: Concept
definition: Eingreifen in den freien Wettbewerb in Markttätigkeit und Handel
in scheme: mediatopic
created: 2009-10-22T02:00:00+00:00
modified: 2021-02-18T12:00:00+00:00
broader: Firmenkriminalität

Wirtschaftskriminalität
type: Concept
definition: Die absichtliche Falschdarstellung oder Änderung von Buchhaltungsunterlagen in Bezug auf Verkäufe, Einnahmen, Ausgaben und andere Faktoren.
in scheme: mediatopic
created: 2019-04-06T12:00:00+00:00
modified: 2021-07-12T12:00:00+00:00
broader: Firmenkriminalität

Bestechung
type: Concept
definition: Zahlungen oder Spenden, um den Ausgang einer legalen Angelegenheit zu beeinflussen
in scheme: mediatopic
created: 2009-10-22T02:00:00+00:00
modified: 2021-02-18T12:00:00+00:00
broader: Korruption

Drogenhandel
type: Concept
definition: Unerlaubter Handel mit meist gesundheitsgefährdenden Stoffen
in scheme: mediatopic
created: 2009-10-22T02:00:00+00:00
modified: 2021-02-18T12:00:00+00:00
broader: Drogenkriminalität

Steuerhinterziehung
type: Concept
definition: Die illegale Hinterziehung von Steuern durch Einzelpersonen, Unternehmen und Stiftungen.
in scheme: mediatopic
created: 2019-04-06T12:00:00+00:00
modified: 2021-07-12T12:00:00+00:00
broader: Betrug

Bandenkriminalität
type: Concept
definition: Kriminelle Aktivitäten von Gruppen, meist in Randgebieten, die verbunden sind durch gemeinsame Herkunft, Sprache und ethnischem Hintergrund aber meist nur wenig organisiert
in scheme: mediatopic
created: 2009-10-22T02:00:00+00:00
modified: 2021-05-05T12:00:00+00:00
broader: Organisierte Kriminalität

Gericht
type: Concept
definition: Gremium der Rechtsprechung wo Rechtsfälle angehört werden
in scheme: mediatopic
created: 2009-10-22T02:00:00+00:00
modified: 2021-02-18T12:00:00+00:00
broader: Justiz
narrower: Berufung (Gericht)
narrower: Gerichtsverwaltung
narrower: Richter
narrower: Prozess (Gericht)
narrower: Oberstes Gericht
broad match: http://cv.iptc.org/newscodes/subjectcode/02007000

Außergerichtliche Einigung
type: Concept
definition: Legale Absprachen außerhalb des Gerichts
in scheme: mediatopic
created: 2009-10-22T02:00:00+00:00
modified: 2021-05-05T12:00:00+00:00
broader: Justiz
narrower: Schiedsgericht
broad match: http://cv.iptc.org/newscodes/subjectcode/02000000

Anklage
type: Concept
definition: Aktivitäten und Nachforschungen von Staatsanwälten
in scheme: mediatopic
created: 2009-10-22T02:00:00+00:00
modified: 2021-03-31T12:00:00+00:00
broader: Justiz

Berufung (Gericht)
type: Concept
definition: Verfahren bei dem das Urteil nicht akzeptiert wird
in scheme: mediatopic
created: 2009-10-22T02:00:00+00:00
modified: 2021-02-18T12:00:00+00:00
broader: Gericht
broad match: http://cv.iptc.org/newscodes/subjectcode/02000000

Gerichtsverwaltung
type: Concept
definition: Angestellte des Gerichts, Gerichtsdiener, Stenografen etc.
in scheme: mediatopic
created: 2009-10-22T02:00:00+00:00
retired: 2019-10-07T12:00:00+00:00
modified: 2021-05-05T12:00:00+00:00
broader: Gericht

Richter
type: Concept
definition: Mitglieder des Gerichts, die zu Gericht sitzen und Recht sprechen
in scheme: mediatopic
created: 2009-10-22T02:00:00+00:00
modified: 2024-03-28T12:00:00+00:00
broader: Gericht

Prozess (Gericht)
type: Concept
definition: Vorgang, bei dem Schuld oder Unschuld, richtig oder falsch festgesetzt und geklärt wird
in scheme: mediatopic
created: 2009-10-22T02:00:00+00:00
modified: 2021-02-18T12:00:00+00:00
broader: Gericht
narrower: Anhörung
narrower: Angeklagter
narrower: Rechtsstreit
narrower: Zeuge
narrower: Strafe

Oberstes Gericht
type: Concept
definition: Angelegenheiten im Zusammenhang mit Obersten oder Hohen Gerichten, einschließlich Nominierungen und Urteile
in scheme: mediatopic
created: 2019-11-25T12:00:00+00:00
modified: 2021-07-12T12:00:00+00:00
broader: Gericht

Anhörung
type: Concept
definition: Vorgerichtliches Vorgehen inklusive Verteidigung, Kaution, Anträge, Indizien, Aussagen
in scheme: mediatopic
created: 2009-10-22T02:00:00+00:00
modified: 2021-05-05T12:00:00+00:00
broader: Prozess (Gericht)

Angeklagter
type: Concept
definition: Person, die vor Gericht steht
in scheme: mediatopic
created: 2009-10-22T02:00:00+00:00
retired: 2019-10-07T12:00:00+00:00
modified: 2021-02-18T12:00:00+00:00
broader: Prozess (Gericht)

Rechtsstreit
type: Concept
definition: Streitigkeiten, die vor Gericht gebracht werden, um von einer Jury entschieden zu werden
in scheme: mediatopic
created: 2009-10-22T02:00:00+00:00
modified: 2021-05-05T12:00:00+00:00
broader: Prozess (Gericht)

Zeuge
type: Concept
definition: Person, die etwas bezeugt
in scheme: mediatopic
created: 2009-10-22T02:00:00+00:00
retired: 2019-10-07T12:00:00+00:00
modified: 2021-02-18T12:00:00+00:00
broader: Prozess (Gericht)

Strafe
type: Concept
definition: Vergeltung, die gegen Gesetzesbrecher verhängt wird
in scheme: mediatopic
created: 2009-10-22T02:00:00+00:00
modified: 2021-02-18T12:00:00+00:00
broader: Prozess (Gericht)
narrower: Todesstrafe
narrower: Geldstrafe
narrower: Strafvollzug
narrower: gerichtlich angeordnete psychiatrische Behandlung
narrower: Bewährungsstrafe

Schiedsgericht
type: Concept
definition: Lösung von Streitigkeiten durch eine neutrale Instanz
in scheme: mediatopic
created: 2009-10-22T02:00:00+00:00
modified: 2021-12-21T12:00:00+00:00
broader: Außergerichtliche Einigung

Zivilrecht
type: Concept
definition: Rechte des Einzelnen im Bürgerlichen Recht.
in scheme: mediatopic
created: 2009-10-22T02:00:00+00:00
modified: 2021-02-18T12:00:00+00:00
broader: Grundrechte

Bürgerliches Gesetzbuch
type: Concept
definition: System der zivilen Vergehen und Delikte
in scheme: mediatopic
created: 2009-10-22T02:00:00+00:00
modified: 2021-03-31T12:00:00+00:00
broader: Gesetz
narrower: Verordnung

Strafgesetzbuch
type: Concept
definition: System der Strafvergehen und Delikte
in scheme: mediatopic
created: 2009-10-22T02:00:00+00:00
modified: 2021-02-18T12:00:00+00:00
broader: Gesetz

Internationales Recht
type: Concept
definition: Rechtssystem, was alle Nationen einschließt, wie die Genfer Konvention, das Internationale Seerecht etc.
in scheme: mediatopic
created: 2009-10-22T02:00:00+00:00
modified: 2021-02-18T12:00:00+00:00
broader: Gesetz
narrower: Auslieferung
narrower: Internationales Strafgericht

Verwaltungsrecht
type: Concept
definition: Gesetzestext, der die Handlungen der staatlichen Verwaltungsbehörden regelt
in scheme: mediatopic
created: 2019-04-06T12:00:00+00:00
modified: 2021-07-12T12:00:00+00:00
broader: Gesetz

Verordnung
type: Concept
definition: Regelungen aus dem Unternehmensrecht
in scheme: mediatopic
created: 2009-10-22T02:00:00+00:00
modified: 2021-03-31T12:00:00+00:00
broader: Bürgerliches Gesetzbuch
narrower: Kartellfragen
broad match: http://cv.iptc.org/newscodes/subjectcode/02006002

Kartellfragen
type: Concept
definition: Kartellaktivitäten und Regelungen des Monopols
in scheme: mediatopic
created: 2009-10-22T02:00:00+00:00
modified: 2021-02-18T12:00:00+00:00
broader: Verordnung

Auslieferung
type: Concept
definition: Legaler Austausch zwischen Ländern von Kriminellen und Verdächtigen
in scheme: mediatopic
created: 2009-10-22T02:00:00+00:00
modified: 2021-02-18T12:00:00+00:00
broader: Internationales Recht

Internationales Strafgericht
type: Concept
definition: Aktivitäten von internationalen Tribunalen wie der Europäische Gerichtshof für Menschenrechte, Internationaler Gerichtshof in Den Haag etc.
in scheme: mediatopic
created: 2009-10-22T02:00:00+00:00
modified: 2021-12-17T12:00:00+00:00
broader: Internationales Recht

Untersuchungshaft
type: Concept
definition: Festnahme bei Verdacht auf ein Verbrechen
in scheme: mediatopic
created: 2009-10-22T02:00:00+00:00
modified: 2021-02-18T12:00:00+00:00
broader: Sicherheitskräfte (BGS, LKA, BKA)

Strafanzeige
type: Concept
definition: Untersuchung über ein mögliches Verbrechen bis zur Verhaftung
in scheme: mediatopic
created: 2009-10-22T02:00:00+00:00
modified: 2021-02-18T12:00:00+00:00
broader: Sicherheitskräfte (BGS, LKA, BKA)
narrower: Vermisste
narrower: Strafrechtliche Ermittlungen eingestellt

Polizei
type: Concept
definition: Öffentliche Kräfte, die Gesetze durchsetzen, Kriminalität erfassen und vorbeugen, um die öffentliche Ordnung zu sichern
in scheme: mediatopic
created: 2009-10-22T02:00:00+00:00
modified: 2021-03-31T12:00:00+00:00
broader: Sicherheitskräfte (BGS, LKA, BKA)

Überwachung
type: Concept
definition: Monitoring the activities of the individual through the use of cameras and data in order to prevent or uncover criminal activities
in scheme: mediatopic
created: 2020-08-05T12:00:00+00:00
modified: 2021-07-12T12:00:00+00:00
broader: Sicherheitskräfte (BGS, LKA, BKA)

Vermisste
type: Concept
definition: Person, die nicht an dem Ort ist, wo man sie in einem bestimmten Zeitraum erwartet
in scheme: mediatopic
created: 2009-10-22T02:00:00+00:00
modified: 2021-02-18T12:00:00+00:00
broader: Strafanzeige

Strafrechtliche Ermittlungen eingestellt
type: Concept
definition: Wenn Polizei und/oder Staatsanwälte eine Untersuchung ohne Abschluss beenden
in scheme: mediatopic
created: 2019-04-06T12:00:00+00:00
modified: 2021-07-12T12:00:00+00:00
broader: Strafanzeige

Todesstrafe
type: Concept
definition: Strafe durch Tod
in scheme: mediatopic
created: 2009-10-22T02:00:00+00:00
modified: 2021-02-18T12:00:00+00:00
broader: Strafe
broad match: http://cv.iptc.org/newscodes/subjectcode/14025005

Geldstrafe
type: Concept
definition: Strafe die mit Geld abgegolten wird
in scheme: mediatopic
created: 2009-10-22T02:00:00+00:00
modified: 2021-02-18T12:00:00+00:00
broader: Strafe

Strafvollzug
type: Concept
definition: Ort, für die Inhaftierung aus Menschen aus unterschiedlichen Gründen
in scheme: mediatopic
created: 2009-10-22T02:00:00+00:00
modified: 2021-03-31T12:00:00+00:00
broader: Strafe

gerichtlich angeordnete psychiatrische Behandlung
type: Concept
definition: Psychiatrische Behandlung, die Personen mit psychischen Erkrankungen in Gefängnissen oder als Bedingung für Bewährung, Überwachung oder Bewährung auferlegt wird
in scheme: mediatopic
created: 2019-04-06T12:00:00+00:00
modified: 2021-07-12T12:00:00+00:00
broader: Strafe

Bewährungsstrafe
type: Concept
definition: Rechtliche Regelung für den Fall, dass ein Richter die Verbüßung einer Strafe durch eine Person, die eines Verbrechens für schuldig befunden wurde, hinauszögert, um ihr eine Bewährungsfrist zu geben
in scheme: mediatopic
created: 2019-04-06T12:00:00+00:00
modified: 2021-07-12T12:00:00+00:00
broader: Strafe

Explosion
type: Concept
definition: Jede ungeplante und plötzliche Ausbreitung einer Menge von Materie
in scheme: mediatopic
created: 2009-10-22T02:00:00+00:00
modified: 2021-05-05T12:00:00+00:00
broader: Unglück

Industrieunglück
type: Concept
definition: Jedes ungeplante Ereignis mit ungewollten Konsequenzen in einer Fabrik, einem Geschäft oder Büro
in scheme: mediatopic
created: 2009-10-22T02:00:00+00:00
modified: 2021-05-05T12:00:00+00:00
broader: Unglück
narrower: Atomunglück

Transportunglück
type: Concept
definition: Unfall bei dem ein oder mehrere Fahrzeuge verwickelt sind.
in scheme: mediatopic
created: 2009-10-22T02:00:00+00:00
modified: 2021-05-05T12:00:00+00:00
broader: Unglück
narrower: Flugunglück
narrower: Schiffsunglück
narrower: Bahnunglück
narrower: Verkehrsunglück

Konstruktionsfehler
type: Concept
definition: Wenn ein Gebäude, eine Brücke oder andere Konstruktionen zusammenbrechen aufgrund von unerwarteten Krafteinwirkungen oder Materialfehlern
in scheme: mediatopic
created: 2009-10-22T02:00:00+00:00
modified: 2021-02-18T12:00:00+00:00
broader: Unglück

Ertrinken
type: Concept
definition: Wenn sich die Luftröhre und die Lungen einer Person mit Wasser füllen, was zum Tod oder zu Verletzungen führt, meist verursacht durch einen Sturz oder ein Bad in Flüssen, Seen oder im Meer
in scheme: mediatopic
created: 2021-05-05T12:00:00+00:00
modified: 2021-12-21T12:00:00+00:00
broader: Unglück

Atomunglück
type: Concept
definition: Jedes ungeplante Ereignis mit ungewollten Konsequenzen im Zusammenhang mit radioaktiven Materialien
in scheme: mediatopic
created: 2009-10-22T02:00:00+00:00
modified: 2021-02-18T12:00:00+00:00
broader: Industrieunglück

Flugunglück
type: Concept
definition: Unfälle mit Fahrzeugen im Luft- und Weltraum
in scheme: mediatopic
created: 2009-10-22T02:00:00+00:00
modified: 2021-02-18T12:00:00+00:00
broader: Transportunglück

Schiffsunglück
type: Concept
definition: Unfälle mit Wasserfahrzeugen
in scheme: mediatopic
created: 2009-10-22T02:00:00+00:00
modified: 2021-02-18T12:00:00+00:00
broader: Transportunglück

Bahnunglück
type: Concept
definition: Unfälle mit Zügen
in scheme: mediatopic
created: 2009-10-22T02:00:00+00:00
modified: 2021-02-18T12:00:00+00:00
broader: Transportunglück

Verkehrsunglück
type: Concept
definition: Unfälle im Straßenverkehr
in scheme: mediatopic
created: 2009-10-22T02:00:00+00:00
modified: 2021-02-18T12:00:00+00:00
broader: Transportunglück
narrower: Wildtierunfall

Wildtierunfall
type: Concept
definition: Verkehrsunfälle mit Wildtieren
in scheme: mediatopic
created: 2019-04-06T12:00:00+00:00
modified: 2021-07-12T12:00:00+00:00
broader: Verkehrsunglück

Hunger
type: Concept
definition: Schwerer Mangel an Nahrungsmitteln für eine große Bevölkerung
in scheme: mediatopic
created: 2009-10-22T02:00:00+00:00
modified: 2021-02-18T12:00:00+00:00
broader: Katastrophe

Feuer
type: Concept
definition: Verbrennung und Zerstörung von Materialien durch eine Verbindung von großer Hitze und Sauerstoff
in scheme: mediatopic
created: 2009-10-22T02:00:00+00:00
modified: 2021-02-18T12:00:00+00:00
broader: Katastrophe
narrower: Flächenbrand

Naturkatastrophe
type: Concept
definition: Zerstörerische Ereignisse verursacht durch die Natur, wie Hurrikan, Erdbeben, Flut etc.
in scheme: mediatopic
created: 2009-10-22T02:00:00+00:00
modified: 2021-02-18T12:00:00+00:00
broader: Katastrophe
narrower: Dürre
narrower: Erdbeben
narrower: Hochwasser
narrower: Erdrutsch
narrower: Unwetter
narrower: Vulkanausbruch
narrower: Tsunami

Flächenbrand
type: Concept
definition: Ein unkontrolliertes Feuer in einem Gebiet mit brennbarer Vegetation
in scheme: mediatopic
created: 2019-04-06T12:00:00+00:00
modified: 2021-07-12T12:00:00+00:00
broader: Feuer

Dürre
type: Concept
definition: Ein schwerer Mangel an Wasser über einen bestimmten Zeitraum
in scheme: mediatopic
created: 2009-10-22T02:00:00+00:00
modified: 2021-02-18T12:00:00+00:00
broader: Naturkatastrophe

Erdbeben
type: Concept
definition: Die Bewegung der Erdplatten, die in manchen Fällen eine Zerstörung der Oberfläche verursacht
in scheme: mediatopic
created: 2009-10-22T02:00:00+00:00
modified: 2021-02-18T12:00:00+00:00
broader: Naturkatastrophe

Hochwasser
type: Concept
definition: Übermaß an Wasser, verursacht durch schwere Regenfälle oder Schneeschmelze, in der Regel an Orten, wo es nicht gewünscht ist
in scheme: mediatopic
created: 2009-10-22T02:00:00+00:00
modified: 2021-02-18T12:00:00+00:00
broader: Naturkatastrophe

Erdrutsch
type: Concept
definition: Plötzliches Verrutschen von großen Schnee- oder Erdmassen
in scheme: mediatopic
created: 2009-10-22T02:00:00+00:00
modified: 2021-02-18T12:00:00+00:00
broader: Naturkatastrophe
narrower: Lawine
broad match: http://cv.iptc.org/newscodes/subjectcode/03015002

Unwetter
type: Concept
definition: Eine wetterbedingte Katastrophe
in scheme: mediatopic
created: 2009-10-22T02:00:00+00:00
modified: 2021-02-18T12:00:00+00:00
broader: Naturkatastrophe
narrower: Orkan
narrower: Hurrikan

Vulkanausbruch
type: Concept
definition: Bruch in der Erdkruste, aus dem geschmolzenes Material an der Oberfläche ausgeworfen wird
in scheme: mediatopic
created: 2009-10-22T02:00:00+00:00
modified: 2021-07-12T12:00:00+00:00
broader: Naturkatastrophe

Tsunami
type: Concept
definition: Hohe und starke Meereswellen, die durch eine Unterwasserstörung an Land verursacht werden, wie z. B. ein Erdbeben oder einen Vulkanausbruch, und die beim Auftreffen auf Land erhebliche Schäden und Verluste verursachen können
in scheme: mediatopic
created: 2022-02-03T12:00:00+00:00
modified: 2022-02-03T12:00:00+00:00
broader: Naturkatastrophe

Lawine
type: Concept
definition: Plötzlicher Schneefall, Eis, Steinschlag oder Schlamm von einem Berg herunter
in scheme: mediatopic
created: 2009-10-22T02:00:00+00:00
modified: 2021-02-18T12:00:00+00:00
broader: Erdrutsch
broad match: http://cv.iptc.org/newscodes/subjectcode/03015002

Orkan
type: Concept
definition: Sturm mit hoher Geschwindigkeit, aber ohne das gewaltige Tempo eines Hurrikans, mit wenig oder ohne Regen oder Hagel. Meistens stark zerstörerisch
in scheme: mediatopic
created: 2009-10-22T02:00:00+00:00
modified: 2021-05-05T12:00:00+00:00
broader: Unwetter

Hurrikan
type: Concept
definition: Eine Art von Sturm, auch tropischer Wirbelsturm genannt, der sich über tropischen oder subtropischen Gewässern bildet
in scheme: mediatopic
created: 2019-10-07T12:00:00+00:00
modified: 2021-07-12T12:00:00+00:00
broader: Unwetter

Transportnotfall
type: Concept
definition: Notfall bei dem ein oder mehrere Fahrzeuge verwickelt sind
in scheme: mediatopic
created: 2009-10-22T02:00:00+00:00
retired: 2015-08-27T12:00:00+00:00
modified: 2021-12-21T12:00:00+00:00
broader: Notfall
narrower: Flugnotfall
narrower: Schiffsnotfall
narrower: Bahnnotfall
narrower: Verkehrsnotfall
broad match: http://cv.iptc.org/newscodes/subjectcode/03010000

Flugnotfall
type: Concept
definition: Notfall mit Fahrzeugen im Luft- oder Weltraum
in scheme: mediatopic
created: 2009-10-22T02:00:00+00:00
retired: 2015-08-27T12:00:00+00:00
modified: 2021-12-21T12:00:00+00:00
broader: Transportnotfall
broad match: http://cv.iptc.org/newscodes/subjectcode/03010003

Schiffsnotfall
type: Concept
definition: Notfall mit Wasserfahrzeugen
in scheme: mediatopic
created: 2009-10-22T02:00:00+00:00
retired: 2015-08-27T12:00:00+00:00
modified: 2021-12-21T12:00:00+00:00
broader: Transportnotfall
broad match: http://cv.iptc.org/newscodes/subjectcode/03010004

Bahnnotfall
type: Concept
definition: Notfall mit Zügen
in scheme: mediatopic
created: 2009-10-22T02:00:00+00:00
retired: 2015-08-27T12:00:00+00:00
modified: 2021-12-21T12:00:00+00:00
broader: Transportnotfall
broad match: http://cv.iptc.org/newscodes/subjectcode/03010002

Verkehrsnotfall
type: Concept
definition: Notfall im Straßenverkehr
in scheme: mediatopic
created: 2009-10-22T02:00:00+00:00
retired: 2015-08-27T12:00:00+00:00
modified: 2021-12-21T12:00:00+00:00
broader: Transportnotfall
broad match: http://cv.iptc.org/newscodes/subjectcode/03010001

Unternehmenszahlen
type: Concept
definition: Die Finanzen eines Unternehmens
in scheme: mediatopic
created: 2009-10-22T02:00:00+00:00
retired: 2023-03-31T12:00:00+00:00
modified: 2023-03-31T12:00:00+00:00
broader: Firmeninformation
narrower: Analyst
broad match: http://cv.iptc.org/newscodes/subjectcode/04000000

Aktien
type: Concept
definition: Neues Wertpapierangebot, inklusive öffentliche Erstangebote
in scheme: mediatopic
created: 2009-10-22T02:00:00+00:00
modified: 2023-03-31T12:00:00+00:00
broader: Firmeninformation
narrower: Insolvenz
narrower: Unternehmenskrise
narrower: Neufinanzierung und Umstrukturierung
narrower: Börse
narrower: Aktien
narrower: Crowdfunding
narrower: Unternehmensanleihe

Personal
type: Concept
definition: Personal eines Unternehmens und wie sie geführt werden
in scheme: mediatopic
created: 2009-10-22T02:00:00+00:00
modified: 2021-02-18T12:00:00+00:00
broader: Firmeninformation
narrower: Entlassung und Rationalisierung
narrower: Vorstand
broad match: http://cv.iptc.org/newscodes/subjectcode/09000000

Marketing
type: Concept
definition: Planung der Ausrichtung eines Unternehmens und der Marketingstrategie für Produkte und Dienstleistungen um diese zu erreichen
in scheme: mediatopic
created: 2009-10-22T02:00:00+00:00
modified: 2023-03-31T12:00:00+00:00
broader: Firmeninformation
narrower: Vertrag
narrower: Globalisierung
narrower: Lizenz
narrower: Neue Produkte
narrower: Patent, Copyright und Warenzeichen
narrower: Reklamation
narrower: Forschung und Entwicklung
narrower: Marktforschung
narrower: Marktentwicklung
narrower: öffentlicher Auftrag
narrower: Kundenmanagement
narrower: Outsourcing
broad match: http://cv.iptc.org/newscodes/subjectcode/04016029

Unternehmensrecht
type: Concept
definition: Art und Weise wie ein Unternehmen funktioniert und alle Regeln dazu
in scheme: mediatopic
created: 2009-10-22T02:00:00+00:00
modified: 2023-03-31T12:00:00+00:00
broader: Firmeninformation
narrower: Anmeldung von Proxies
narrower: Aktionär
narrower: Hauptversammlung
narrower: Geschäftsbericht
narrower: Geschäftsführung
narrower: Soziale Verantwortung von Unternehmen
broad match: http://cv.iptc.org/newscodes/subjectcode/04016027

Geschäftsbericht und Leistung
type: Concept
definition: Messung und Berichterstattung über die Leistung eines Unternehmens
in scheme: mediatopic
created: 2023-03-31T12:00:00+00:00
modified: 2023-03-31T12:00:00+00:00
broader: Firmeninformation
narrower: Buchführung
narrower: Kreditrating
narrower: Gewinn
narrower: Gewinnprognose
narrower: Finanzbericht

Unternehmensumstrukturierung
type: Concept
definition: Änderungen in der Struktur eines Unternehmens oder einer Organisation
in scheme: mediatopic
created: 2023-03-31T12:00:00+00:00
modified: 2023-03-31T12:00:00+00:00
broader: Firmeninformation
narrower: Firmenausgründung
narrower: Joint Venture
narrower: Übernahme
narrower: Übernahme des Management
narrower: Fusion

Analyst
type: Concept
definition: Kommentare von Analysten zu Aktien, Analysen und Empfehlungen
in scheme: mediatopic
created: 2009-10-22T02:00:00+00:00
retired: 2023-03-31T12:00:00+00:00
modified: 2023-03-31T12:00:00+00:00
broader: Unternehmenszahlen

Buchführung
type: Concept
definition: Änderungen der Regeln im Rechnungswesen und der Rechnungsprüfung
in scheme: mediatopic
created: 2009-10-22T02:00:00+00:00
retired: 2023-03-31T12:00:00+00:00
modified: 2023-03-31T12:00:00+00:00
broader: Geschäftsbericht und Leistung

Insolvenz
type: Concept
definition: Nachrichten über aktuelle Einreichungen von Zahlungsunfähigkeit
in scheme: mediatopic
created: 2009-10-22T02:00:00+00:00
modified: 2023-03-31T12:00:00+00:00
broader: Aktien

Aktienrückkauf
type: Concept
definition: Aktienrückkaufprogramme. Dies sollte von Aktienbewegung getrennt werden
in scheme: mediatopic
created: 2009-10-22T02:00:00+00:00
modified: 2023-03-31T12:00:00+00:00
broader: Aktien

Aktien
type: Concept
definition: Firmenpapier, das einer Einzelperson das Eigentumsrecht auf einen Gewinnanteil verleiht
in scheme: mediatopic
created: 2009-10-22T02:00:00+00:00
modified: 2024-07-01T12:00:00+00:00
broader: Aktien
narrower: Aktienrückkauf
narrower: Dividende
narrower: Aktienbewegung
narrower: Börsengang
narrower: Derivate
narrower: Aktienempfehlung
narrower: Gefragte Aktie

Kreditrating
type: Concept
definition: Formelle Stellungnahmen von verschiedenen Agenturen, die Ratings durchführen über das Investitionsrisiko einer Firma oder eines Unternehmens
in scheme: mediatopic
created: 2009-10-22T02:00:00+00:00
modified: 2023-03-31T12:00:00+00:00
broader: Geschäftsbericht und Leistung

Dividende
type: Concept
definition: Ankündigungen von Dividendenauszahlungen
in scheme: mediatopic
created: 2009-10-22T02:00:00+00:00
modified: 2023-03-31T12:00:00+00:00
broader: Aktien

Gewinn
type: Concept
definition: Jede Steigerung des Umsatzergebnisses
in scheme: mediatopic
created: 2009-10-22T02:00:00+00:00
modified: 2023-03-31T12:00:00+00:00
broader: Geschäftsbericht und Leistung

Gewinnprognose
type: Concept
definition: Vorhersage von Firmenumsätzen durch Analysten
in scheme: mediatopic
created: 2009-10-22T02:00:00+00:00
retired: 2023-03-31T12:00:00+00:00
modified: 2023-03-31T12:00:00+00:00
broader: Geschäftsbericht und Leistung

Finanzbericht
type: Concept
definition: Formale Aussagen über die Verwertung und den Inhalt von Quartals- oder Halbjahresbilanzen von Firmen
in scheme: mediatopic
created: 2009-10-22T02:00:00+00:00
modified: 2023-03-31T12:00:00+00:00
broader: Geschäftsbericht und Leistung

Anmeldung von Proxies
type: Concept
definition: Anmeldungen von Stimmrechtsanteilen von Aktionären bei Aufsichtsbehörden
in scheme: mediatopic
created: 2009-10-22T02:00:00+00:00
modified: 2023-03-31T12:00:00+00:00
broader: Unternehmensrecht

Unternehmenskrise
type: Concept
definition: Anzeichen dass ein Unternehmen finanziell in Bedrängnis ist, aber noch nicht Insolvenz angemeldet hat
in scheme: mediatopic
created: 2009-10-22T02:00:00+00:00
modified: 2023-03-31T12:00:00+00:00
broader: Aktien

Neufinanzierung und Umstrukturierung
type: Concept
definition: Verkauf von Unternehmensteilen, Splittung von bestehenden Unternehmen in Teile einer Holding etc.
in scheme: mediatopic
created: 2009-10-22T02:00:00+00:00
retired: 2023-10-02T12:00:00+00:00
modified: 2023-10-02T12:00:00+00:00
broader: Aktien

Börse
type: Concept
definition: Märkte um festverzinsliche Wertpapiere und Aktien zu handeln
in scheme: mediatopic
created: 2009-10-22T02:00:00+00:00
retired: 2023-03-31T12:00:00+00:00
modified: 2023-03-31T12:00:00+00:00
broader: Aktien
narrower: Aktienoption

Crowdfunding
type: Concept
definition: Die Finanzierung eines Projekts oder einer Unternehmung durch das Aufbringen kleiner Geldbeträge von einer großen Anzahl von Personen, typischerweise über das Internet
in scheme: mediatopic
created: 2020-08-05T12:00:00+00:00
modified: 2023-03-31T12:00:00+00:00
broader: Aktien

Unternehmensanleihe
type: Concept
definition: Unternehmenspapier, das die Ausleihe von Geld zu einem festen Zinssatz und für eine bestimmte Zeit an dieses Unternehmen oder diese Regierung darstellt
in scheme: mediatopic
created: 2024-03-28T12:00:00+00:00
modified: 2024-03-28T12:00:00+00:00
broader: Aktien

Aktionär
type: Concept
definition: Inhaber einer oder mehrerer Aktien eines Unternehmens
in scheme: mediatopic
created: 2009-10-22T02:00:00+00:00
modified: 2023-03-31T12:00:00+00:00
broader: Unternehmensrecht

Aktienbewegung
type: Concept
definition: Ankündigung von großen Aktienereignissen: Splits, Blockverkäufe, neue Kurshöhen und Tiefen etc.
in scheme: mediatopic
created: 2009-10-22T02:00:00+00:00
modified: 2023-03-31T12:00:00+00:00
broader: Aktien

Börsengang
type: Concept
definition: Erstmalig öffentliches Angebot von Aktien eines Unternehmens. Wird auch als Initial Public Offering IPO bezeichnet.
in scheme: mediatopic
created: 2009-10-22T02:00:00+00:00
modified: 2021-02-18T12:00:00+00:00
broader: Aktien
broad match: http://cv.iptc.org/newscodes/subjectcode/04016019

Entlassung und Rationalisierung
type: Concept
definition: Geplante oder aktuell durchgeführte Minimierung von Arbeitskräften
in scheme: mediatopic
created: 2009-10-22T02:00:00+00:00
modified: 2021-05-05T12:00:00+00:00
broader: Personal

Vorstand
type: Concept
definition: Einstellungen und Veränderungen in den Vorständen der Geschäftsführung
in scheme: mediatopic
created: 2009-10-22T02:00:00+00:00
modified: 2023-03-31T12:00:00+00:00
broader: Personal
broad match: http://cv.iptc.org/newscodes/subjectcode/04016028

Aktienoption
type: Concept
definition: Beiderseitige Vereinbarung Aktien zu kaufen oder zu verkaufen, wenn diese einen bestimmten Preis erreicht haben, ausschließlich angeboten für Angestellte und Beschäftigte dieses Unternehmens
in scheme: mediatopic
created: 2009-10-22T02:00:00+00:00
retired: 2023-03-31T12:00:00+00:00
modified: 2023-03-31T12:00:00+00:00
broader: Börse

Vertrag
type: Concept
definition: Verträge bezüglich Verkaufsaktivitäten
in scheme: mediatopic
created: 2009-10-22T02:00:00+00:00
modified: 2021-02-18T12:00:00+00:00
broader: Marketing

Globalisierung
type: Concept
definition: Weltweite Geschäftstätigkeit
in scheme: mediatopic
created: 2009-10-22T02:00:00+00:00
modified: 2021-02-18T12:00:00+00:00
broader: Marketing

Lizenz
type: Concept
definition: Lizenzvereinbarungen zwischen Unternehmen
in scheme: mediatopic
created: 2009-10-22T02:00:00+00:00
retired: 2023-03-31T12:00:00+00:00
modified: 2023-03-31T12:00:00+00:00
broader: Marketing

Neue Produkte
type: Concept
definition: Ankündigung neuer Produkte und Dienstleistungen
in scheme: mediatopic
created: 2009-10-22T02:00:00+00:00
modified: 2023-03-31T12:00:00+00:00
broader: Marketing
broad match: http://cv.iptc.org/newscodes/subjectcode/04016030

Patent, Copyright und Warenzeichen
type: Concept
definition: Patente, Copyright und Warenzeichen
in scheme: mediatopic
created: 2009-10-22T02:00:00+00:00
modified: 2023-03-31T12:00:00+00:00
broader: Marketing

Reklamation
type: Concept
definition: Die Entscheidung eines Unternehmens ein defektes Produkt zurückzunehmen oder zu reparieren
in scheme: mediatopic
created: 2009-10-22T02:00:00+00:00
modified: 2021-02-18T12:00:00+00:00
broader: Marketing

Forschung und Entwicklung
type: Concept
definition: Forschung und Ausgaben für die Entwicklung neuer Produkte
in scheme: mediatopic
created: 2009-10-22T02:00:00+00:00
modified: 2021-02-18T12:00:00+00:00
broader: Marketing

Marktforschung
type: Concept
definition: Dienstleister, der versucht Käuferbedürfnisse zu ermitteln
in scheme: mediatopic
created: 2009-10-22T02:00:00+00:00
modified: 2023-03-31T12:00:00+00:00
broader: Marketing

Marktentwicklung
type: Concept
definition: Statistisch relevantes Konsumverhalten.
in scheme: mediatopic
created: 2009-10-22T02:00:00+00:00
modified: 2023-03-31T12:00:00+00:00
broader: Marketing

öffentlicher Auftrag
type: Concept
definition: Schriftliche Verträge zwischen Unternehmen und öffentlichen Behörden über die Ausführung von Arbeiten, die Lieferung von Produkten oder die Erbringung von Dienstleistungen
in scheme: mediatopic
created: 2016-04-04T12:00:00+00:00
modified: 2021-07-12T12:00:00+00:00
broader: Marketing

Kundenmanagement
type: Concept
definition: Aufbau und Pflege einer Beziehung zu den Kunden, um den Umsatz zu steigern.
in scheme: mediatopic
created: 2016-04-04T12:00:00+00:00
modified: 2023-03-31T12:00:00+00:00
broader: Marketing

Outsourcing
type: Concept
definition: Geschäftspraxis, bei der Dienstleistungen oder Arbeitsfunktionen an Dritte ausgelagert werde
in scheme: mediatopic
created: 2020-08-05T12:00:00+00:00
modified: 2021-07-12T12:00:00+00:00
broader: Marketing

Hauptversammlung
type: Concept
definition: Ankündigungen und Berichte von Versammlungen
in scheme: mediatopic
created: 2009-10-22T02:00:00+00:00
modified: 2023-03-31T12:00:00+00:00
broader: Unternehmensrecht

Geschäftsbericht
type: Concept
definition: Verfügbarkeit oder Inhalte von Jahresabschlussberichten von Firmen
in scheme: mediatopic
created: 2009-10-22T02:00:00+00:00
modified: 2023-03-31T12:00:00+00:00
broader: Unternehmensrecht

Geschäftsführung
type: Concept
definition: Absprachen oder Wechsel in der Geschäftsführung eines Unternehmens
in scheme: mediatopic
created: 2009-10-22T02:00:00+00:00
modified: 2023-03-31T12:00:00+00:00
broader: Unternehmensrecht

Firmenausgründung
type: Concept
definition: Gründung neuer Firmen, die sich aus bestehenden Firmen ausgegliedert haben
in scheme: mediatopic
created: 2009-10-22T02:00:00+00:00
modified: 2023-03-31T12:00:00+00:00
broader: Unternehmensumstrukturierung

Soziale Verantwortung von Unternehmen
type: Concept
definition: Die Geschäftspraktiken eines Unternehmens spiegeln eine verantwortungsvolle Sozial-, Ethik- und Umweltpolitik wider
in scheme: mediatopic
created: 2019-04-06T12:00:00+00:00
modified: 2023-03-31T12:00:00+00:00
broader: Unternehmensrecht

Joint Venture
type: Concept
definition: Zwei oder mehr Unternehmen, die eine Kooperation vereinbaren
in scheme: mediatopic
created: 2009-10-22T02:00:00+00:00
modified: 2023-03-31T12:00:00+00:00
broader: Unternehmensumstrukturierung

Übernahme
type: Concept
definition: Erlangung der Kontrolle über ein Unternehmen durch Anteilseinkäufe mit geliehenem Geld
in scheme: mediatopic
created: 2009-10-22T02:00:00+00:00
modified: 2023-03-31T12:00:00+00:00
broader: Unternehmensumstrukturierung

Übernahme des Management
type: Concept
definition: Erlangung von Kontrolle über ein Unternehmen durch den Kauf von Anteilen durch das Management
in scheme: mediatopic
created: 2009-10-22T02:00:00+00:00
modified: 2023-03-31T12:00:00+00:00
broader: Unternehmensumstrukturierung
broad match: http://cv.iptc.org/newscodes/subjectcode/04000000

Fusion
type: Concept
definition: Zwei oder mehr Unternehmen bilden ein neues, Fusion, Übernahme oder Akquisition
in scheme: mediatopic
created: 2009-10-22T02:00:00+00:00
modified: 2023-03-31T12:00:00+00:00
broader: Unternehmensumstrukturierung

Agrar
type: Concept
definition: Prozess zur Produktion von natürlichen Konsumgütern
in scheme: mediatopic
created: 2009-10-22T02:00:00+00:00
modified: 2023-03-31T12:00:00+00:00
broader: Branchen
narrower: Aquakultur
narrower: Ackerbau
narrower: Tierhaltung
narrower: Weinbau

Fischindustrie
type: Concept
definition: Züchten und Fangen von Fisch
in scheme: mediatopic
created: 2009-10-22T02:00:00+00:00
modified: 2023-03-31T12:00:00+00:00
broader: Branchen

Forstwirtschaft
type: Concept
definition: Herstellung, Sammlung und Verarbeitung von Baumbeständen für die zukünftige Nutzung
in scheme: mediatopic
created: 2009-10-22T02:00:00+00:00
modified: 2023-03-31T12:00:00+00:00
broader: Branchen

Chemie
type: Concept
definition: Natürliche oder künstliche Stoffe, um andere Materialien zu erzeugen
in scheme: mediatopic
created: 2009-10-22T02:00:00+00:00
modified: 2021-02-18T12:00:00+00:00
broader: Branchen
narrower: Düngemitel
narrower: Kosmetik
narrower: Anorganische Chemie
narrower: Organische Chemie
narrower: http://cv.iptc.org/newscodes/mediatopic/20001395

Kunststoff
type: Concept
definition: Chemikalien, die genutzt werden um Plastik und andere künstliche Stoffe für die Industrie zu produzieren
in scheme: mediatopic
created: 2009-10-22T02:00:00+00:00
modified: 2023-03-31T12:00:00+00:00
broader: Branchen

Computer und Informationstechnologie
type: Concept
definition: Alles was die elektronische Verarbeitung und Übertragung von Information von einem Punkt zu einem anderen
in scheme: mediatopic
created: 2009-10-22T02:00:00+00:00
modified: 2023-03-31T12:00:00+00:00
broader: Branchen
narrower: Hardware
narrower: Netzwerk
narrower: Satellitentechnologie
narrower: Sicherheitstechnologie
narrower: Elektronik
narrower: Software
narrower: Telekommunikation Ausrüstung
narrower: Telekommunikation Service
narrower: Wireless-Technologie
narrower: Internet der Dinge

Bau
type: Concept
definition: Alle Inhalte, die den Erbau und Verkauf von baulichem Eigentum betreffen
in scheme: mediatopic
created: 2009-10-22T02:00:00+00:00
modified: 2021-02-18T12:00:00+00:00
broader: Branchen
narrower: Design und Technik
narrower: Landwirtschaftsbau
narrower: Tiefbau
narrower: Wohnungsbau
narrower: Grundstückspreis
narrower: Immobilien
narrower: Baustoff
narrower: Infrastruktuprojekte
narrower: Geschäftsgebäude
narrower: Gewerbeimmobilien
narrower: Wohnimmobilien

Konsumgüter
type: Concept
definition: Waren, die für Individuen produziert und an sie verkauft werden
in scheme: mediatopic
created: 2009-10-22T02:00:00+00:00
modified: 2021-02-18T12:00:00+00:00
broader: Branchen
narrower: Getränke
narrower: Bekleidung
narrower: Lebensmittel
narrower: Luxusgüter
narrower: Gebrauchsgüter
narrower: Spielwaren
narrower: Nahrungsmittelindustrie
narrower: Möbel
narrower: Tabak
narrower: Handwerk
narrower: Heimtierprodukte und- Dienstleistungen
narrower: Unterhaltungselektronik

Energie
type: Concept
definition: Produktion von elektrischer Energie, Wasser, Wind, Sonnenenergie und Kraftstoffe, die genutzt werden, um sie zu produzieren
in scheme: mediatopic
created: 2009-10-22T02:00:00+00:00
modified: 2023-03-31T12:00:00+00:00
broader: Branchen
narrower: Erneuerbare Energie
narrower: Kohle
narrower: Energie
narrower: Atomenergie
narrower: Öl und Gas (Verwertung)
narrower: Öl und Gas (Förderung)
narrower: Biokraftstoff
narrower: Öl- und Gasindustrie

Dienstleistung
type: Concept
definition: Unternehmen die vermitteln, beschützen Geldgeschäfte begleiten, oder Unterstützung anbieten für kommerzielle Unternehmen
in scheme: mediatopic
created: 2009-10-22T02:00:00+00:00
retired: 2023-03-31T12:00:00+00:00
modified: 2023-03-31T12:00:00+00:00
broader: Branchen
narrower: Bestattungsinstitut
narrower: Privatfinanzen
narrower: Nettoeinkommen
narrower: Druckdienstleister

Metall- und Technische Industrie
type: Concept
definition: Hersteller von elektrischer, elektronischer und mechanischer Ausrüstung, umfasst nicht das Ingenieurwesen
in scheme: mediatopic
created: 2009-10-22T02:00:00+00:00
modified: 2021-02-18T12:00:00+00:00
broader: Branchen
narrower: Flug- und Raumfahrindustrie
narrower: Automobilindustrie
narrower: Rüstungsindustrie
narrower: Elektroindustrie
narrower: Anlagenbau
narrower: Zulieferindustrie
narrower: Gerätebau
narrower: Maschinenbau
narrower: Schiffbau
narrower: Investitionsgüter
narrower: Bahnindustrie

Medien
type: Concept
definition: Verschiedene Mittel für die Verbreitung von Informationen und Nachrichten in der Öffentlichkeit
in scheme: mediatopic
created: 2009-10-22T02:00:00+00:00
modified: 2023-03-31T12:00:00+00:00
broader: Branchen
narrower: Werbung
narrower: Verlag
narrower: Filmindustrie
narrower: Musikindustrie
narrower: Nachrichtenagentur
narrower: Presse
narrower: Online Medien
narrower: Öffentlichkeitsarbeit
narrower: Radioindustrie
narrower: Satellit und Kabelservice
narrower: Fernsehproduktion
narrower: Streaming-Dienst
narrower: Podcast
narrower: Nachrichtenindustrie

Metall und Mineralien
type: Concept
definition: Produktion und Raffinieren von Erzen in Metalle
in scheme: mediatopic
created: 2009-10-22T02:00:00+00:00
modified: 2023-03-31T12:00:00+00:00
broader: Branchen
narrower: Gold und Edelmetall
narrower: Eisen und Stahl
narrower: Bergbau
narrower: Nichteisenmetall

Verarbeitende Industrie
type: Concept
definition: Das Geschäft aus Rohstoffen nützliche Produkte herzustellen
in scheme: mediatopic
created: 2009-10-22T02:00:00+00:00
retired: 2023-03-31T12:00:00+00:00
modified: 2023-03-31T12:00:00+00:00
broader: Branchen
narrower: Alkoholische Getränke/Brauerei
narrower: Papier und Verpackung
narrower: Gummi
narrower: Nicht-alkoholische Getränke
narrower: Textil und Bekleidung
narrower: E-Zigarette

Tourismus und Freizeit
type: Concept
definition: Tourismus und Freizeitindustrie
in scheme: mediatopic
created: 2009-10-22T02:00:00+00:00
modified: 2023-03-31T12:00:00+00:00
broader: Branchen
narrower: Glücksspielindustrie
narrower: Gastgewerbe
narrower: Sport- und Freizeitartikel
narrower: Gaststronomie
narrower: Reiseveranstalter

Transport
type: Concept
definition: Mittel von einem Ort zum anderen zu gelangen, ohne zu laufen
in scheme: mediatopic
created: 2009-10-22T02:00:00+00:00
modified: 2023-03-31T12:00:00+00:00
broader: Branchen
narrower: Luftverkehr
narrower: Bahn
narrower: Straßentransport
narrower: Verkehrsbericht
narrower: Schifffahrt
narrower: Logistik
narrower: Öffentliche Verkehrsmittel
narrower: Taxi und Fahrdienst
narrower: gemeinsam genutzter Transport

Versorgungsunternehmen
type: Concept
definition: Die Bereitstellung grundlegender Dienstleistungen, einschließlich der Wasserversorgung und Abfallentsorgung für die Öffentlichkeit.
in scheme: mediatopic
created: 2019-07-25T12:00:00+00:00
modified: 2023-03-31T12:00:00+00:00
broader: Branchen
narrower: Strom
narrower: Schadstoffkontrolle
narrower: Wasser
narrower: Heizung und Kühlung

Vertriebskanäle
type: Concept
definition: Indirekte oder direkte Wege, Produkte oder Dienstleistungen auf den Markt zu bringen, damit sie von den Verbrauchern gekauft werden können
in scheme: mediatopic
created: 2019-11-25T12:00:00+00:00
modified: 2023-03-31T12:00:00+00:00
broader: Branchen
narrower: Einzelhandel
narrower: Großhandel
narrower: Auktion

Gesundheitsindustrie
type: Concept
definition: Waren und Dienstleistungen zur Behandlung von Patienten durch kurative, präventive, rehabilitative und palliative Pflege
in scheme: mediatopic
created: 2022-06-14T12:00:00+00:00
modified: 2022-06-14T12:00:00+00:00
broader: Branchen
narrower: Biotechnologie
narrower: Pharmaindustrie
narrower: Gesundheitsdienst
narrower: medizinische Ausrüstrung

Finanzdienstleistung
type: Concept
definition: Professionelle Dienstleistungen im Zusammenhang mit der Anlage, Ausleihe oder Verwaltung von Geld und anderen Vermögenswerten
in scheme: mediatopic
created: 2023-03-31T12:00:00+00:00
modified: 2023-03-31T12:00:00+00:00
broader: Branchen
narrower: Wirtschaftsprüfer
narrower: Bank
narrower: Versicherung
narrower: Investmentdienst
narrower: Privatinvestition
narrower: Börsenmakler
narrower: Kredit
narrower: Vermögensverwaltung

Unternehmensdienstleistung
type: Concept
definition: Dienstleistungen für Unternehmen und Privatpersonen, wie Beratung, Rechtsvertretung und Arbeitsvermittlung
in scheme: mediatopic
created: 2023-03-31T12:00:00+00:00
modified: 2023-03-31T12:00:00+00:00
broader: Branchen
narrower: Unternehmensberatung
narrower: Arbeitsvermittlung
narrower: Reinigungsservice
narrower: Rechtsberatung
narrower: Körperpflegeservice
narrower: Mietservice
narrower: Kurierdienst
narrower: Hochzeitsservice
narrower: Messe
narrower: Zahlungsdienst
narrower: http://cv.iptc.org/newscodes/mediatopic/20001396

Aquakultur
type: Concept
definition: Zucht von Wasserpflanzen und -tieren zum Gebrauch unter kontrollierten Bedingungen
in scheme: mediatopic
created: 2009-10-22T02:00:00+00:00
retired: 2023-03-31T12:00:00+00:00
modified: 2023-03-31T12:00:00+00:00
broader: Agrar

Ackerbau
type: Concept
definition: Gewinnung von Nahrungsmittel aus dem Boden
in scheme: mediatopic
created: 2009-10-22T02:00:00+00:00
retired: 2023-03-31T12:00:00+00:00
modified: 2023-03-31T12:00:00+00:00
broader: Agrar

Tierhaltung
type: Concept
definition: Züchtung von Tieren als Nahrungsmittel
in scheme: mediatopic
created: 2009-10-22T02:00:00+00:00
retired: 2023-03-31T12:00:00+00:00
modified: 2023-03-31T12:00:00+00:00
broader: Agrar

Weinbau
type: Concept
definition: Herstellung von Weinen von der Weinrebe bis zum Endprodukt
in scheme: mediatopic
created: 2009-10-22T02:00:00+00:00
retired: 2023-03-31T12:00:00+00:00
modified: 2023-03-31T12:00:00+00:00
broader: Agrar

Düngemitel
type: Concept
definition: Natürliche oder künstliche Stoffe, um das Wachstum von Pflanzen zu fördern
in scheme: mediatopic
created: 2009-10-22T02:00:00+00:00
retired: 2023-03-31T12:00:00+00:00
modified: 2023-03-31T12:00:00+00:00
broader: Chemie

Kosmetik
type: Concept
definition: Zusammenstellung von chemischen und anderen Stoffen um Aussehen und Geruch zu verbessern.
in scheme: mediatopic
created: 2009-10-22T02:00:00+00:00
retired: 2023-03-31T12:00:00+00:00
modified: 2023-03-31T12:00:00+00:00
broader: Chemie

Anorganische Chemie
type: Concept
definition: Zweig der Chemie, der von Mineralien und Metallen handelt
in scheme: mediatopic
created: 2009-10-22T02:00:00+00:00
retired: 2023-03-31T12:00:00+00:00
modified: 2023-03-31T12:00:00+00:00
broader: Chemie

Organische Chemie
type: Concept
definition: Zweig der Chemie, der von menschlichen, tierischen oder kohlenstoffbasierten Stoffen handelt
in scheme: mediatopic
created: 2009-10-22T02:00:00+00:00
retired: 2023-03-31T12:00:00+00:00
modified: 2023-03-31T12:00:00+00:00
broader: Chemie

http://cv.iptc.org/newscodes/mediatopic/20001395
type: Concept
in scheme: mediatopic
created: 2025-10-09T12:00:00+00:00
modified: 2025-10-09T12:00:00+00:00
broader: Chemie

Biotechnologie
type: Concept
definition: Tätigkeiten, die Technologien verwenden, um Probleme und Lösungen von lebenden Organismen zu erforschen
in scheme: mediatopic
created: 2009-10-22T02:00:00+00:00
modified: 2022-06-14T12:00:00+00:00
broader: Gesundheitsindustrie

Pharmaindustrie
type: Concept
definition: Die Herstellung von Medizin aus verschiedenen Chemikalien und natürlichen Stoffen
in scheme: mediatopic
created: 2009-10-22T02:00:00+00:00
modified: 2023-03-31T12:00:00+00:00
broader: Gesundheitsindustrie

Hardware
type: Concept
definition: Physikalisches Gerät zur Unterstützung der Dienstleistung eines Computers, wie Monitor, Festplatten, Tastatur etc. kann auch benutzt werden für Ausrüstung wie Router, Server und andere Netzwerkgeräte
in scheme: mediatopic
created: 2009-10-22T02:00:00+00:00
modified: 2023-03-31T12:00:00+00:00
broader: Computer und Informationstechnologie

Netzwerk
type: Concept
definition: Verbindung zwischen Computern, die den Austausch von Daten ermöglichen
in scheme: mediatopic
created: 2009-10-22T02:00:00+00:00
retired: 2023-03-31T12:00:00+00:00
modified: 2023-03-31T12:00:00+00:00
broader: Computer und Informationstechnologie

Satellitentechnologie
type: Concept
definition: Hardware und Software, die Geräte unterstützt um Signale hin und her zusenden via Satellit im Weltraum
in scheme: mediatopic
created: 2009-10-22T02:00:00+00:00
modified: 2021-05-05T12:00:00+00:00
broader: Computer und Informationstechnologie

Sicherheitstechnologie
type: Concept
definition: Umfasst technische Entwicklungen in Hardware und Software, Forschung und verwandte Gebiete wie Cyber-Sicherheit
in scheme: mediatopic
created: 2009-10-22T02:00:00+00:00
retired: 2023-03-31T12:00:00+00:00
modified: 2023-03-31T12:00:00+00:00
broader: Computer und Informationstechnologie

Elektronik
type: Concept
definition: Grundlegende Komponenten die das Funktionieren elektronischer Geräte ermöglichen, wie beispielsweise Computer
in scheme: mediatopic
created: 2009-10-22T02:00:00+00:00
modified: 2023-03-31T12:00:00+00:00
broader: Computer und Informationstechnologie

Software
type: Concept
definition: Programme, die bei Installation auf der Hardware bestimmte Funktionen ausführen
in scheme: mediatopic
created: 2009-10-22T02:00:00+00:00
modified: 2023-03-31T12:00:00+00:00
broader: Computer und Informationstechnologie

Telekommunikation Ausrüstung
type: Concept
definition: Geräte wie Telefonanlagen, Modems, Fax etc. die den Austausch von Sprache/Daten erleichtern
in scheme: mediatopic
created: 2009-10-22T02:00:00+00:00
retired: 2023-03-31T12:00:00+00:00
modified: 2023-03-31T12:00:00+00:00
broader: Computer und Informationstechnologie

Telekommunikation Service
type: Concept
definition: Dienstleistung, die von kommerziellen Firmen angeboten wird, die die Verbindung zwischen Telefonen, Fax und Computern erleichtern.
in scheme: mediatopic
created: 2009-10-22T02:00:00+00:00
modified: 2023-03-31T12:00:00+00:00
broader: Computer und Informationstechnologie

Wireless-Technologie
type: Concept
definition: Austausch von Informationen mit Mitteln außerhalb der direkten verdrahteten Schaltung
in scheme: mediatopic
created: 2009-10-22T02:00:00+00:00
modified: 2024-07-01T12:00:00+00:00
broader: Computer und Informationstechnologie

Internet der Dinge
type: Concept
definition: Ein Netzwerk von Geräten mit Mikrochips, elektronischen Sensoren und Kommunikation über das Interne
in scheme: mediatopic
created: 2016-04-04T12:00:00+00:00
retired: 2023-03-31T12:00:00+00:00
modified: 2023-03-31T12:00:00+00:00
broader: Computer und Informationstechnologie

Design und Technik
type: Concept
definition: Design und Planung durch Ingenieure, Architekten etc. von Straßen, Büros, Fabriken, Dämmen, Bauwerken in Gewässern
in scheme: mediatopic
created: 2009-10-22T02:00:00+00:00
retired: 2023-03-31T12:00:00+00:00
modified: 2023-03-31T12:00:00+00:00
broader: Bau

Landwirtschaftsbau
type: Concept
definition: Landwirtschaftliche Areale zur Nahrungsmittelproduktion wie Milch, Obst und Tierbestand wie Vieh und Fisch
in scheme: mediatopic
created: 2009-10-22T02:00:00+00:00
retired: 2019-10-07T12:00:00+00:00
modified: 2023-03-31T12:00:00+00:00
broader: Bau

Tiefbau
type: Concept
definition: Bau von Straßen, Dämmen, Büro- und anderen Großbauten
in scheme: mediatopic
created: 2009-10-22T02:00:00+00:00
retired: 2019-07-25T12:00:00+00:00
modified: 2023-03-31T12:00:00+00:00
broader: Bau

Wohnungsbau
type: Concept
definition: Bau von Wohnraum zur privaten Nutzung
in scheme: mediatopic
created: 2009-10-22T02:00:00+00:00
retired: 2023-03-31T12:00:00+00:00
modified: 2023-03-31T12:00:00+00:00
broader: Bau

Grundstückspreis
type: Concept
definition: Preis eines Grundstücks in speziellen Gebieten, z.B. für die kommerzielle Nutzung, als Bauland oder als Ackerland nutzbar
in scheme: mediatopic
created: 2009-10-22T02:00:00+00:00
retired: 2023-03-31T12:00:00+00:00
modified: 2023-03-31T12:00:00+00:00
broader: Bau

Immobilien
type: Concept
definition: Kaufen und Verkaufen von baulichem Eigentum aller Art
in scheme: mediatopic
created: 2009-10-22T02:00:00+00:00
retired: 2023-03-31T12:00:00+00:00
modified: 2023-03-31T12:00:00+00:00
broader: Bau

Baustoff
type: Concept
definition: Fertigung von Materialien wie Bauplatten, Holzbefestigungen für die Bauindustrie
in scheme: mediatopic
created: 2009-10-22T02:00:00+00:00
modified: 2023-03-31T12:00:00+00:00
broader: Bau

Infrastruktuprojekte
type: Concept
definition: Der Bau der grundlegenden Einrichtungen und Systeme, die ein Land, eine Stadt oder ein anderes Gebiet versorgen, einschließlich Straßen, Brücken, Dämme, Tunnel, Telekommunikations- und Stromnetze
in scheme: mediatopic
created: 2019-07-25T12:00:00+00:00
modified: 2021-07-12T12:00:00+00:00
broader: Bau

Geschäftsgebäude
type: Concept
definition: Der Bau von Gebäuden für Handel und Gewerbe, einschließlich Bürogebäuden, Einzelhandelsgeschäften, Restaurants, Hotels und Stadien
in scheme: mediatopic
created: 2019-07-25T12:00:00+00:00
retired: 2023-03-31T12:00:00+00:00
modified: 2023-03-31T12:00:00+00:00
broader: Bau

Gewerbeimmobilien
type: Concept
definition: Bau und Verkauf von Immobilien, die für geschäftliche Zwecke und nicht als Wohnraum genutzt werden
in scheme: mediatopic
created: 2023-03-31T12:00:00+00:00
modified: 2023-03-31T12:00:00+00:00
broader: Bau

Wohnimmobilien
type: Concept
definition: Bau und Verkauf von Immobilien, die als Wohnraum genutzt werden
in scheme: mediatopic
created: 2023-03-31T12:00:00+00:00
modified: 2023-03-31T12:00:00+00:00
broader: Bau

Getränke
type: Concept
definition: Konsumierbare Getränke, alkoholische und nicht-alkoholische
in scheme: mediatopic
created: 2009-10-22T02:00:00+00:00
retired: 2023-03-31T12:00:00+00:00
modified: 2023-03-31T12:00:00+00:00
broader: Konsumgüter

Bekleidung
type: Concept
definition: Waren, die als Kleidung getragen werden
in scheme: mediatopic
created: 2009-10-22T02:00:00+00:00
modified: 2023-03-31T12:00:00+00:00
broader: Konsumgüter

Lebensmittel
type: Concept
definition: Früchte, Gemüse, Brot, Fleisch zum Verzehr für Menschen
in scheme: mediatopic
created: 2009-10-22T02:00:00+00:00
retired: 2023-03-31T12:00:00+00:00
modified: 2023-03-31T12:00:00+00:00
broader: Konsumgüter

Luxusgüter
type: Concept
definition: Ledertaschen, Schmuck, gehobene Mode, Accessoires etc.
in scheme: mediatopic
created: 2009-10-22T02:00:00+00:00
modified: 2023-03-31T12:00:00+00:00
broader: Konsumgüter

Gebrauchsgüter
type: Concept
definition: Lampen, Stifte und Schreibwaren, Geschirr, Uhren, Brillen etc.
in scheme: mediatopic
created: 2009-10-22T02:00:00+00:00
retired: 2023-03-31T12:00:00+00:00
modified: 2023-03-31T12:00:00+00:00
broader: Konsumgüter

Spielwaren
type: Concept
definition: Spielzeug für Kinder
in scheme: mediatopic
created: 2009-10-22T02:00:00+00:00
modified: 2023-03-31T12:00:00+00:00
broader: Konsumgüter

Nahrungsmittelindustrie
type: Concept
definition: Das Geschäft mit der Erzeugung, Verteilung und dem Verkauf von Grundbedarfsmitteln.
in scheme: mediatopic
created: 2009-10-22T02:00:00+00:00
modified: 2023-03-31T12:00:00+00:00
broader: Konsumgüter

Möbel
type: Concept
definition: Fertigung von Möbeln, Tapete, Farben und Erzeugnisse zur Inneneinrichtung
in scheme: mediatopic
created: 2009-10-22T02:00:00+00:00
modified: 2023-03-31T12:00:00+00:00
broader: Konsumgüter

Tabak
type: Concept
definition: Anbau, Produktion und Handel mit Tabakprodukten
in scheme: mediatopic
created: 2009-10-22T02:00:00+00:00
modified: 2023-03-31T12:00:00+00:00
broader: Konsumgüter

Handwerk
type: Concept
definition: Produkte oder Dienstleistungen, die mit einfachen Fertigkeiten und Werkzeugen bereitgestellt werden, im Gegensatz zur industriellen Massenproduktion.
in scheme: mediatopic
created: 2016-04-04T12:00:00+00:00
modified: 2023-03-31T12:00:00+00:00
broader: Konsumgüter

Heimtierprodukte und- Dienstleistungen
type: Concept
definition: Hygieneprodukte, Pflege und Ernährung für Haustiere.
in scheme: mediatopic
created: 2016-04-04T12:00:00+00:00
modified: 2023-03-31T12:00:00+00:00
broader: Konsumgüter

Unterhaltungselektronik
type: Concept
definition: Elektronische Geräte, wie Computer, Smartphones oder Fernseher, die für den persönlichen Gebrauch entworfen und verkauft werden
in scheme: mediatopic
created: 2019-08-02T12:00:00+00:00
modified: 2021-07-12T12:00:00+00:00
broader: Konsumgüter

Kaufhaus
type: Concept
definition: Große Läden, die bestimmt sind um Sachen für Einzelne anzubieten
in scheme: mediatopic
created: 2009-10-22T02:00:00+00:00
modified: 2021-02-18T12:00:00+00:00
broader: Einzelhandel

Einzelhandel
type: Concept
definition: Die unterste Stufe in der Handelshierarchie
in scheme: mediatopic
created: 2009-10-22T02:00:00+00:00
modified: 2023-03-31T12:00:00+00:00
broader: Vertriebskanäle
narrower: Kaufhaus
narrower: E-Commerce
narrower: Versandhandel
narrower: Fachhandel
narrower: Einkaufszentrum
narrower: Einkaufsviertel

E-Commerce
type: Concept
definition: Kaufen und Verkaufen im Internet
in scheme: mediatopic
created: 2009-10-22T02:00:00+00:00
modified: 2023-03-31T12:00:00+00:00
broader: Einzelhandel

Versandhandel
type: Concept
definition: Waren, die auf dem Postweg verkauft und versendet werden
in scheme: mediatopic
created: 2009-10-22T02:00:00+00:00
retired: 2023-03-31T12:00:00+00:00
modified: 2023-03-31T12:00:00+00:00
broader: Einzelhandel

Fachhandel
type: Concept
definition: Verkaufsstelle im Einzelhandel, die spezialisiert ist auf bestimmte Waren, wie z.B. Schuhe, Mäntel, elektronisches Werkzeug, etc.
in scheme: mediatopic
created: 2009-10-22T02:00:00+00:00
modified: 2021-05-05T12:00:00+00:00
broader: Einzelhandel

Einkaufszentrum
type: Concept
definition: Ein großes Gebäude oder eine Reihe miteinander verbundener Gebäude, die eine Vielzahl von Einzelhandelsgeschäften und Lebensmittelverkäufern enthalten
in scheme: mediatopic
created: 2020-08-05T12:00:00+00:00
modified: 2021-07-12T12:00:00+00:00
broader: Einzelhandel

Einkaufsviertel
type: Concept
definition: Primäre Einzelhandelsstraßen von Städten oder Gemeinden mit einzelnen Geschäften und Restaurants
in scheme: mediatopic
created: 2020-08-05T12:00:00+00:00
modified: 2021-07-12T12:00:00+00:00
broader: Einzelhandel

Großhandel
type: Concept
definition: Die oberste Stufe in der Handelshierarchie im Anschluss an die Produktion
in scheme: mediatopic
created: 2009-10-22T02:00:00+00:00
modified: 2023-03-31T12:00:00+00:00
broader: Vertriebskanäle

Erneuerbare Energie
type: Concept
definition: Geschäft mit Alternativen-Energien
in scheme: mediatopic
created: 2009-10-22T02:00:00+00:00
modified: 2023-03-31T12:00:00+00:00
broader: Energie
narrower: geothermische Energie
narrower: Solarenergie
narrower: Wasserkraft
narrower: Windenergie

Kohle
type: Concept
definition: Herstellung und Förderung von Glanz- und Steinkohle zur Energieerzeugung
in scheme: mediatopic
created: 2009-10-22T02:00:00+00:00
modified: 2021-02-18T12:00:00+00:00
broader: Energie

Energie
type: Concept
definition: Energiebranche, nicht auf einen bestimmten Bereich konzentriert
in scheme: mediatopic
created: 2009-10-22T02:00:00+00:00
retired: 2019-07-25T12:00:00+00:00
modified: 2021-07-12T12:00:00+00:00
broader: Energie

Atomenergie
type: Concept
definition: Nutzung von radioaktivem Material zur Energiegewinnung
in scheme: mediatopic
created: 2009-10-22T02:00:00+00:00
modified: 2021-07-12T12:00:00+00:00
broader: Energie

Öl und Gas (Verwertung)
type: Concept
definition: Alle Sachverhalte der Raffinierung und Verteilung, die sich auf Öl und Gas beziehen
in scheme: mediatopic
created: 2009-10-22T02:00:00+00:00
retired: 2019-07-25T12:00:00+00:00
modified: 2021-05-05T12:00:00+00:00
broader: Energie

Öl und Gas (Förderung)
type: Concept
definition: Alle Inhalte, die sich auf Öl und Gas beziehen, kennzeichnend hier die Gewinnung und der Transport zur Raffinerie
in scheme: mediatopic
created: 2009-10-22T02:00:00+00:00
retired: 2019-07-25T12:00:00+00:00
modified: 2021-05-05T12:00:00+00:00
broader: Energie

Biokraftstoff
type: Concept
definition: Kraftstoff, der aus lebender Materie gewonnen wird, wie zum Beispiel Ethano
in scheme: mediatopic
created: 2019-04-06T12:00:00+00:00
modified: 2023-03-31T12:00:00+00:00
broader: Energie

Öl- und Gasindustrie
type: Concept
definition: Exploration, Gewinnung, Raffinierung, Transport und Vermarktung von Erdölprodukten und Erdgas
in scheme: mediatopic
created: 2019-07-25T12:00:00+00:00
modified: 2023-03-31T12:00:00+00:00
broader: Energie
narrower: Diesel
narrower: Kerosin/Parafin
narrower: Erdgas
narrower: Benzin

geothermische Energie
type: Concept
definition: Thermische Energie, die in der Erde erzeugt und gespeichert wird
in scheme: mediatopic
created: 2019-04-06T12:00:00+00:00
modified: 2023-03-31T12:00:00+00:00
broader: Erneuerbare Energie

Solarenergie
type: Concept
definition: Aus Sonnenstrahlen erzeugte und geerntete Elektrizitä
in scheme: mediatopic
created: 2019-04-06T12:00:00+00:00
modified: 2023-03-31T12:00:00+00:00
broader: Erneuerbare Energie

Wasserkraft
type: Concept
definition: Elektrizität, die aus Wasserkraft erzeugt wird, wenn Wasser durch Turbinen fließt
in scheme: mediatopic
created: 2019-04-06T12:00:00+00:00
modified: 2023-03-31T12:00:00+00:00
broader: Erneuerbare Energie

Windenergie
type: Concept
definition: Elektrizität, die durch die kinetische Energie des Windes erzeugt wird, die normalerweise von Windmühlen oder Turbinen erzeugt wird
in scheme: mediatopic
created: 2019-04-06T12:00:00+00:00
modified: 2023-03-31T12:00:00+00:00
broader: Erneuerbare Energie

Diesel
type: Concept
definition: Destilliertes Petroleumprodukt schwerer als Benzin nicht nur für LKWs, Seemotoren, sondern auch in spezieller Form zum Heizen.
in scheme: mediatopic
created: 2009-10-22T02:00:00+00:00
modified: 2023-03-31T12:00:00+00:00
broader: Öl- und Gasindustrie

Strom
type: Concept
definition: In erster Linie das Energieverteilungsnetz betreffend, aber auch den Verkauf von Energie an den Strommarkt und Verteiler
in scheme: mediatopic
created: 2009-10-22T02:00:00+00:00
modified: 2023-03-31T12:00:00+00:00
broader: Versorgungsunternehmen

Kerosin/Parafin
type: Concept
definition: Ein leichtes Petroleumdestillat als Kochbrennstoff genutzt, Flugzeugmotoren, Lampen, Heizung und zur Reinigung.
in scheme: mediatopic
created: 2009-10-22T02:00:00+00:00
retired: 2023-03-31T12:00:00+00:00
modified: 2023-03-31T12:00:00+00:00
broader: Öl- und Gasindustrie

Erdgas
type: Concept
definition: Natürlicher Rohstoff aus der Erde, meist Methan in entflammbarem, gasförmigen Zustand.
in scheme: mediatopic
created: 2009-10-22T02:00:00+00:00
modified: 2023-03-31T12:00:00+00:00
broader: Öl- und Gasindustrie

Benzin
type: Concept
definition: Destilliertes Petroleumprodukt zur Nutzung als Brennstoff für Autos, mit oder ohne Zusätze
in scheme: mediatopic
created: 2009-10-22T02:00:00+00:00
modified: 2021-02-18T12:00:00+00:00
broader: Öl- und Gasindustrie

Schadstoffkontrolle
type: Concept
definition: Geschäft mit der Abfallverwertung und Verschmutzungskontrolle
in scheme: mediatopic
created: 2009-10-22T02:00:00+00:00
modified: 2023-03-31T12:00:00+00:00
broader: Versorgungsunternehmen

Wasser
type: Concept
definition: Angelegenheiten des Gebrauchs-und Trinkwasserschutzes
in scheme: mediatopic
created: 2009-10-22T02:00:00+00:00
modified: 2023-03-31T12:00:00+00:00
broader: Versorgungsunternehmen

Bestattungsinstitut
type: Concept
definition: Unternehmen, die Dienstleistungen anbieten im Zusammenhang mit dem Tod
in scheme: mediatopic
created: 2009-10-22T02:00:00+00:00
retired: 2023-03-31T12:00:00+00:00
modified: 2023-03-31T12:00:00+00:00
broader: Dienstleistung

Privatfinanzen
type: Concept
definition: Privates Einkommen und Ausgaben
in scheme: mediatopic
created: 2009-10-22T02:00:00+00:00
retired: 2023-03-31T12:00:00+00:00
modified: 2023-03-31T12:00:00+00:00
broader: Dienstleistung

Nettoeinkommen
type: Concept
definition: Verdienst einer Person und was ihm/ihr davon zur Verfügung steht
in scheme: mediatopic
created: 2009-10-22T02:00:00+00:00
retired: 2023-03-31T12:00:00+00:00
modified: 2023-03-31T12:00:00+00:00
broader: Dienstleistung

Druckdienstleister
type: Concept
definition: Produktion von Druckmaterialien wie Flyer, Werbeplakate, Schilder etc.
in scheme: mediatopic
created: 2009-10-22T02:00:00+00:00
retired: 2023-03-31T12:00:00+00:00
modified: 2023-03-31T12:00:00+00:00
broader: Dienstleistung

Wirtschaftsprüfer
type: Concept
definition: Unternehmen die Bilanzen erstellen, Haushalte konsolidieren und die Richtigkeit von Geschäftsberichten prüfen
in scheme: mediatopic
created: 2009-10-22T02:00:00+00:00
modified: 2023-03-31T12:00:00+00:00
broader: Finanzdienstleistung

Auktion
type: Concept
definition: Käufe durch bieten
in scheme: mediatopic
created: 2009-10-22T02:00:00+00:00
modified: 2023-03-31T12:00:00+00:00
broader: Vertriebskanäle

Bank
type: Concept
definition: Unternehmen, die Bargeld lagern, übermitteln, empfangen und verteilen
in scheme: mediatopic
created: 2009-10-22T02:00:00+00:00
modified: 2023-03-31T12:00:00+00:00
broader: Finanzdienstleistung

Unternehmensberatung
type: Concept
definition: Anbieter von Expertenwissen in vielseitigen Wissensgebieten, meist in Form von Zeitverträgen
in scheme: mediatopic
created: 2009-10-22T02:00:00+00:00
modified: 2023-03-31T12:00:00+00:00
broader: Unternehmensdienstleistung

Arbeitsvermittlung
type: Concept
definition: Dienst, der Menschen unterstützt einen Arbeitsplatz zu finden und für Firmen Arbeitskräfte vermittelt
in scheme: mediatopic
created: 2009-10-22T02:00:00+00:00
modified: 2023-03-31T12:00:00+00:00
broader: Unternehmensdienstleistung

Gesundheitsdienst
type: Concept
definition: Anbieter von medizinischen Diensten auf allen Ebenen, inklusive Ärzte, Kliniken etc.
in scheme: mediatopic
created: 2009-10-22T02:00:00+00:00
modified: 2022-06-14T12:00:00+00:00
broader: Gesundheitsindustrie

Versicherung
type: Concept
definition: Ein Risiko tragendes Unternehmen, das einzelnen ermöglicht regelmäßig einen kleinen Beitrag zu zahlen, um finanziell auf unvorhergesehene Ereignisse vorbereitet zu sein.
in scheme: mediatopic
created: 2009-10-22T02:00:00+00:00
modified: 2023-03-31T12:00:00+00:00
broader: Finanzdienstleistung

Investmentdienst
type: Concept
definition: Finanzberater, entgegen Börsenhändlern und -beratern
in scheme: mediatopic
created: 2009-10-22T02:00:00+00:00
modified: 2023-03-31T12:00:00+00:00
broader: Finanzdienstleistung

Reinigungsservice
type: Concept
definition: Unternehmen, die für private und geschäftliche Kunden Reinigungsdienstleistungen anbieten
in scheme: mediatopic
created: 2009-10-22T02:00:00+00:00
retired: 2023-03-31T12:00:00+00:00
modified: 2023-03-31T12:00:00+00:00
broader: Unternehmensdienstleistung

Rechtsberatung
type: Concept
definition: Rechtsanwälte und andere, die Firmen und Einzelnen dabei helfen mit staatlichen, bundesstaatlichen und örtlichen Gesetzen umzugehen.
in scheme: mediatopic
created: 2009-10-22T02:00:00+00:00
modified: 2023-03-31T12:00:00+00:00
broader: Unternehmensdienstleistung

Privatinvestition
type: Concept
definition: Private Finanzen und Investitionen
in scheme: mediatopic
created: 2009-10-22T02:00:00+00:00
modified: 2023-03-31T12:00:00+00:00
broader: Finanzdienstleistung

Körperpflegeservice
type: Concept
definition: Dienstleistung, die nicht ganz greifbar ist, z.B. Kosmetik und Haarpflege
in scheme: mediatopic
created: 2009-10-22T02:00:00+00:00
retired: 2023-03-31T12:00:00+00:00
modified: 2023-03-31T12:00:00+00:00
broader: Unternehmensdienstleistung

Mietservice
type: Concept
definition: Unternehmen, die Vermietungen anbieten, Fahrzeuge, Smokings, Werkzeuge, schwere Ausrüstung und andere Angebote
in scheme: mediatopic
created: 2009-10-22T02:00:00+00:00
modified: 2023-03-31T12:00:00+00:00
broader: Unternehmensdienstleistung

Kurierdienst
type: Concept
definition: Unternehmen, die Pakete und Dokumente für Einzelne oder Firmen verpacken und auf allen Wegen transportieren, Postdienste miteingeschlossen
in scheme: mediatopic
created: 2009-10-22T02:00:00+00:00
modified: 2023-03-31T12:00:00+00:00
broader: Unternehmensdienstleistung

Börsenmakler
type: Concept
definition: Kaufen und Verkaufen von Firmenanteilen im Auftrag von Einzelnen oder anderen Gremien.
in scheme: mediatopic
created: 2009-10-22T02:00:00+00:00
modified: 2023-03-31T12:00:00+00:00
broader: Finanzdienstleistung

Hochzeitsservice
type: Concept
definition: Dienste und Produkte rund um die Hochzeit
in scheme: mediatopic
created: 2009-10-22T02:00:00+00:00
retired: 2023-03-31T12:00:00+00:00
modified: 2023-03-31T12:00:00+00:00
broader: Unternehmensdienstleistung

Flug- und Raumfahrindustrie
type: Concept
definition: Firmen, die Komponenten für Flugzeuge und die Raumfahrt zusammenbauen oder herstellen
in scheme: mediatopic
created: 2009-10-22T02:00:00+00:00
modified: 2021-02-18T12:00:00+00:00
broader: Metall- und Technische Industrie

Automobilindustrie
type: Concept
definition: Firmen die Komponenten für Autos herstellen
in scheme: mediatopic
created: 2009-10-22T02:00:00+00:00
modified: 2021-02-18T12:00:00+00:00
broader: Metall- und Technische Industrie

Rüstungsindustrie
type: Concept
definition: Hersteller von Gewehren, Kanonen, Panzern und Schiffen etc. für militärische und nicht-militärische Sicherheitsdienste
in scheme: mediatopic
created: 2009-10-22T02:00:00+00:00
modified: 2023-03-31T12:00:00+00:00
broader: Metall- und Technische Industrie

Elektroindustrie
type: Concept
definition: Hersteller von großen und kleinen Elektrowaren für den privaten und geschäftlichen Gebrauch
in scheme: mediatopic
created: 2009-10-22T02:00:00+00:00
modified: 2021-02-18T12:00:00+00:00
broader: Metall- und Technische Industrie

Anlagenbau
type: Concept
definition: Herstellung von Kränen, Bulldozern und ähnliches für den Gebrauch bei großen Bauprojekten
in scheme: mediatopic
created: 2009-10-22T02:00:00+00:00
modified: 2023-03-31T12:00:00+00:00
broader: Metall- und Technische Industrie

Zulieferindustrie
type: Concept
definition: Hersteller von mechanischen, elektrischen und elektronischen Produkten, die zur Herstellung anderer Produkte benötigt werden
in scheme: mediatopic
created: 2009-10-22T02:00:00+00:00
retired: 2023-03-31T12:00:00+00:00
modified: 2023-03-31T12:00:00+00:00
broader: Metall- und Technische Industrie

Gerätebau
type: Concept
definition: Hersteller von Instrumenten zur Eichung, Messungen von Dingen wie Geschwindigkeit, Druck und Entfernung
in scheme: mediatopic
created: 2009-10-22T02:00:00+00:00
retired: 2023-03-31T12:00:00+00:00
modified: 2023-03-31T12:00:00+00:00
broader: Metall- und Technische Industrie

Maschinenbau
type: Concept
definition: Hersteller von Turbinen, Maschinen, Pumpen, Ventilatoren, Motoren und Komponenten für schwere Ausrüstung
in scheme: mediatopic
created: 2009-10-22T02:00:00+00:00
modified: 2023-03-31T12:00:00+00:00
broader: Metall- und Technische Industrie

Schiffbau
type: Concept
definition: Hersteller von Schiffen, U-Booten oder Lastkähnen
in scheme: mediatopic
created: 2009-10-22T02:00:00+00:00
modified: 2023-03-31T12:00:00+00:00
broader: Metall- und Technische Industrie

Investitionsgüter
type: Concept
definition: Langlebige Güter, die bei der Produktion anderer Güter oder Dienstleistungen verwendet werden
in scheme: mediatopic
created: 2016-04-04T12:00:00+00:00
retired: 2023-03-31T12:00:00+00:00
modified: 2023-03-31T12:00:00+00:00
broader: Metall- und Technische Industrie

Bahnindustrie
type: Concept
definition: Schienenfahrzeughersteller, Zulieferer, Eisenbahn- und Signalindustrie, Wartung und Reparatur.
in scheme: mediatopic
created: 2016-04-04T12:00:00+00:00
modified: 2023-03-31T12:00:00+00:00
broader: Metall- und Technische Industrie

Werbung
type: Concept
definition: Methoden Waren und Dienstleistungen dem Kunden anzupreisen mit Hilfe von Videos, Grafiken, Text etc.
in scheme: mediatopic
created: 2009-10-22T02:00:00+00:00
modified: 2023-03-31T12:00:00+00:00
broader: Medien

Verlag
type: Concept
definition: Das Geschäft gebundene Medien zu produzieren und zu verkaufen, sowohl Belletristik als auch Sachliteratur
in scheme: mediatopic
created: 2009-10-22T02:00:00+00:00
modified: 2023-03-31T12:00:00+00:00
broader: Medien

Filmindustrie
type: Concept
definition: Artikel, die sich auf das Filmgeschäft beziehen
in scheme: mediatopic
created: 2009-10-22T02:00:00+00:00
modified: 2023-03-31T12:00:00+00:00
broader: Medien

Musikindustrie
type: Concept
definition: Aufnahme, Produktion, Marketing von Musik
in scheme: mediatopic
created: 2009-10-22T02:00:00+00:00
modified: 2023-03-31T12:00:00+00:00
broader: Medien

Nachrichtenagentur
type: Concept
definition: Kommerzielle Agenturen, die nachrichtenrelevante Ereignisse aufbereiten und verbreiten durch Presse, Fernsehen, Video oder elektronische Medien
in scheme: mediatopic
created: 2009-10-22T02:00:00+00:00
retired: 2023-03-31T12:00:00+00:00
modified: 2023-03-31T12:00:00+00:00
broader: Medien

Presse
type: Concept
definition: Das Geschäft mit gebundenen und ungebundenen, gedruckten Papiermaterial zur regelmäßigen Verbreitung von Nachrichten
in scheme: mediatopic
created: 2009-10-22T02:00:00+00:00
retired: 2023-03-31T12:00:00+00:00
modified: 2023-03-31T12:00:00+00:00
broader: Medien

Online Medien
type: Concept
definition: Das Geschäft mit der Verbreitung von Nachrichten und Informationen über Computernetzwerke für den öffentlichen Gebrauch
in scheme: mediatopic
created: 2009-10-22T02:00:00+00:00
retired: 2023-03-31T12:00:00+00:00
modified: 2023-03-31T12:00:00+00:00
broader: Medien

Öffentlichkeitsarbeit
type: Concept
definition: Tätigkeit Produkte und Dienstleistungen anzupreisen durch Werbekampagnen, und/oder Kundenkontakt oder Nachrichtenverbreitung.
in scheme: mediatopic
created: 2009-10-22T02:00:00+00:00
modified: 2023-03-31T12:00:00+00:00
broader: Medien

Radioindustrie
type: Concept
definition: Radiogeschäft
in scheme: mediatopic
created: 2009-10-22T02:00:00+00:00
modified: 2023-03-31T12:00:00+00:00
broader: Medien

Satellit und Kabelservice
type: Concept
definition: Das Geschäft mit der Übertragung von Nachrichten, Unterhaltung und Informationen durch Satelliten oder Kabelfernsehen
in scheme: mediatopic
created: 2009-10-22T02:00:00+00:00
modified: 2021-05-05T12:00:00+00:00
broader: Medien

Fernsehproduktion
type: Concept
definition: Fernsehgeschäft
in scheme: mediatopic
created: 2009-10-22T02:00:00+00:00
modified: 2023-03-31T12:00:00+00:00
broader: Medien

Streaming-Dienst
type: Concept
definition: Anbieter von Unterhaltungsangeboten (Musik, Filme, Serien usw.), die den Inhalt über eine Internetverbindung auf den Computer, das Fernsehgerät. oder ein mobiles Gerät des Abonnenten übertragen
in scheme: mediatopic
created: 2020-08-05T12:00:00+00:00
modified: 2023-03-31T12:00:00+00:00
broader: Medien

Podcast
type: Concept
definition: Podcast-Netzwerke und die Personen, die Audio-Inhalte erstellen und verbreiten, in der Regel im Serienformat, an ein Publikum
in scheme: mediatopic
created: 2023-03-31T12:00:00+00:00
modified: 2023-03-31T12:00:00+00:00
broader: Medien

Nachrichtenindustrie
type: Concept
definition: Produktion und Verbreitung von Inhalten über berichtenswerte Ereignisse in Print-, Rundfunk-, Video- oder elektronischen Medien
in scheme: mediatopic
created: 2023-03-31T12:00:00+00:00
modified: 2023-03-31T12:00:00+00:00
broader: Medien

Gold und Edelmetall
type: Concept
definition: Gewinnung, Verfeinerung und Verkauf von Gold und anderen wertvollen Metallen
in scheme: mediatopic
created: 2009-10-22T02:00:00+00:00
modified: 2023-03-31T12:00:00+00:00
broader: Metall und Mineralien

Eisen und Stahl
type: Concept
definition: Gewinnung, Verfeinerung und Verkauf von eisenhaltigen Metallen
in scheme: mediatopic
created: 2009-10-22T02:00:00+00:00
retired: 2023-03-31T12:00:00+00:00
modified: 2023-03-31T12:00:00+00:00
broader: Metall und Mineralien

Bergbau
type: Concept
definition: Industriezweig, der nach Metallen oder Rohstoffen wie Kohle, oder wertvollen Edelsteinen wie Diamanten gräbt.
in scheme: mediatopic
created: 2009-10-22T02:00:00+00:00
retired: 2023-03-31T12:00:00+00:00
modified: 2023-03-31T12:00:00+00:00
broader: Metall und Mineralien

Nichteisenmetall
type: Concept
definition: Gewinnung, Verfeinerung und Verkauf von Kupfer, Zink, Aluminium und anderen nicht-eisenhaltigen Metallen
in scheme: mediatopic
created: 2009-10-22T02:00:00+00:00
retired: 2023-03-31T12:00:00+00:00
modified: 2023-03-31T12:00:00+00:00
broader: Metall und Mineralien

Alkoholische Getränke/Brauerei
type: Concept
definition: Herstellung alkoholischer Getränke
in scheme: mediatopic
created: 2009-10-22T02:00:00+00:00
retired: 2023-03-31T12:00:00+00:00
modified: 2023-03-31T12:00:00+00:00
broader: Verarbeitende Industrie

Papier und Verpackung
type: Concept
definition: Produktion von Papiermaterial zum Schreiben, Einwickeln, Drucken oder Verpacken.
in scheme: mediatopic
created: 2009-10-22T02:00:00+00:00
retired: 2023-03-31T12:00:00+00:00
modified: 2023-03-31T12:00:00+00:00
broader: Verarbeitende Industrie

Gummi
type: Concept
definition: Herstellung von gummibasierten Materialien wie Handschuhe, Schutzmäntel, Schläuchen und Ähnliches
in scheme: mediatopic
created: 2009-10-22T02:00:00+00:00
retired: 2023-03-31T12:00:00+00:00
modified: 2023-03-31T12:00:00+00:00
broader: Verarbeitende Industrie

Nicht-alkoholische Getränke
type: Concept
definition: Herstellung nicht-alkoholischer Getränke
in scheme: mediatopic
created: 2009-10-22T02:00:00+00:00
retired: 2023-03-31T12:00:00+00:00
modified: 2023-03-31T12:00:00+00:00
broader: Verarbeitende Industrie

Textil und Bekleidung
type: Concept
definition: Produktion von Materialien für Möbel und Vorhänge und für verschiedene Sorten von Bekleidung
in scheme: mediatopic
created: 2009-10-22T02:00:00+00:00
retired: 2023-03-31T12:00:00+00:00
modified: 2023-03-31T12:00:00+00:00
broader: Verarbeitende Industrie

E-Zigarette
type: Concept
definition: Eine elektronische Zigarette ist ein batteriebetriebenes Gerät mit einem Zerstäuber und einer Patrone, die entweder eine nikotinhaltige oder eine nicht-nikotinhaltige flüssige Lösung enthält.
in scheme: mediatopic
created: 2016-04-04T12:00:00+00:00
retired: 2023-03-31T12:00:00+00:00
modified: 2023-03-31T12:00:00+00:00
broader: Verarbeitende Industrie

Glücksspielindustrie
type: Concept
definition: Das Geschäft mit dem Angebot von verschiedenen Glücksspielen, wie Kartenspiel, Würfel, Lotto, Toto, Pferdewetten.
in scheme: mediatopic
created: 2009-10-22T02:00:00+00:00
modified: 2023-03-31T12:00:00+00:00
broader: Tourismus und Freizeit

Gastgewerbe
type: Concept
definition: Angebot von Verpflegung und Unterkunft für Reisende
in scheme: mediatopic
created: 2009-10-22T02:00:00+00:00
modified: 2023-03-31T12:00:00+00:00
broader: Tourismus und Freizeit

Sport- und Freizeitartikel
type: Concept
definition: Herstellung von Waren für sportliche Freizeitaktivitäten
in scheme: mediatopic
created: 2009-10-22T02:00:00+00:00
modified: 2021-02-18T12:00:00+00:00
broader: Tourismus und Freizeit

Gaststronomie
type: Concept
definition: Das Geschäft, zubereitete Nahrung für größere und kleinere Kundenkreise anzubieten.
in scheme: mediatopic
created: 2009-10-22T02:00:00+00:00
modified: 2023-03-31T12:00:00+00:00
broader: Tourismus und Freizeit

Reiseveranstalter
type: Concept
definition: Anbieter von Reisen, sowohl vor Ort, als auch in Städte oder in andere Länder
in scheme: mediatopic
created: 2009-10-22T02:00:00+00:00
modified: 2023-03-31T12:00:00+00:00
broader: Tourismus und Freizeit

Luftverkehr
type: Concept
definition: Aktivitäten um Flugzeuge und Flughäfen.
in scheme: mediatopic
created: 2009-10-22T02:00:00+00:00
modified: 2023-03-31T12:00:00+00:00
broader: Transport

Bahn
type: Concept
definition: Geschäft mit dem Transport von Menschen und Ware auf der Schiene.
in scheme: mediatopic
created: 2009-10-22T02:00:00+00:00
modified: 2023-03-31T12:00:00+00:00
broader: Transport

Straßentransport
type: Concept
definition: Geschäft mit dem Transport von Waren durch LKWs und Straßen.
in scheme: mediatopic
created: 2009-10-22T02:00:00+00:00
modified: 2023-03-31T12:00:00+00:00
broader: Transport

Verkehrsbericht
type: Concept
definition: Verkehrsberichte und/oder Warnhinweise
in scheme: mediatopic
created: 2009-10-22T02:00:00+00:00
retired: 2023-03-31T12:00:00+00:00
modified: 2023-03-31T12:00:00+00:00
broader: Transport

Schifffahrt
type: Concept
definition: Handelsbewegung von Menschen oder Waren mit Booten und Schiffen auf dem Wasserweg
in scheme: mediatopic
created: 2009-10-22T02:00:00+00:00
modified: 2021-02-18T12:00:00+00:00
broader: Transport

Logistik
type: Concept
definition: Lieferkette, Bestandsverwaltung und Transport von Produkten.
in scheme: mediatopic
created: 2016-04-04T12:00:00+00:00
modified: 2023-03-31T12:00:00+00:00
broader: Transport

Öffentliche Verkehrsmittel
type: Concept
definition: Verkehrsmittel wie Busse und Bahnen, die feste Fahrpreise verlangen, auf festen Strecken verkehren und für die Allgemeinheit zugänglich sind
in scheme: mediatopic
created: 2022-09-23T12:00:00+00:00
modified: 2022-09-23T12:00:00+00:00
broader: Transport

Taxi und Fahrdienst
type: Concept
definition: Fahrdienste auf Abruf, die von Taxi- oder Technologieunternehmen wie Uber und Lyft angeboten werden, die Fahrer, die Fahrgäste befördern, und die Regeln und Vorschriften, die diesen Unternehmen in einer Region auferlegt werden
in scheme: mediatopic
created: 2022-09-23T12:00:00+00:00
modified: 2022-09-23T12:00:00+00:00
broader: Transport

gemeinsam genutzter Transport
type: Concept
definition: Ein Netz von Fahrzeugen wie Autos, Fahrrädern und Motorrollern, die von Reisenden bei Bedarf für eine kurzfristige Nutzung gemietet werden können
in scheme: mediatopic
created: 2022-09-23T12:00:00+00:00
modified: 2022-09-23T12:00:00+00:00
broader: Transport

Pendelverkehr
type: Concept
definition: Der Weg von und zur Arbeit, einschließlich Transportmöglichkeiten, Reisenetzwerke und Fahrgemeinschaften.
in scheme: mediatopic
created: 2009-10-22T02:00:00+00:00
modified: 2021-02-18T12:00:00+00:00
broader: Beschäftigung
broad match: http://cv.iptc.org/newscodes/subjectcode/10007000

Volkswirtschaft
type: Concept
definition: Wirtschaftsraum auf nationaler oder internationaler Ebene
in scheme: mediatopic
created: 2009-10-22T02:00:00+00:00
modified: 2024-03-28T12:00:00+00:00
broader: Wirtschaft
narrower: Anleihe
narrower: Haushalt
narrower: Kunde
narrower: Verbraucherschutz
narrower: Kredit- und Schuldensumme
narrower: Deflation
narrower: Wachstum
narrower: Konjunktur
narrower: Bruttoinlandsprodukt
narrower: Industrieproduktion
narrower: Inventur
narrower: Produktivität
narrower: Arbeitsstatistik
narrower: Export
narrower: Subvention
narrower: Staatsverschuldung
narrower: Import
narrower: Inflation
narrower: Investition
narrower: Hypothek
narrower: Preis
narrower: Rezession

Zentralbank
type: Concept
definition: Die größte Bank eines Landes, die den Zinssatz festlegt und den Austausch von Geldflüssen zwischen kommerziellen Banken steuert.
in scheme: mediatopic
created: 2009-10-22T02:00:00+00:00
modified: 2024-03-28T12:00:00+00:00
broader: Wirtschaft

Währung
type: Concept
definition: Der aktuelle Wert einer Währung im Verhältnis zu einer anderen
in scheme: mediatopic
created: 2009-10-22T02:00:00+00:00
modified: 2024-03-28T12:00:00+00:00
broader: Wirtschaft
narrower: Kryptowährung

Private Wirtschaftsorganisation
type: Concept
definition: Wirtschafts-, Industrie- und Handelsunternehmen, Gesellschaften oder andere Gruppen auf dem privaten Sektor
in scheme: mediatopic
created: 2009-10-22T02:00:00+00:00
modified: 2024-03-28T12:00:00+00:00
broader: Wirtschaft

Schwellenland
type: Concept
definition: Die Märkte die kämpfen, um den weltweiten Wirtschaftsmarkt zu erreichen und die finanzielle Hilfe fordern von internationalen Kreditgebern
in scheme: mediatopic
created: 2009-10-22T02:00:00+00:00
modified: 2024-03-28T12:00:00+00:00
broader: Wirtschaft

Internationale Wirtschaftsorganisation
type: Concept
definition: Organisationen wie UNIDO, Weltbank, WTO, etc. Die auf internationaler Ebene handeln
in scheme: mediatopic
created: 2009-10-22T02:00:00+00:00
modified: 2024-07-01T12:00:00+00:00
broader: Wirtschaft

Welthandel
type: Concept
definition: Handel von Gütern und Dienstleistungen zwischen Ländern
in scheme: mediatopic
created: 2009-10-22T02:00:00+00:00
modified: 2024-03-28T12:00:00+00:00
broader: Wirtschaft
narrower: Handelsabkommen
narrower: Handelsbilanz
narrower: Handeslstreitigkeit
narrower: Handelsbeschränkung
narrower: Zoll

Geld- und Finanzpolitik
type: Concept
definition: Durch die Regierungsbank (Bundesbank) gesteuerte Politik über die Höhe des sich im Umlauf befindenden Geldes und die Zinsraten zu denen es verliehen wird.
in scheme: mediatopic
created: 2009-10-22T02:00:00+00:00
modified: 2024-03-28T12:00:00+00:00
broader: Wirtschaft
narrower: Zinsen

Investmentfond
type: Concept
definition: Pools von Anteilen oder festverzinslichen Wertpapieren zum Verkauf, oft gesammelt mit Investitionsabsicht in Wachstum, Einkommen oder Sicherheit
in scheme: mediatopic
created: 2009-10-22T02:00:00+00:00
modified: 2024-03-28T12:00:00+00:00
broader: Wirtschaft

gemeinsame Wirtschaft
type: Concept
definition: Peer-to-Peer-basierte gemeinsame Nutzung des Zugangs zu Gütern und Dienstleistungen.
in scheme: mediatopic
created: 2016-04-04T12:00:00+00:00
modified: 2024-03-28T12:00:00+00:00
broader: Wirtschaft

Wirtschaftspolitik
type: Concept
definition: Regierungsgesteuerte Politik in Bezug auf die Produktionen, Steuern, Tarife und alles, was mit der Ausrichtung und Gesundheit der Wirtschaft zusammenhängt
in scheme: mediatopic
created: 2009-10-22T02:00:00+00:00
modified: 2025-03-31T12:00:00+00:00
broader: Regierungspolitik
narrower: Verstaatlichung
narrower: Privatisierung
narrower: Staatseigentum
narrower: Anreiz zur wirtschaftlichen Entwicklung

Verstaatlichung
type: Concept
definition: Übernahme von privaten Unternehmen oder Eigentum durch den Staat.
in scheme: mediatopic
created: 2009-10-22T02:00:00+00:00
modified: 2025-03-31T12:00:00+00:00
broader: Wirtschaftspolitik

Privatisierung
type: Concept
definition: Private Übernahme von staatlichen Unternehmen oder Staatseigentum.
in scheme: mediatopic
created: 2009-10-22T02:00:00+00:00
modified: 2025-03-31T12:00:00+00:00
broader: Wirtschaftspolitik

Staatseigentum
type: Concept
definition: Die Regierung als Besitzer von Firmen, komplett oder in Teilen
in scheme: mediatopic
created: 2009-10-22T02:00:00+00:00
modified: 2025-03-31T12:00:00+00:00
broader: Wirtschaftspolitik
broad match: http://cv.iptc.org/newscodes/subjectcode/04017001

Anreiz zur wirtschaftlichen Entwicklung
type: Concept
definition: Finanzierung, finanzielle Anreizprogramme und Subventionen zur Stimulierung von Unternehmen und Teilen der Wirtschaft
in scheme: mediatopic
created: 2020-08-05T12:00:00+00:00
modified: 2025-03-31T12:00:00+00:00
broader: Wirtschaftspolitik

Anleihe
type: Concept
definition: Firmen- oder Regierungspapier, das die Leihgabe von Geld zu einem festgelegten Preis und Zeitraum für diese Firma oder Regierung auszeichnet.
in scheme: mediatopic
created: 2009-10-22T02:00:00+00:00
retired: 2024-03-28T12:00:00+00:00
modified: 2024-03-28T12:00:00+00:00
broader: Volkswirtschaft

Haushalt
type: Concept
definition: Methode das Gleichgewicht zwischen Einnahmen und Ausgaben auszubalancieren
in scheme: mediatopic
created: 2009-10-22T02:00:00+00:00
retired: 2024-03-28T12:00:00+00:00
modified: 2024-03-28T12:00:00+00:00
broader: Volkswirtschaft

Kunde
type: Concept
definition: Käufer von Waren und Dienstleistungen
in scheme: mediatopic
created: 2009-10-22T02:00:00+00:00
retired: 2024-03-28T12:00:00+00:00
modified: 2024-03-28T12:00:00+00:00
broader: Volkswirtschaft
narrower: Verbraucher

Verbraucherschutz
type: Concept
definition: Sicherung der Zufriedenheit der Verbraucher
in scheme: mediatopic
created: 2009-10-22T02:00:00+00:00
modified: 2024-03-28T12:00:00+00:00
broader: Volkswirtschaft

Kredit- und Schuldensumme
type: Concept
definition: Kredit: Geldmenge, die jemandem zur Verfügung steht, meistens als Leihgabe. Schulden: Geldmenge, die jemand schuldig ist.
in scheme: mediatopic
created: 2009-10-22T02:00:00+00:00
retired: 2024-03-28T12:00:00+00:00
modified: 2024-03-28T12:00:00+00:00
broader: Volkswirtschaft

Deflation
type: Concept
definition: Senkung der Preise
in scheme: mediatopic
created: 2009-10-22T02:00:00+00:00
modified: 2024-03-28T12:00:00+00:00
broader: Volkswirtschaft
broad match: http://cv.iptc.org/newscodes/subjectcode/04008016

Wachstum
type: Concept
definition: Ansteigen des BIP
in scheme: mediatopic
created: 2009-10-22T02:00:00+00:00
modified: 2024-03-28T12:00:00+00:00
broader: Volkswirtschaft
broad match: http://cv.iptc.org/newscodes/subjectcode/04000000

Konjunktur
type: Concept
definition: Verschiedene Indizes, wie Warenbestände von Unternehmen, Preisbewegungen, die anzeigen, ob die Wirtschaftslage sich verbessert oder verschlechtert
in scheme: mediatopic
created: 2009-10-22T02:00:00+00:00
retired: 2024-03-28T12:00:00+00:00
modified: 2024-03-28T12:00:00+00:00
broader: Volkswirtschaft

Bruttoinlandsprodukt
type: Concept
definition: Messlatte des Ökonomischen Zustands einer Region, deutsch: BIP englisch: GDP
in scheme: mediatopic
created: 2009-10-22T02:00:00+00:00
modified: 2024-03-28T12:00:00+00:00
broader: Volkswirtschaft
broad match: http://cv.iptc.org/newscodes/subjectcode/04000000

Industrieproduktion
type: Concept
definition: Produktion von nachhaltigen und kurzlebigen Produkten
in scheme: mediatopic
created: 2009-10-22T02:00:00+00:00
modified: 2024-03-28T12:00:00+00:00
broader: Volkswirtschaft

Inventur
type: Concept
definition: Unverkaufte Güter, die von Produktionsfirmen, Warenhäusern und Einzelhändlern zurückbehalten wurden
in scheme: mediatopic
created: 2009-10-22T02:00:00+00:00
modified: 2024-03-28T12:00:00+00:00
broader: Volkswirtschaft

Produktivität
type: Concept
definition: Messlatte für die Produktion von Gütern oder Dienstleistungen
in scheme: mediatopic
created: 2009-10-22T02:00:00+00:00
modified: 2024-03-28T12:00:00+00:00
broader: Volkswirtschaft

Arbeitsstatistik
type: Concept
definition: Statistiken über Beschäftigung
in scheme: mediatopic
created: 2009-10-22T02:00:00+00:00
modified: 2024-03-28T12:00:00+00:00
broader: Volkswirtschaft
broad match: http://cv.iptc.org/newscodes/subjectcode/04008000

Export
type: Concept
definition: Alles was im eigenen Land hergestellt und produziert und überallhin verkauft und versendet wird
in scheme: mediatopic
created: 2009-10-22T02:00:00+00:00
modified: 2024-03-28T12:00:00+00:00
broader: Volkswirtschaft

Subvention
type: Concept
definition: Finanzielle und andere Unterstützung durch eine Regierung, in der Regel Unterstützung einer anderen Regierung.
in scheme: mediatopic
created: 2009-10-22T02:00:00+00:00
retired: 2024-03-28T12:00:00+00:00
modified: 2024-03-28T12:00:00+00:00
broader: Volkswirtschaft

Staatsverschuldung
type: Concept
definition: Die Menge, die eine Regierung an festverzinslichen Wertpapieren, Dienstleistungen und Waren schuldet und Leistungen für die sie kein Bargeld zahlen kann
in scheme: mediatopic
created: 2009-10-22T02:00:00+00:00
modified: 2024-03-28T12:00:00+00:00
broader: Volkswirtschaft

Import
type: Concept
definition: Alles was im Ausland erworben und zum Wiederverkauf ins Land gebraucht wurde
in scheme: mediatopic
created: 2009-10-22T02:00:00+00:00
modified: 2024-03-28T12:00:00+00:00
broader: Volkswirtschaft

Inflation
type: Concept
definition: Preissteigerung
in scheme: mediatopic
created: 2009-10-22T02:00:00+00:00
modified: 2024-03-28T12:00:00+00:00
broader: Volkswirtschaft
broad match: http://cv.iptc.org/newscodes/subjectcode/04008016

Investition
type: Concept
definition: Spekulative Käufe von kollektiven Maschinen, Rohstoffen, Währungen oder Teilen davon
in scheme: mediatopic
created: 2009-10-22T02:00:00+00:00
retired: 2024-03-28T12:00:00+00:00
modified: 2024-03-28T12:00:00+00:00
broader: Volkswirtschaft

Hypothek
type: Concept
definition: Darlehen mit der Absicht Eigentum zu kaufen, sowohl Land als auch Gebäude. Oder für Hausbesitzer um den Besitz zu renovieren oder instand zu halten, meist basierend auf Eigenkapital in Form von Eigentum.
in scheme: mediatopic
created: 2009-10-22T02:00:00+00:00
modified: 2024-03-28T12:00:00+00:00
broader: Volkswirtschaft

Preis
type: Concept
definition: Der Geldwert von Waren, Dienstleistungen oder Aktien und Anleihen
in scheme: mediatopic
created: 2009-10-22T02:00:00+00:00
retired: 2024-03-28T12:00:00+00:00
modified: 2024-03-28T12:00:00+00:00
broader: Volkswirtschaft

Rezession
type: Concept
definition: Ein Abfall des BIP/GDP über zwei Quartale
in scheme: mediatopic
created: 2009-10-22T02:00:00+00:00
modified: 2024-03-28T12:00:00+00:00
broader: Volkswirtschaft
broad match: http://cv.iptc.org/newscodes/subjectcode/04000000

Unternehmertum
type: Concept
definition: Der Prozess der Konzeption, Gründung und Führung eines neuen Unternehmens.
in scheme: mediatopic
created: 2016-04-04T12:00:00+00:00
modified: 2024-03-28T12:00:00+00:00
broader: Unternehmen

kleine und mittlere Unternehmen
type: Concept
definition: Ein kleines und mittleres Unternehmen (KMU) ist ein Unternehmen, dessen Mitarbeiterzahl, Bilanz und Umsatz bestimmte, vom Land, in dem es ansässig ist, festgelegte Grenzen nicht überschreiten dürfen.
in scheme: mediatopic
created: 2016-04-04T12:00:00+00:00
modified: 2024-03-28T12:00:00+00:00
broader: Unternehmen

Kooperative
type: Concept
definition: Eine Organisation, die sich im Besitz ihrer Mitglieder befindet und von ihnen gemeinsam geführt wird, die den Gewinn oder Nutzen ihrer Arbeit teilen
in scheme: mediatopic
created: 2019-10-07T12:00:00+00:00
modified: 2021-07-12T12:00:00+00:00
broader: Unternehmen

Verbraucher
type: Concept
definition: Preise, Inflation/Deflation, Warenqualität auf der Einzelhandelsebene
in scheme: mediatopic
created: 2009-10-22T02:00:00+00:00
retired: 2024-03-28T12:00:00+00:00
modified: 2024-03-28T12:00:00+00:00
broader: Kunde

Kryptowährung
type: Concept
definition: Ein internetbasiertes Tauschmittel, das Kryptographie zur Durchführung finanzieller Transaktionen verwendet
in scheme: mediatopic
created: 2019-10-07T12:00:00+00:00
modified: 2021-07-12T12:00:00+00:00
broader: Währung

Zinsen
type: Concept
definition: Die Menge des Geldes, die jemand für geliehenes Geld zahlen muss
in scheme: mediatopic
created: 2009-10-22T02:00:00+00:00
modified: 2024-03-28T12:00:00+00:00
broader: Geld- und Finanzpolitik

Handelsabkommen
type: Concept
definition: Verträge zwischen Ländern auf Regierungsebene für den An- und Verkauf von Gütern und Dienstleistungen
in scheme: mediatopic
created: 2009-10-22T02:00:00+00:00
modified: 2024-03-28T12:00:00+00:00
broader: Welthandel

Handelsbilanz
type: Concept
definition: Die finanzielle Differenz zwischen Import und Export in Bezug auf den Warenwert
in scheme: mediatopic
created: 2009-10-22T02:00:00+00:00
modified: 2024-03-28T12:00:00+00:00
broader: Welthandel

Handeslstreitigkeit
type: Concept
definition: Internationale Streitigkeiten über Handelsbeschränkungen, Kartelle, Dumping etc.
in scheme: mediatopic
created: 2009-10-22T02:00:00+00:00
modified: 2024-03-28T12:00:00+00:00
broader: Welthandel

Handelsbeschränkung
type: Concept
definition: Regierungsentscheidungen über Tarife, Verschiffung, Embargos und welche Güter und Dienstleistungen
in scheme: mediatopic
created: 2009-10-22T02:00:00+00:00
modified: 2024-03-28T12:00:00+00:00
broader: Welthandel

Zoll
type: Concept
definition: Gebühren, die auf importierte und exportierte Waren erhoben werden, meist strafend.
in scheme: mediatopic
created: 2009-10-22T02:00:00+00:00
modified: 2024-03-28T12:00:00+00:00
broader: Welthandel

Warenbörse
type: Concept
definition: Tauschgeschäft und Verkauf von Waren, wie Baumwolle, Öl, Kohle, Metalle etc.
in scheme: mediatopic
created: 2009-10-22T02:00:00+00:00
modified: 2024-03-28T12:00:00+00:00
broader: Markt und Börse
narrower: Energie
narrower: Metall
narrower: Obligation

Kapitalmarkt
type: Concept
definition: Markt für den Handel mit Schuldeninstrumentarien wie Wertpapiere, Banksicherheiten, Bargeld etc.
in scheme: mediatopic
created: 2009-10-22T02:00:00+00:00
modified: 2024-03-28T12:00:00+00:00
broader: Markt und Börse

Devisenmarkt
type: Concept
definition: Der Welthandel mit Schekel, Dinar, Euro, Dollar etc. auf geregelten Märkten
in scheme: mediatopic
created: 2009-10-22T02:00:00+00:00
modified: 2024-03-28T12:00:00+00:00
broader: Markt und Börse

Kreditmarkt
type: Concept
definition: Markt, auf dem Geld erhältlich ist zu bestimmten Leihkonditionen
in scheme: mediatopic
created: 2009-10-22T02:00:00+00:00
modified: 2024-03-28T12:00:00+00:00
broader: Markt und Börse

Energie
type: Concept
definition: Energiehandel und Energiemarkt.
in scheme: mediatopic
created: 2009-10-22T02:00:00+00:00
modified: 2024-03-28T12:00:00+00:00
broader: Warenbörse

Metall
type: Concept
definition: Märkte um Metalle wie Kupfer, Aluminium, Stahl und Zink etc. zu handeln
in scheme: mediatopic
created: 2009-10-22T02:00:00+00:00
modified: 2021-02-18T12:00:00+00:00
broader: Warenbörse

Obligation
type: Concept
definition: Handel mit Rohstoffen wie Baumwolle, Zucker, Zuckerrohr, Sojabohnen etc.
in scheme: mediatopic
created: 2009-10-22T02:00:00+00:00
retired: 2023-10-02T12:00:00+00:00
modified: 2024-03-28T12:00:00+00:00
broader: Warenbörse

Kredit
type: Concept
definition: Eine Übereinkunft zwischen zwei Einzelpersonen oder Institutionen für einen begrenzten Zeitraum Geld zu verleihen zu einer vereinbarten Rate innerhalb eines Rückzahlungszeitraums
in scheme: mediatopic
created: 2009-10-22T02:00:00+00:00
modified: 2024-03-28T12:00:00+00:00
broader: Finanzdienstleistung

Derivate
type: Concept
definition: Finanzinstrumente, wie Futures, Swaps und Optionen, die für das Risikomanagement genutzt werden und deren Wert sich nach den Kursschwankungen oder den Preiserwartungen richten, wie Rohstoffe, festverzinsliche Wertpapiere, Dividende
in scheme: mediatopic
created: 2009-10-22T02:00:00+00:00
modified: 2023-03-31T12:00:00+00:00
broader: Aktien

Aktienempfehlung
type: Concept
definition: Empfehlung eines Analysten für bestimmte Aktien. Kann das Kursziel des Analysten für die Aktie beinhalten.
in scheme: mediatopic
created: 2012-10-04T12:00:00+00:00
retired: 2023-03-31T12:00:00+00:00
modified: 2023-03-31T12:00:00+00:00
broader: Aktien
narrower: Kaufen (Empfehlung)
narrower: Halten (Empfehlung)
narrower: Verkaufen (Empfehlung)

Gefragte Aktie
type: Concept
definition: Bemerkenswerte Kursbewegungen einer bestimmten Aktie.
in scheme: mediatopic
created: 2012-10-04T12:00:00+00:00
retired: 2023-03-31T12:00:00+00:00
modified: 2023-03-31T12:00:00+00:00
broader: Aktien

Grundschule
type: Concept
definition: Schulen für die Altersgruppe vom Kindergartenalter bis zu den 11 oder 12-jährigen.
in scheme: mediatopic
created: 2009-10-22T02:00:00+00:00
modified: 2021-09-30T12:00:00+00:00
broader: Schule

Weiterbildung
type: Concept
definition: Jede Form der Ausbildung auf verschiedenen Ebenen, neben der Grundausbildung.
in scheme: mediatopic
created: 2009-10-22T02:00:00+00:00
retired: 2021-09-30T12:00:00+00:00
modified: 2021-09-30T12:00:00+00:00
broader: Schule

Erwachsenenbildung
type: Concept
definition: Ausbildung für ältere Lernende außerhalb der gewöhnlichen Altersgruppe der 5-25-jährigen.
in scheme: mediatopic
created: 2009-10-22T02:00:00+00:00
modified: 2024-07-01T12:00:00+00:00
broader: Schule

Gymnasium
type: Concept
definition: Universitätsvorbereitung für die 16 bis 18 oder 19-jährigen mit Abiturabschluss.
in scheme: mediatopic
created: 2009-10-22T02:00:00+00:00
modified: 2021-09-30T12:00:00+00:00
broader: Schule

Hochschule
type: Concept
definition: Ausbildung oberhalb des zweiten Levels, meist erwartet von Fachhochschulen und Universitäten, die in einer professionellen Qualifikation oder einem akademischen Grad führt
in scheme: mediatopic
created: 2009-10-22T02:00:00+00:00
modified: 2021-09-30T12:00:00+00:00
broader: Schule
narrower: Fachhochschule
narrower: Universität
broad match: http://cv.iptc.org/newscodes/subjectcode/05000000

Haupt-und Realschule
type: Concept
definition: Schule für die Altersgruppe der 11 bis 15-jährigen.
in scheme: mediatopic
created: 2009-10-22T02:00:00+00:00
modified: 2021-09-30T12:00:00+00:00
broader: Schule

Vorschule/Kindergarten
type: Concept
definition: Erziehung für Kinder unterhalb des nationalen regulären Schulalters.
in scheme: mediatopic
created: 2009-10-22T02:00:00+00:00
modified: 2021-09-30T12:00:00+00:00
broader: Schule

Religionsschulen
type: Concept
definition: Schulen, die Unterricht über einen bestimmten religiösen Glauben anbieten oder sich von den Prinzipien dieses Glaubens leiten lassen
in scheme: mediatopic
created: 2019-04-06T12:00:00+00:00
modified: 2021-09-30T12:00:00+00:00
broader: Schule

Öffentliche Schulen
type: Concept
definition: Schulen, die aus öffentlichen Mitteln, in der Regel von der Regierung auferlegte Steuern, unterhalten werden
in scheme: mediatopic
created: 2019-04-06T12:00:00+00:00
modified: 2021-09-30T12:00:00+00:00
broader: Schule

Privatschulen
type: Concept
definition: Schulen, die von privaten Fonds und Organisationen unterhalten werden
in scheme: mediatopic
created: 2019-04-06T12:00:00+00:00
modified: 2021-09-30T12:00:00+00:00
broader: Schule

Freie Schulen
type: Concept
definition: Schulen, die mit Steuergeldern über die Regierung finanziert, aber von Unternehmen, Organisationen oder Genossenschaften betrieben werden
in scheme: mediatopic
created: 2019-04-06T12:00:00+00:00
modified: 2021-09-30T12:00:00+00:00
broader: Schule

Fachhochschule
type: Concept
definition: Institution der Lehre auf höherer Ebene, spezielle Form variiert von Land zu Land
in scheme: mediatopic
created: 2009-10-22T02:00:00+00:00
retired: 2021-09-30T12:00:00+00:00
modified: 2021-09-30T12:00:00+00:00
broader: Hochschule
broad match: http://cv.iptc.org/newscodes/subjectcode/05000000

Universität
type: Concept
definition: Institution der Lehre auf höherer Ebene, geeignet um Doktoren- und Professorentitel etc. zu verleihen.
in scheme: mediatopic
created: 2009-10-22T02:00:00+00:00
retired: 2021-09-30T12:00:00+00:00
modified: 2021-09-30T12:00:00+00:00
broader: Hochschule

Klimaerwärmung
type: Concept
definition: Diese Kategorie umfasst alle Probleme, in Bezug auf die globale Erwärmung, inklusive Klimaforschung, Ferndiagnose von Temperaturentwicklungen, Debatten um die Erderwärmung und Wege die Schadstoffemission und den Kohlenstoffgehalt zu verringern.
in scheme: mediatopic
created: 2009-10-22T02:00:00+00:00
retired: 2025-06-30T12:00:00+00:00
modified: 2025-06-30T12:00:00+00:00
broader: Klimaveränderung

Energiesparen
type: Concept
definition: Erhaltung elektronischer und anderer Energiequellen.
in scheme: mediatopic
created: 2009-10-22T02:00:00+00:00
retired: 2025-06-30T12:00:00+00:00
modified: 2025-06-30T12:00:00+00:00
broader: Naturschutz

Naturschutzgebiet
type: Concept
definition: Areale die für den Naturschutz geschaffen werden
in scheme: mediatopic
created: 2009-10-22T02:00:00+00:00
modified: 2025-06-30T12:00:00+00:00
broader: Naturschutz

Umweltpolitik
type: Concept
definition: Die Debatte um umweltpolitische Fragen
in scheme: mediatopic
created: 2009-10-22T02:00:00+00:00
modified: 2025-03-31T12:00:00+00:00
broader: Regierungspolitik

Luftverschmutzung
type: Concept
definition: Feste und gasförmige Stoffe, die die Qualität der Luft, die wir atmen beeinflusst
in scheme: mediatopic
created: 2009-10-22T02:00:00+00:00
modified: 2025-10-09T12:00:00+00:00
broader: Umweltverschmutzung

Umweltsäuberung
type: Concept
definition: Prozess bei dem verseuchte Gebiete von schädlichem Material gereinigt werden, sodass diese wieder bewohnbar sind für Menschen und Tiere.
in scheme: mediatopic
created: 2009-10-22T02:00:00+00:00
modified: 2025-10-09T12:00:00+00:00
broader: Umweltverschmutzung

Giftstoff
type: Concept
definition: Materialien, die für Mensch und Tier gefährlich sind, wenn diese mit ihnen in Kontakt kommen. Umfasst Radioaktivität, giftige Gase, Chemikalien, Schwermetalle, PCBs, und bestimmte pflanzliche Produkte.
in scheme: mediatopic
created: 2009-10-22T02:00:00+00:00
modified: 2025-10-09T12:00:00+00:00
broader: Umweltverschmutzung

Abfall
type: Concept
definition: Umweltbelastung durch Müll, inklusive Wiederverwertung
in scheme: mediatopic
created: 2009-10-22T02:00:00+00:00
modified: 2025-10-09T12:00:00+00:00
broader: Umweltverschmutzung

Wasserverschmutzung
type: Concept
definition: Feste und flüssige Stoffe, die die Qualität des Wassers verschlechtern, was als Trinkwasser oder zur Bewässerung genutzt werden könnte.
in scheme: mediatopic
created: 2009-10-22T02:00:00+00:00
modified: 2025-10-09T12:00:00+00:00
broader: Umweltverschmutzung

Rohstoff
type: Concept
definition: Rohstoffe wie Kohle, Gas, Wind, Sonne, die genutzt werden um Wärme, Elektrizität und Strom zu erzeugen.
in scheme: mediatopic
created: 2009-10-22T02:00:00+00:00
retired: 2025-06-30T12:00:00+00:00
modified: 2025-06-30T12:00:00+00:00
broader: Ressourcen

Land
type: Concept
definition: Der Teil eines Landes oder Staates, der oberhalb des Wassers liegt und zur Verfügung steht, sowohl für Profitzwecke als auch zur öffentlichen Nutzung
in scheme: mediatopic
created: 2009-10-22T02:00:00+00:00
retired: 2025-06-30T12:00:00+00:00
modified: 2025-06-30T12:00:00+00:00
broader: Ressourcen

Bevölkerungsentwicklung
type: Concept
definition: Wachstum und Entwicklung der Menschen innerhalb einer natürlichen Umgebung.
in scheme: mediatopic
created: 2009-10-22T02:00:00+00:00
retired: 2025-06-30T12:00:00+00:00
modified: 2025-06-30T12:00:00+00:00
broader: Ressourcen

Erneuerbare Energien
type: Concept
definition: Artikel über das Vorkommen von erneuerbaren Energien in der Umwelt, wie Solar, Wind, Wasser, Biomasse und Erdwärme
in scheme: mediatopic
created: 2009-10-22T02:00:00+00:00
retired: 2023-03-31T12:00:00+00:00
modified: 2023-03-31T12:00:00+00:00
broader: Ressourcen

Wasser
type: Concept
definition: Umweltprobleme von Wassereinheiten, inklusive Meere, Seen, Flüsse und Reservoire, sowie Eis, Gletscher und Formen des Niederschlags
in scheme: mediatopic
created: 2009-10-22T02:00:00+00:00
retired: 2025-10-09T12:00:00+00:00
modified: 2021-02-18T12:00:00+00:00
broader: Ressourcen

Wald
type: Concept
definition: Öffentliche Baumgebiete, die sowohl zur Erholung oder für kommerzielle Zwecke genutzt werden.
in scheme: mediatopic
created: 2009-10-22T02:00:00+00:00
modified: 2025-06-30T12:00:00+00:00
broader: Natur

Berg
type: Concept
definition: Erhöhte Landmassen, die sich über die Jahre durch Erosion, Vulkanausbrüche, oder aus der Bewegung massiver geografischer Formationen, Platten genannt, gebildet haben.
in scheme: mediatopic
created: 2009-10-22T02:00:00+00:00
modified: 2025-06-30T12:00:00+00:00
broader: Natur

Ozean
type: Concept
definition: Salzwassermassen, die Kontinente oder andere große geografische Landmassen trennen. Kleinere Formen sind, Meere, Seen und Teiche
in scheme: mediatopic
created: 2009-10-22T02:00:00+00:00
modified: 2025-06-30T12:00:00+00:00
broader: Natur

Fluß
type: Concept
definition: Fließende Wassermassen durch Land begrenzt, die aus Quellen in der Erde entstehen, sich durch Landflächen schlängeln und mit anderen Wasserläufen verbinden. Kleine Formen sind Bäche, Rinnsale und Ströme.
in scheme: mediatopic
created: 2009-10-22T02:00:00+00:00
modified: 2025-06-30T12:00:00+00:00
broader: Natur

Feuchtgebiet
type: Concept
definition: Gebiete die im Allgemeinen feucht sind und weder unter Wasser liegen, noch trockenes Land sind. Oft wasserführend für die Wasserqualität oder Wildnis.
in scheme: mediatopic
created: 2009-10-22T02:00:00+00:00
modified: 2025-06-30T12:00:00+00:00
broader: Natur

Ökosystem
type: Concept
definition: Ein System von Pflanzen, Tieren und Bakterien zusammenhängend in physikalischer und chemischer Umgebung
in scheme: mediatopic
created: 2009-10-22T02:00:00+00:00
modified: 2025-10-09T12:00:00+00:00
broader: Natur

Artenschutz
type: Concept
definition: Die Arten der Wildnis, die vom Aussterben bedroht sind, meist aufgrund sich ändernder Umweltbedingungen, Jagd oder Wetter
in scheme: mediatopic
created: 2009-10-22T02:00:00+00:00
modified: 2025-10-09T12:00:00+00:00
broader: Natur

Invasive Arten
type: Concept
definition: Nicht-einheimische Pflanzen, Tiere und andere Organismen, die einheimische Arten oft vertreiben
in scheme: mediatopic
created: 2009-10-22T02:00:00+00:00
modified: 2025-10-09T12:00:00+00:00
broader: Natur

Tier
type: Concept
definition: Tiere mit Blick auf emotionale Aspekte
in scheme: mediatopic
created: 2009-10-22T02:00:00+00:00
modified: 2025-10-09T12:00:00+00:00
broader: Natur
narrower: Tierkrankheit
narrower: Schädlinge

Pflanze
type: Concept
definition: Pflanzen mit Blick auf emotionale Aspekte
in scheme: mediatopic
created: 2009-10-22T02:00:00+00:00
modified: 2025-10-09T12:00:00+00:00
broader: Natur
narrower: Pflanzenkrankheit

Krebs
type: Concept
definition: Eine ernsthafte und meist tödliche Krankheit, bei der sich Zellen zu Tumoren entwickeln
in scheme: mediatopic
created: 2009-10-22T02:00:00+00:00
modified: 2021-02-18T12:00:00+00:00
broader: Krankheit

Ansteckende Krankheit
type: Concept
definition: Krankheiten, die von einem Menschen oder Tier zu einem anderen übertragen werden können
in scheme: mediatopic
created: 2009-10-22T02:00:00+00:00
modified: 2021-02-18T12:00:00+00:00
broader: Krankheit
narrower: Epidemie
narrower: Viruserkrankung

Herzkrankheit
type: Concept
definition: Eine verbreitete und ernsthafte Krankheit, verursacht durch die Verengung der Gefäße, die das Herz versorgen.
in scheme: mediatopic
created: 2009-10-22T02:00:00+00:00
modified: 2022-06-14T12:00:00+00:00
broader: Krankheit

Leiden
type: Concept
definition: Unspezifische Krankheiten wie Magenschmerzen, Kopfschmerzen, Plattfüße, Hexenschuss.
in scheme: mediatopic
created: 2009-10-22T02:00:00+00:00
retired: 2022-06-14T12:00:00+00:00
modified: 2022-06-14T12:00:00+00:00
broader: Krankheit

Invalidität
type: Concept
definition: Eine traumatische körperliche Beeinträchtigung, verursacht durch äußerliche Gewalteinwirkung.
in scheme: mediatopic
created: 2009-10-22T02:00:00+00:00
modified: 2022-06-14T12:00:00+00:00
broader: Krankheit

Krankheitsverlauf
type: Concept
definition: Verschiedene Stadien von Krankheit, Leiden oder Verletzung.
in scheme: mediatopic
created: 2009-10-22T02:00:00+00:00
modified: 2024-07-01T12:00:00+00:00
broader: Krankheit
narrower: Übergewicht

Psychische Krankheit
type: Concept
definition: Die Krankheiten, die die Psyche und das Verhalten betreffen
in scheme: mediatopic
created: 2009-10-22T02:00:00+00:00
modified: 2022-06-14T12:00:00+00:00
broader: Krankheit
narrower: Essstörung
narrower: Depression
narrower: Angst und Stress
broad match: http://cv.iptc.org/newscodes/subjectcode/07000000

Vergiftung
type: Concept
definition: Wenn eine Substanz in ausreichender Menge den Körper und seine Funktionen nachteilig beeinflusst
in scheme: mediatopic
created: 2021-05-05T12:00:00+00:00
modified: 2021-12-21T12:00:00+00:00
broader: Krankheit

Entwicklungsstörung
type: Concept
definition: Bedingungen aufgrund einer Beeinträchtigung in den Bereichen Lernen, Sprache oder Verhalten, wie z. B. Autismus, Asperger und Legasthenie
in scheme: mediatopic
created: 2022-06-14T12:00:00+00:00
modified: 2022-06-14T12:00:00+00:00
broader: Krankheit

Epidemie
type: Concept
definition: Eine Epidemie ist ein sich in einer Gemeinschaft rasch verbreitender Zustand, eine Plage ist eine meist tödliche Krankheit mit epidemischer Verbreitung.
in scheme: mediatopic
created: 2009-10-22T02:00:00+00:00
modified: 2022-06-14T12:00:00+00:00
broader: Ansteckende Krankheit
narrower: Pest (Krankheit)
narrower: Pandemie
broad match: http://cv.iptc.org/newscodes/subjectcode/07002000

Viruserkrankung
type: Concept
definition: Krankheiten, ausgelöst durch Infektionen innerhalb der Zellen durch Viren.
in scheme: mediatopic
created: 2009-10-22T02:00:00+00:00
modified: 2022-06-14T12:00:00+00:00
broader: Ansteckende Krankheit
narrower: AIDS
narrower: Retrovirus

Pest (Krankheit)
type: Concept
definition: Eine hochansteckende Seuche, die meist durch Ratten oder Flohbisse übertragen wird
in scheme: mediatopic
created: 2009-10-22T02:00:00+00:00
retired: 2022-06-14T12:00:00+00:00
modified: 2022-06-14T12:00:00+00:00
broader: Epidemie
broad match: http://cv.iptc.org/newscodes/subjectcode/07002000

Pandemie
type: Concept
definition: Eine Epidemie von Infektionskrankheiten, die sich über eine große Region oder sogar weltweit ausgebreitet hat
in scheme: mediatopic
created: 2019-04-06T12:00:00+00:00
retired: 2022-06-14T12:00:00+00:00
modified: 2022-06-14T12:00:00+00:00
broader: Epidemie

AIDS
type: Concept
definition: Acquired Immunity Deficiency Syndrome, eine unheilbare Krankheit verursacht durch HIV.
in scheme: mediatopic
created: 2009-10-22T02:00:00+00:00
modified: 2022-06-14T12:00:00+00:00
broader: Viruserkrankung

Retrovirus
type: Concept
definition: Familie des RNA Virus, wie der, der Leukämie und Aids verursacht
in scheme: mediatopic
created: 2009-10-22T02:00:00+00:00
retired: 2022-06-14T12:00:00+00:00
modified: 2022-06-14T12:00:00+00:00
broader: Viruserkrankung

Übergewicht
type: Concept
definition: Zustand des Körpergewichts, der 20 Prozent über dem Normalgewicht liegt, je nach Geschlecht, Alter und Größe und Körperbau.
in scheme: mediatopic
created: 2009-10-22T02:00:00+00:00
modified: 2022-06-14T12:00:00+00:00
broader: Krankheitsverlauf

Essstörung
type: Concept
definition: Magersucht, Bulimie, Adipositas und vergleichbare Krankheiten
in scheme: mediatopic
created: 2009-10-22T02:00:00+00:00
modified: 2021-02-18T12:00:00+00:00
broader: Psychische Krankheit

Depression
type: Concept
definition: Eine psychische Krankheit, die durch eine anhaltend gedrückte Stimmung und den Verlust des Interesses an Aktivitäten gekennzeichnet ist und zu erheblichen Beeinträchtigungen im täglichen Leben führt
in scheme: mediatopic
created: 2022-06-14T12:00:00+00:00
modified: 2022-06-14T12:00:00+00:00
broader: Psychische Krankheit

Angst und Stress
type: Concept
definition: Eine psychische Störung, die durch Gefühle der Sorge, Ängstlichkeit oder Furcht gekennzeichnet ist, die stark genug sind, um die täglichen Aktivitäten zu beeinträchtigen
in scheme: mediatopic
created: 2022-06-14T12:00:00+00:00
modified: 2022-06-14T12:00:00+00:00
broader: Psychische Krankheit

Krankenhaus
type: Concept
definition: Medizinische Einrichtung zur Behandlung von Krankheiten und Verletzungen.
in scheme: mediatopic
created: 2009-10-22T02:00:00+00:00
modified: 2021-05-05T12:00:00+00:00
broader: Gesundheitseinrichtung

Gesundheitsklinik
type: Concept
definition: Örtliche medizinische Einrichtung oder Arztpraxis in Verbindung mit einer allgemeinmedizinischen Praxis, die mit einem oder mehreren Ärzten besetzt ist, sich auf ambulante Behandlung konzentriert oder Empfehlungen für den Besuch eines Facharztes oder Krankenhauses ausspricht
in scheme: mediatopic
created: 2019-04-06T12:00:00+00:00
modified: 2021-07-12T12:00:00+00:00
broader: Gesundheitseinrichtung

Diät
type: Concept
definition: Kontrollierter Konsum von Nahrungsmitteln
in scheme: mediatopic
created: 2009-10-22T02:00:00+00:00
modified: 2022-06-14T12:00:00+00:00
broader: Medizinische Behandlung
narrower: Diätische Ergänzung

Medizinische Droge
type: Concept
definition: Chemische Substanzen, die für die Diagnose, Behandlung oder Prävention von physischen und psychischen Krankheiten genutzt werden
in scheme: mediatopic
created: 2009-10-22T02:00:00+00:00
modified: 2022-06-14T12:00:00+00:00
broader: Medizinische Behandlung
broad match: http://cv.iptc.org/newscodes/subjectcode/07000000

Droge auf Rezept
type: Concept
definition: Drogen, die ausschließlich mit der Erlaubnis des Arztes verabreicht werden dürfen
in scheme: mediatopic
created: 2009-10-22T02:00:00+00:00
modified: 2022-06-14T12:00:00+00:00
broader: Medizinische Behandlung

Medizinische Untersuchung
type: Concept
definition: Jede Variation der Behandlung wie Stresstests, Katheterisieren, Bluttests, CT oder MCR.
in scheme: mediatopic
created: 2009-10-22T02:00:00+00:00
modified: 2022-06-14T12:00:00+00:00
broader: Medizinische Behandlung

Medikament
type: Concept
definition: Ein Mittel, das verabreicht wird in der Hoffnung ein Leiden oder eine Krankheit zu heilen
in scheme: mediatopic
created: 2009-10-22T02:00:00+00:00
modified: 2022-06-14T12:00:00+00:00
broader: Medizinische Behandlung
narrower: Homöopathie
narrower: Ganzheitliche Medizin
narrower: Chinesische Medizin (TCM)
narrower: Schulmedizin

Fitness
type: Concept
definition: Körperliche Kondition
in scheme: mediatopic
created: 2009-10-22T02:00:00+00:00
retired: 2022-06-14T12:00:00+00:00
modified: 2022-06-14T12:00:00+00:00
broader: Medizinische Behandlung

Vorsorge
type: Concept
definition: Stoffe, die zur Vorbeugung von Krankheiten genutzt werden.
in scheme: mediatopic
created: 2009-10-22T02:00:00+00:00
retired: 2022-06-14T12:00:00+00:00
modified: 2022-06-14T12:00:00+00:00
broader: Medizinische Behandlung

Impfung
type: Concept
definition: Medikamente, die erzeugt werden um gegen Krankheiten immun zu werden.
in scheme: mediatopic
created: 2009-10-22T02:00:00+00:00
modified: 2022-06-14T12:00:00+00:00
broader: Medizinische Behandlung

Therapie
type: Concept
definition: Behandlung der physischen, mentalen oder medizinischen Kondition mit nicht-chirurgischen Mitteln.
in scheme: mediatopic
created: 2009-10-22T02:00:00+00:00
modified: 2021-02-18T12:00:00+00:00
broader: Medizinische Behandlung

Drogentherapie
type: Concept
definition: Medizinische oder psychotherapeutische Behandlung der Abhängigkeit von psychoaktiven Substanzen wie Alkohol, verschreibungspflichtigen Drogen und Straßendrogen
in scheme: mediatopic
created: 2019-04-06T12:00:00+00:00
modified: 2022-06-14T12:00:00+00:00
broader: Medizinische Behandlung

Notfallversorgung
type: Concept
definition: Die Akutversorgung von Patienten, die mit einem medizinischen Notfall entweder mit ihren eigenen Mitteln oder mit denen eines Krankenwagens ankommen
in scheme: mediatopic
created: 2019-04-06T12:00:00+00:00
modified: 2022-06-14T12:00:00+00:00
broader: Medizinische Behandlung

Chirurgie
type: Concept
definition: Die Verwendung von Einschnitten durch medizinische Instrumente zur Untersuchung oder Behandlung einer Erkrankung oder Verletzung
in scheme: mediatopic
created: 2019-04-06T12:00:00+00:00
modified: 2021-07-12T12:00:00+00:00
broader: Medizinische Behandlung

Diätische Ergänzung
type: Concept
definition: Nährstoffe, die der Nahrung beigefügt werden zur Förderung der Gesundheit
in scheme: mediatopic
created: 2009-10-22T02:00:00+00:00
modified: 2022-06-14T12:00:00+00:00
broader: Diät

Homöopathie
type: Concept
definition: Behandlung, die auf der Nutzung von Kräutern und anderen Pflanzen beruht, um Krankheitssymptomen vorzubeugen oder zu heilen
in scheme: mediatopic
created: 2009-10-22T02:00:00+00:00
modified: 2022-06-14T12:00:00+00:00
broader: Medikament

Ganzheitliche Medizin
type: Concept
definition: Behandlung der gesamten Person, unter Einbeziehung mentaler und sozialer Faktoren, eher als die Krankheitssymptome selbst.
in scheme: mediatopic
created: 2009-10-22T02:00:00+00:00
modified: 2022-06-14T12:00:00+00:00
broader: Medikament

Chinesische Medizin (TCM)
type: Concept
definition: Diagnose, Behandlung und Prävention von Krankheiten basierend auf traditionellen Methoden aus dem Orient
in scheme: mediatopic
created: 2009-10-22T02:00:00+00:00
modified: 2022-06-14T12:00:00+00:00
broader: Medikament

Schulmedizin
type: Concept
definition: Diagnostische, Behandlung und Prävention von Krankheiten, basierend auf modernen wissenschaftlichen Forschungen der westlichen Welt
in scheme: mediatopic
created: 2009-10-22T02:00:00+00:00
modified: 2022-06-14T12:00:00+00:00
broader: Medikament

Gesundheitspolitik
type: Concept
definition: Politische Entscheidungen in Bezug auf die Gesundheit, umfasst was die Länder tun für die Drogenbekämpfung, AIDS, psychiatrische Versorgung, öffentliche Mittel für die Gesundheitsversorgung und ähnliches
in scheme: mediatopic
created: 2009-10-22T02:00:00+00:00
modified: 2025-03-31T12:00:00+00:00
broader: Regierungspolitik

Krankenversicherung
type: Concept
definition: Staatliche Gesundheitsversorgung von Menschen aller Altersgruppen.
in scheme: mediatopic
created: 2009-10-22T02:00:00+00:00
retired: 2014-06-02T12:00:00+00:00
modified: 2021-02-18T12:00:00+00:00
broader: Gesetzliche Krankenversicherung

Pflegeversicherung
type: Concept
definition: Staatliche Gesundheitsversorgung von älteren Menschen.
in scheme: mediatopic
created: 2009-10-22T02:00:00+00:00
retired: 2014-06-02T12:00:00+00:00
modified: 2021-02-18T12:00:00+00:00
broader: Gesetzliche Krankenversicherung

Medizinischer Service
type: Concept
definition: Medizinische Unterstützung/Hilfsmittel für Ärzte, wie Bluttests oder andere Tests an Einzelnen, Röntgen, CT, MRT etc.
in scheme: mediatopic
created: 2009-10-22T02:00:00+00:00
modified: 2022-06-14T12:00:00+00:00
broader: Medizin

Medizinisches Spezialgebiet
type: Concept
definition: Verschiedene medizinische Spezialgebiete.
in scheme: mediatopic
created: 2009-10-22T02:00:00+00:00
modified: 2022-06-14T12:00:00+00:00
broader: Medizin
narrower: Geriatrie
narrower: Gynäkologie
narrower: Pädiatrie
narrower: Reproduktionsmedizin
narrower: Zahnmedizin
narrower: Pharmakologie
narrower: Tiermedizin
narrower: Allgemeinmedizin
narrower: Orthopädie
narrower: Onkologie
narrower: Radiologie
narrower: Augenheilkunde
narrower: Chirurgische Medizin
narrower: Psychiatrie

Gesundheitspersonal
type: Concept
definition: Ärzte und Pflegepersonal, innerhalb und außerhalb einer medizinischen Einrichtung
in scheme: mediatopic
created: 2009-10-22T02:00:00+00:00
modified: 2021-05-05T12:00:00+00:00
broader: Medizin

Geriatrie
type: Concept
definition: Spezialität des Alterns und altersbedingte Themen wie altersbedingte Krankheiten, medizinische Forschung, und Entwicklungen.
in scheme: mediatopic
created: 2009-10-22T02:00:00+00:00
retired: 2022-06-14T12:00:00+00:00
modified: 2022-06-14T12:00:00+00:00
broader: Medizinisches Spezialgebiet

Gynäkologie
type: Concept
definition: Krankheiten der weiblichen Sexual- und Fortpflanzungsorgane
in scheme: mediatopic
created: 2009-10-22T02:00:00+00:00
retired: 2022-06-14T12:00:00+00:00
modified: 2022-06-14T12:00:00+00:00
broader: Medizinisches Spezialgebiet

Pädiatrie
type: Concept
definition: Forschung und Medizin speziell für die Jüngeren, umfasst Neugeborene, Kleinkindversorgung, Kinderkrankheiten und ihre Behandlung, sowie Gesundheitsfragen von Jugendlichen und ihre Verhaltensprobleme.
in scheme: mediatopic
created: 2009-10-22T02:00:00+00:00
modified: 2022-06-14T12:00:00+00:00
broader: Medizinisches Spezialgebiet

Reproduktionsmedizin
type: Concept
definition: Umfasst Reproduktionstechnologien, wie Invitro-Fertilisation, sowohl das Klonen als auch die damit zusammenhängenden Debatten. Entwicklungen der Sexualität und durch sexuellen Kontakt übertragene Krankheiten fallen auch in diese Kategorie
in scheme: mediatopic
created: 2009-10-22T02:00:00+00:00
retired: 2022-06-14T12:00:00+00:00
modified: 2022-06-14T12:00:00+00:00
broader: Medizinisches Spezialgebiet
broad match: http://cv.iptc.org/newscodes/subjectcode/07014003

Zahnmedizin
type: Concept
definition: Die Ärzteschaft und das Fachgebiet, das sich der Diagnose, Vorbeugung und Behandlung oraler Erkrankungen widmet
in scheme: mediatopic
created: 2009-10-22T02:00:00+00:00
modified: 2021-02-18T12:00:00+00:00
broader: Medizinisches Spezialgebiet
broad match: http://cv.iptc.org/newscodes/subjectcode/13019000

Pharmakologie
type: Concept
definition: Ärzteschaft und Studienrichtung, die sich mit den Anwendungen, Wirkungsweisen und Wirkungen pharmazeutischer Wirkstoffe befassen
in scheme: mediatopic
created: 2009-10-22T02:00:00+00:00
retired: 2022-06-14T12:00:00+00:00
modified: 2022-06-14T12:00:00+00:00
broader: Medizinisches Spezialgebiet
broad match: http://cv.iptc.org/newscodes/subjectcode/13019000

Tiermedizin
type: Concept
definition: Ärzteschaft und Studienrichtung zur Diagnose, Vorbeugung und Behandlung von Krankheiten bei Tieren
in scheme: mediatopic
created: 2009-10-22T02:00:00+00:00
modified: 2021-02-18T12:00:00+00:00
broader: Medizinisches Spezialgebiet
broad match: http://cv.iptc.org/newscodes/subjectcode/13019000

Allgemeinmedizin
type: Concept
definition: Die Behandlung eines breiten Spektrums akuter und langfristiger Krankheiten und Symptome
in scheme: mediatopic
created: 2019-04-06T12:00:00+00:00
retired: 2022-06-14T12:00:00+00:00
modified: 2022-06-14T12:00:00+00:00
broader: Medizinisches Spezialgebiet

Orthopädie
type: Concept
definition: Eine medizinische Spezialisierung, die sich auf Erkrankungen des Bewegungsapparats konzentriert
in scheme: mediatopic
created: 2019-04-06T12:00:00+00:00
retired: 2022-06-14T12:00:00+00:00
modified: 2022-06-14T12:00:00+00:00
broader: Medizinisches Spezialgebiet

Onkologie
type: Concept
definition: Eine medizinische Spezialisierung, die sich auf die Prävention, Diagnose und Behandlung von Krebs konzentriert
in scheme: mediatopic
created: 2019-04-06T12:00:00+00:00
retired: 2022-06-14T12:00:00+00:00
modified: 2022-06-14T12:00:00+00:00
broader: Medizinisches Spezialgebiet

Radiologie
type: Concept
definition: Eine medizinische Spezialisierung, die sich auf den Einsatz von medizinischer Bildgebung (z.B. Röntgenstrahlen) und Strahlung zur Diagnose und manchmal auch zur Behandlung von Krankheiten im Körper konzentriert
in scheme: mediatopic
created: 2019-04-06T12:00:00+00:00
retired: 2022-06-14T12:00:00+00:00
modified: 2022-06-14T12:00:00+00:00
broader: Medizinisches Spezialgebiet

Augenheilkunde
type: Concept
definition: Eine medizinische Spezialisierung, die sich auf Krankheiten und Störungen des Auges konzentrier
in scheme: mediatopic
created: 2019-04-06T12:00:00+00:00
modified: 2022-06-14T12:00:00+00:00
broader: Medizinisches Spezialgebiet

Chirurgische Medizin
type: Concept
definition: Eine medizinische Spezialisierung, die sich auf die Behandlung von Verletzungen oder Störungen des Körpers durch Einschnitte oder Manipulation, insbesondere mit Instrumenten, konzentriert.
in scheme: mediatopic
created: 2019-04-06T12:00:00+00:00
retired: 2022-06-14T12:00:00+00:00
modified: 2022-06-14T12:00:00+00:00
broader: Medizinisches Spezialgebiet

Psychiatrie
type: Concept
definition: Eine medizinische Spezialisierung, die sich auf die Diagnose, Prävention und Behandlung von psychischen Störungen konzentriert
in scheme: mediatopic
created: 2019-04-06T12:00:00+00:00
retired: 2022-06-14T12:00:00+00:00
modified: 2022-06-14T12:00:00+00:00
broader: Medizinisches Spezialgebiet

Tierkrankheit
type: Concept
definition: Krankheit, die Tiere befällt
in scheme: mediatopic
created: 2009-10-22T02:00:00+00:00
modified: 2025-10-09T12:00:00+00:00
broader: Tier

Pflanzenkrankheit
type: Concept
definition: Krankheit, die Pflanzen befällt, verursacht durch Parasiten oder durch Umwelteinflüsse
in scheme: mediatopic
created: 2009-10-22T02:00:00+00:00
modified: 2025-10-09T12:00:00+00:00
broader: Pflanze

Schädlinge
type: Concept
definition: Tiere oder Insekten, die in einen menschlichen Raum eindringen und Zerstörung oder unhygienische Bedingungen verursachen
in scheme: mediatopic
created: 2021-02-18T12:00:00+00:00
modified: 2025-10-09T12:00:00+00:00
broader: Tier

Namenstag
type: Concept
definition: Veranstaltung, bei der einem Säugling, Jugendlichen oder Erwachsenen ein Name gegeben wird
in scheme: mediatopic
created: 2019-06-26T12:00:00+00:00
modified: 2021-07-12T12:00:00+00:00
broader: Zeremonie

Abschlussfeier
type: Concept
definition: Eine Zeremonie, auch bekannt als Beginn, bei der eine Person ein Diplom oder einen akademischen Grad erhält
in scheme: mediatopic
created: 2019-06-26T12:00:00+00:00
modified: 2021-07-12T12:00:00+00:00
broader: Zeremonie

Beerdigung und Gedenkfeier
type: Concept
definition: Eine Zeremonie zum Gedenken an eine verstorbene Person und/oder die Bestattung der sterblichen Überreste dieser Person.
in scheme: mediatopic
created: 2019-06-26T12:00:00+00:00
modified: 2021-07-12T12:00:00+00:00
broader: Zeremonie

Hochzeit
type: Concept
definition: Trauungszeremonie und die sie umgebenden Veranstaltungen und Feste, wie Hochzeitsempfänge, Verlobungsfeiern, Brautduschen und Junggesellen-/Bachelorettenpartys.
in scheme: mediatopic
created: 2019-06-26T12:00:00+00:00
modified: 2021-07-12T12:00:00+00:00
broader: Zeremonie

Adel
type: Concept
definition: Nachrichten über Adelige oder Angehörige von Königsfamilien, alltägliches und bezüglich ihrer Rolle als regierende Königshäuser
in scheme: mediatopic
created: 2009-10-22T02:00:00+00:00
modified: 2021-05-05T12:00:00+00:00
broader: Society

Ausbildung
type: Concept
definition: Menschen, die sich lernend im Arbeitsprozess befinden und von einem Ausbilder betreut werden
in scheme: mediatopic
created: 2009-10-22T02:00:00+00:00
modified: 2021-02-18T12:00:00+00:00
broader: Beschäftigung

Kinderarbeit
type: Concept
definition: Beschäftigung von Kindern meistens unter 18 Jahre
in scheme: mediatopic
created: 2009-10-22T02:00:00+00:00
modified: 2021-02-18T12:00:00+00:00
broader: Beschäftigung

Arbeitnehmer
type: Concept
definition: Jemand der seine Zeit und Fähigkeiten gegen Geld und andere Vergütungen anbietet
in scheme: mediatopic
created: 2009-10-22T02:00:00+00:00
modified: 2021-02-18T12:00:00+00:00
broader: Beschäftigung

Arbeitgeber
type: Concept
definition: Derjenige, der Arbeiter beschäftigt und ihre Löhne und andere Vergütungen zahlt.
in scheme: mediatopic
created: 2009-10-22T02:00:00+00:00
modified: 2021-02-18T12:00:00+00:00
broader: Beschäftigung

Berufliche Bildung
type: Concept
definition: Erwerben von Sachkenntnis, die für eine Beschäftigung notwendig ist
in scheme: mediatopic
created: 2009-10-22T02:00:00+00:00
modified: 2021-02-18T12:00:00+00:00
broader: Beschäftigung
narrower: Fortbildung
narrower: Umschulung
broad match: http://cv.iptc.org/newscodes/subjectcode/09003000

Beruf
type: Concept
definition: Tätigkeit, Profession oder Geschäft im Allgemeinen, obwohl mit Profession meist Rechtsanwälte und Ärzte, mit Tätigkeit eher Angestellte oder Fernfahrer gemeint sind
in scheme: mediatopic
created: 2009-10-22T02:00:00+00:00
retired: 2019-10-07T12:00:00+00:00
modified: 2021-02-18T12:00:00+00:00
broader: Beschäftigung

Lohn
type: Concept
definition: Lohn für Arbeitnehmer
in scheme: mediatopic
created: 2009-10-22T02:00:00+00:00
modified: 2021-02-18T12:00:00+00:00
broader: Beschäftigung
narrower: Arbeitnehmerzulage
narrower: Renten- und Sozialversicherung
narrower: Gewinnbeteiligung
broad match: http://cv.iptc.org/newscodes/subjectcode/09011001

Selbstständigkeit
type: Concept
definition: Eine Situation, in der eine Person für sich selbst als Freiberufler oder Geschäftsinhaber arbeitet, anstatt für einen Arbeitgeber zu arbeiten, der ein Gehalt oder einen Lohn zahlt
in scheme: mediatopic
created: 2019-04-06T12:00:00+00:00
modified: 2021-07-12T12:00:00+00:00
broader: Beschäftigung

Erziehungsurlaub
type: Concept
definition: Freistellung von der Arbeit, um ein Kind zu gebären oder zu betreuen
in scheme: mediatopic
created: 2019-10-07T12:00:00+00:00
modified: 2021-07-12T12:00:00+00:00
broader: Beschäftigung

Ehrenamt
type: Concept
definition: Unbezahlte Arbeit, die von Einzelpersonen als Dienst an anderen frei geleistet wird
in scheme: mediatopic
created: 2019-10-07T12:00:00+00:00
modified: 2021-07-12T12:00:00+00:00
broader: Beschäftigung

Fortbildung
type: Concept
definition: Ergänzende Maßnahmen, um aktuelle Sachkenntnisse zu erwerben
in scheme: mediatopic
created: 2009-10-22T02:00:00+00:00
retired: 2019-10-07T12:00:00+00:00
modified: 2021-05-05T12:00:00+00:00
broader: Berufliche Bildung

Umschulung
type: Concept
definition: Maßnahme, um neue Sachkenntnisse zu erwerben, wenn die bestehenden nicht mehr länger verwendbar sind.
in scheme: mediatopic
created: 2009-10-22T02:00:00+00:00
retired: 2019-10-07T12:00:00+00:00
modified: 2021-02-18T12:00:00+00:00
broader: Berufliche Bildung

Arbeitnehmerzulage
type: Concept
definition: Sowohl Vergütungen, die ein Arbeitnehmer von einer Firma erhält, wie auch Pensionen, Krankenversicherung
in scheme: mediatopic
created: 2009-10-22T02:00:00+00:00
retired: 2019-10-07T12:00:00+00:00
modified: 2021-02-18T12:00:00+00:00
broader: Lohn

Renten- und Sozialversicherung
type: Concept
definition: Zahlungen, die von Einzelnen und Firmen an die Regierung geleistet werden und in einem bestimmten Alter an den Einzelnen ausgezahlt wird.
in scheme: mediatopic
created: 2009-10-22T02:00:00+00:00
modified: 2021-02-18T12:00:00+00:00
broader: Lohn

Gewinnbeteiligung
type: Concept
definition: Ein System, bei dem die Arbeitnehmer einen Anteil am Nettogewinn ihres Arbeitgebers erhalten. Dieser Verdienst unterscheidet sich von den regulären Löhnen und wird zusätzlich zu diesen gezahlt.
in scheme: mediatopic
created: 2023-10-02T12:00:00+00:00
modified: 2023-10-02T12:00:00+00:00
broader: Lohn

Arbeitssicherheit
type: Concept
definition: Regeln und Maßnahmen, die die Gesundheit der Arbeiter garantieren.
in scheme: mediatopic
created: 2009-10-22T02:00:00+00:00
modified: 2021-02-18T12:00:00+00:00
broader: Arbeitsrecht

Gig-Economy
type: Concept
definition: einen Arbeitsmarkt, der aus einzelnen Zulieferern mit kurzfristigen Verträgen oder freiberuflicher Arbeit besteht, im Gegensatz zu Festanstellungen, wie z.B. Fahrer oder Auslieferungspersonal
in scheme: mediatopic
created: 2019-10-07T12:00:00+00:00
modified: 2021-07-12T12:00:00+00:00
broader: Arbeitsmarkt

Tarifvertrag
type: Concept
definition: Schriftliche Verträge, die sich auf eine bestimmte Gruppe von Beschäftigten beziehen.
in scheme: mediatopic
created: 2009-10-22T02:00:00+00:00
modified: 2021-02-18T12:00:00+00:00
broader: Arbeitsbeziehung
narrower: Krankengeld
narrower: Gehaltstarifvertrag
narrower: Manteltarifvertrag

Tarifkonflikt
type: Concept
definition: Meinungsverschiedenheiten der Tarifpartner über Arbeitsbedingungen, Bezahlung etc.
in scheme: mediatopic
created: 2009-10-22T02:00:00+00:00
modified: 2021-02-18T12:00:00+00:00
broader: Arbeitsbeziehung
narrower: Streik

Krankengeld
type: Concept
definition: Teile des Tarifvertrages und der Tarifverhandlungen, die sich auf die Versorgung im Krankheitsfall beziehen.
in scheme: mediatopic
created: 2009-10-22T02:00:00+00:00
retired: 2019-10-07T12:00:00+00:00
modified: 2021-05-05T12:00:00+00:00
broader: Tarifvertrag

Gehaltstarifvertrag
type: Concept
definition: Teile der Tarifverträge und Tarifverhandlungen, die sich auf die Vergütung beziehen.
in scheme: mediatopic
created: 2009-10-22T02:00:00+00:00
retired: 2019-10-07T12:00:00+00:00
modified: 2021-05-05T12:00:00+00:00
broader: Tarifvertrag

Manteltarifvertrag
type: Concept
definition: Teile des Tarifvertrages und der Tarifverhandlungen, die sich auf die Versorgung, Pausenregelung, Urlaubsregelung, Arbeitszeit, Krankmeldung etc. beziehen.
in scheme: mediatopic
created: 2009-10-22T02:00:00+00:00
retired: 2019-10-07T12:00:00+00:00
modified: 2021-02-18T12:00:00+00:00
broader: Tarifvertrag

Streik
type: Concept
definition: Eine Arbeitsaktion, umfasst die Niederlegung der Arbeit.
in scheme: mediatopic
created: 2009-10-22T02:00:00+00:00
modified: 2021-02-18T12:00:00+00:00
broader: Tarifkonflikt

Rente
type: Concept
definition: Bezüge während des Ruhestands
in scheme: mediatopic
created: 2009-10-22T02:00:00+00:00
modified: 2021-02-18T12:00:00+00:00
broader: Ruhestand
broad match: http://cv.iptc.org/newscodes/subjectcode/09006000

Personalabbau
type: Concept
definition: Die Reduzierung von Arbeit innerhalb einer Firma durch Entlassungen aufgrund sich ändernder wirtschaftlicher Bedingungen.
in scheme: mediatopic
created: 2009-10-22T02:00:00+00:00
retired: 2019-10-07T12:00:00+00:00
modified: 2021-02-18T12:00:00+00:00
broader: Arbeitslosigkeit

Arbeitslosengeld
type: Concept
definition: Finanzieller Ausgleich während der Arbeitslosigkeit
in scheme: mediatopic
created: 2009-10-22T02:00:00+00:00
modified: 2021-02-18T12:00:00+00:00
broader: Arbeitslosigkeit
broad match: http://cv.iptc.org/newscodes/subjectcode/09009000

Verein
type: Concept
definition: Einrichtungen, die von Einzelnen besucht werden, aufgrund gemeinsamer Interessen.
in scheme: mediatopic
created: 2009-10-22T02:00:00+00:00
modified: 2021-02-18T12:00:00+00:00
broader: Freizeit

Spiel
type: Concept
definition: Allgemeiner Wettstreit zur Unterhaltung.
in scheme: mediatopic
created: 2009-10-22T02:00:00+00:00
modified: 2021-02-18T12:00:00+00:00
broader: Freizeit
narrower: Brettspiel
narrower: Kartenspiel
narrower: Kinderspiel
narrower: Würfelspiel
narrower: Outdoorspiel
narrower: Puzzle
narrower: Plattenspiel
narrower: Videospiel

Glücksspiel und Lotterie
type: Concept
definition: Spielen um Geld, meist im Zusammenhang mit Zahlen und dem Setzen auf erhoffte Kombinationen
in scheme: mediatopic
created: 2009-10-22T02:00:00+00:00
modified: 2021-02-18T12:00:00+00:00
broader: Freizeit

Hobby
type: Concept
definition: Aktivität in der Freizeit
in scheme: mediatopic
created: 2009-10-22T02:00:00+00:00
modified: 2021-02-18T12:00:00+00:00
broader: Freizeit
narrower: Auto
narrower: Fahrrad
narrower: Essen und Trinken
narrower: Motorrad
narrower: Sammeln

Urlaub
type: Concept
definition: Arbeitsfreie Zeit zur Erholung und Regeneration
in scheme: mediatopic
created: 2009-10-22T02:00:00+00:00
modified: 2021-02-18T12:00:00+00:00
broader: Freizeit
narrower: Feiertag
narrower: Halloween
broad match: http://cv.iptc.org/newscodes/subjectcode/10005000

Veranstaltungsort
type: Concept
definition: Ort, an dem Menschen sich amüsieren oder unterhalten werden
in scheme: mediatopic
created: 2009-10-22T02:00:00+00:00
modified: 2021-05-05T12:00:00+00:00
broader: Freizeit
narrower: Vergnügungspark
narrower: Bar
narrower: Café
narrower: Nachtclub
narrower: Restaurant
narrower: Sportanlagen
narrower: Zoo
narrower: http://cv.iptc.org/newscodes/mediatopic/20001392
broad match: http://cv.iptc.org/newscodes/subjectcode/10000000

Freizeitaktivität
type: Concept
definition: Aktivitäten zum Vergnügen, zur Entspannung und Erholung
in scheme: mediatopic
created: 2009-10-22T02:00:00+00:00
modified: 2021-02-18T12:00:00+00:00
broader: Freizeit
narrower: Angeln
narrower: Jagd
narrower: Sporttauchen
narrower: Alpinismus
narrower: Reiten
broad match: http://cv.iptc.org/newscodes/subjectcode/10000000

Reise
type: Concept
definition: Reisen in der Freizeit
in scheme: mediatopic
created: 2009-10-22T02:00:00+00:00
modified: 2021-02-18T12:00:00+00:00
broader: Freizeit
narrower: Tourismus
broad match: http://cv.iptc.org/newscodes/subjectcode/10000000

Brettspiel
type: Concept
definition: Spiel, was auf einem Brett gespielt wird
in scheme: mediatopic
created: 2009-10-22T02:00:00+00:00
modified: 2021-02-18T12:00:00+00:00
broader: Spiel
broad match: http://cv.iptc.org/newscodes/subjectcode/10001000

Kartenspiel
type: Concept
definition: Spiel, was mit Karten gespielt wird
in scheme: mediatopic
created: 2009-10-22T02:00:00+00:00
modified: 2021-02-18T12:00:00+00:00
broader: Spiel
broad match: http://cv.iptc.org/newscodes/subjectcode/10001000

Kinderspiel
type: Concept
definition: Spiele, entwickelt für und benutzt von Kindern
in scheme: mediatopic
created: 2009-10-22T02:00:00+00:00
modified: 2021-04-09T12:00:00+00:00
broader: Spiel
broad match: http://cv.iptc.org/newscodes/subjectcode/10001000

Würfelspiel
type: Concept
definition: Spiel, was mit Würfeln gespielt wird
in scheme: mediatopic
created: 2009-10-22T02:00:00+00:00
modified: 2021-02-18T12:00:00+00:00
broader: Spiel
broad match: http://cv.iptc.org/newscodes/subjectcode/10001000

Outdoorspiel
type: Concept
definition: Spiel, was draußen gespielt wird
in scheme: mediatopic
created: 2009-10-22T02:00:00+00:00
modified: 2021-02-18T12:00:00+00:00
broader: Spiel
broad match: http://cv.iptc.org/newscodes/subjectcode/10001000

Puzzle
type: Concept
definition: Spiel, was logische Fragen und Probleme löst
in scheme: mediatopic
created: 2009-10-22T02:00:00+00:00
modified: 2021-02-18T12:00:00+00:00
broader: Spiel
broad match: http://cv.iptc.org/newscodes/subjectcode/10001000

Plattenspiel
type: Concept
definition: Spiel, das auf/mit Platten gespielt wird
in scheme: mediatopic
created: 2009-10-22T02:00:00+00:00
modified: 2021-02-18T12:00:00+00:00
broader: Spiel
broad match: http://cv.iptc.org/newscodes/subjectcode/10001000

Videospiel
type: Concept
definition: Spiel, das einen Videobildschirm nutzt
in scheme: mediatopic
created: 2009-10-22T02:00:00+00:00
modified: 2021-02-18T12:00:00+00:00
broader: Spiel
broad match: http://cv.iptc.org/newscodes/subjectcode/10001000

Auto
type: Concept
definition: Interesse für alte und moderne Autos
in scheme: mediatopic
created: 2009-10-22T02:00:00+00:00
modified: 2021-02-18T12:00:00+00:00
broader: Hobby
broad match: http://cv.iptc.org/newscodes/subjectcode/10000000

Fahrrad
type: Concept
definition: Interesse für alte und moderne Fahrräder
in scheme: mediatopic
created: 2009-10-22T02:00:00+00:00
modified: 2021-02-18T12:00:00+00:00
broader: Hobby
broad match: http://cv.iptc.org/newscodes/subjectcode/10000000

Essen und Trinken
type: Concept
definition: Interesse für Essen und Trinken
in scheme: mediatopic
created: 2009-10-22T02:00:00+00:00
modified: 2021-02-18T12:00:00+00:00
broader: Hobby
narrower: Kochen und Backen
narrower: Bier, Wein und Spirituosen
broad match: http://cv.iptc.org/newscodes/subjectcode/10000000

Motorrad
type: Concept
definition: Interesse für alte und moderne Motorräder
in scheme: mediatopic
created: 2009-10-22T02:00:00+00:00
modified: 2021-05-05T12:00:00+00:00
broader: Hobby
broad match: http://cv.iptc.org/newscodes/subjectcode/10000000

Sammeln
type: Concept
definition: Das Hobby des Suchens, Auffindens, Erwerbens, Organisierens, Katalogisierens, Ausstellens, Aufbewahrens oder Pflegens von Gegenständen, die für einen einzelnen Sammler von Interesse sind
in scheme: mediatopic
created: 2019-07-30T12:00:00+00:00
modified: 2021-07-12T12:00:00+00:00
broader: Hobby

Feiertag
type: Concept
definition: Ein oder mehrere Tage, die für Feierlichkeiten festgesetzt sind.
in scheme: mediatopic
created: 2009-10-22T02:00:00+00:00
modified: 2021-02-18T12:00:00+00:00
broader: Urlaub
narrower: Sommersondenwende
narrower: Nationalfeiertag
narrower: Neujahr

Halloween
type: Concept
definition: Eine Feier, die in einer Reihe von Ländern am 31. Oktober mit Aktivitäten wie *Süßes oder Saures*, dem Tragen von Kostümen, dem Schnitzen von Kürbissen, dem Besuch von Spukattraktionen, dem Erzählen von Gruselgeschichten und dem Anschauen von Horrorfilmen gefeiert wird
in scheme: mediatopic
created: 2019-09-05T12:00:00+00:00
modified: 2021-07-12T12:00:00+00:00
broader: Urlaub

Sommersondenwende
type: Concept
definition: Nordeuropäische Feierlichkeiten, die die Sommersonnenwende begleiten
in scheme: mediatopic
created: 2019-09-05T12:00:00+00:00
modified: 2021-07-12T12:00:00+00:00
broader: Feiertag

Nationalfeiertag
type: Concept
definition: Ein festgelegter Tag zur Feier einer Nation
in scheme: mediatopic
created: 2019-09-05T12:00:00+00:00
modified: 2021-07-12T12:00:00+00:00
broader: Feiertag

Neujahr
type: Concept
definition: Die Feier des Endes eines Kalenderjahres und des Beginns des nächsten
in scheme: mediatopic
created: 2019-09-05T12:00:00+00:00
modified: 2021-07-12T12:00:00+00:00
broader: Feiertag

Vergnügungspark
type: Concept
definition: Park, in dem verschiedene Fahrten und Unterhaltungsattraktionen für Kinder und Erwachsene angeboten werden, inklusive Themenparks
in scheme: mediatopic
created: 2009-10-22T02:00:00+00:00
modified: 2021-02-18T12:00:00+00:00
broader: Veranstaltungsort
broad match: http://cv.iptc.org/newscodes/subjectcode/10000000

Bar
type: Concept
definition: Geschäft mit der Zubereitung und dem Verzehr von Getränken zum öffentlichen Konsum auf einem bestimmten Gelände
in scheme: mediatopic
created: 2009-10-22T02:00:00+00:00
modified: 2021-02-18T12:00:00+00:00
broader: Veranstaltungsort
broad match: http://cv.iptc.org/newscodes/subjectcode/10000000

Café
type: Concept
definition: Geschäft mit der Zubereitung und Bereitstellung von Getränken und kleinen Snacks, spezielle Details in verschiedenen Kulturen
in scheme: mediatopic
created: 2009-10-22T02:00:00+00:00
modified: 2021-02-18T12:00:00+00:00
broader: Veranstaltungsort
broad match: http://cv.iptc.org/newscodes/subjectcode/10000000

Nachtclub
type: Concept
definition: Kommerzielle Einrichtung für ausgewähltes Klientel, die Musik oder andere Unterhaltung anbietet, begleitet mit Essen und Trinken
in scheme: mediatopic
created: 2009-10-22T02:00:00+00:00
modified: 2021-02-18T12:00:00+00:00
broader: Veranstaltungsort

Restaurant
type: Concept
definition: Geschäft mit der Zubereitung und dem Verzehr von Mahlzeiten für die Öffentlichkeit
in scheme: mediatopic
created: 2009-10-22T02:00:00+00:00
modified: 2021-02-18T12:00:00+00:00
broader: Veranstaltungsort
broad match: http://cv.iptc.org/newscodes/subjectcode/10000000

Sportanlagen
type: Concept
definition: Gymnasien, Stadien oder Arenen wo Sportereignisse stattfinden
in scheme: mediatopic
created: 2009-10-22T02:00:00+00:00
retired: 2021-02-18T12:00:00+00:00
modified: 2021-02-18T12:00:00+00:00
broader: Veranstaltungsort
broad match: http://cv.iptc.org/newscodes/subjectcode/10000000

Zoo
type: Concept
definition: Ein Park, in dem Besucher sowohl wilde als auch zahme Tiere sehen können, die in Käfigen oder geschlossenen Bereichen gehalten werden
in scheme: mediatopic
created: 2021-02-18T12:00:00+00:00
modified: 2021-07-12T12:00:00+00:00
broader: Veranstaltungsort

http://cv.iptc.org/newscodes/mediatopic/20001392
type: Concept
in scheme: mediatopic
created: 2025-06-30T12:00:00+00:00
modified: 2025-06-30T12:00:00+00:00
broader: Veranstaltungsort

Angeln
type: Concept
definition: Eine Aktivität, die Köder, Waffen und Netze benutzt um Wassertiere zu fangen.
in scheme: mediatopic
created: 2009-10-22T02:00:00+00:00
modified: 2021-02-18T12:00:00+00:00
broader: Freizeitaktivität

Jagd
type: Concept
definition: Eine Aktivität, bei der Waffen oder Fallen benutzt werden, um Tiere zu fangen.
in scheme: mediatopic
created: 2009-10-22T02:00:00+00:00
modified: 2021-02-18T12:00:00+00:00
broader: Freizeitaktivität

Sporttauchen
type: Concept
definition: Tauchen in unterschiedlichen Tiefen unter Zeitmessung
in scheme: mediatopic
created: 2009-10-22T02:00:00+00:00
modified: 2021-02-18T12:00:00+00:00
broader: Freizeitaktivität

Alpinismus
type: Concept
definition: Sportliche Aktivität in den Bergen, schließt das Klettern und Wandern ein
in scheme: mediatopic
created: 2012-10-04T12:00:00+00:00
modified: 2023-10-02T12:00:00+00:00
broader: Freizeitaktivität

Reiten
type: Concept
definition: Das Reiten von Pferden zur Freizeitgestaltung oder zur leichten Bewegung.
in scheme: mediatopic
created: 2019-06-26T12:00:00+00:00
modified: 2021-07-12T12:00:00+00:00
broader: Freizeitaktivität

Tourismus
type: Concept
definition: Reisen, um eine Reihe von Orten und Ländern zu besuchen über einen längeren Zeitraum, meist in einer Gruppe
in scheme: mediatopic
created: 2009-10-22T02:00:00+00:00
retired: 2019-07-22T12:00:00+00:00
modified: 2021-02-18T12:00:00+00:00
broader: Reise

Biologische Nahrungsmittel
type: Concept
definition: Nahrungsmittel, die erzeugt wurden, ohne künstlichen Dünger oder chemische Zusätze
in scheme: mediatopic
created: 2009-10-22T02:00:00+00:00
modified: 2021-02-18T12:00:00+00:00
broader: Lebensstil

Wohnungseinrichtung
type: Concept
definition: Interesse für Häuser, Apartments und ihre Einrichtungen, inklusive Möbel
in scheme: mediatopic
created: 2009-10-22T02:00:00+00:00
modified: 2021-02-18T12:00:00+00:00
broader: Lebensstil
narrower: Hausrenovierung
narrower: Inneneinrichtung
narrower: Gärtnern
broad match: http://cv.iptc.org/newscodes/subjectcode/10000000

Trend
type: Concept
definition: Interesse für die Entwicklung von Stil, Mode und Design
in scheme: mediatopic
created: 2009-10-22T02:00:00+00:00
modified: 2021-02-18T12:00:00+00:00
broader: Lebensstil
narrower: Körpermodifikation
broad match: http://cv.iptc.org/newscodes/subjectcode/10000000

Party
type: Concept
definition: Soziales Ereignis mit Tanz
in scheme: mediatopic
created: 2012-10-04T12:00:00+00:00
modified: 2021-07-12T12:00:00+00:00
broader: Lebensstil

http://cv.iptc.org/newscodes/mediatopic/20001391
type: Concept
in scheme: mediatopic
created: 2025-06-30T12:00:00+00:00
modified: 2025-06-30T12:00:00+00:00
broader: Lebensstil

Kochen und Backen
type: Concept
definition: Interesse an der Zubereitung von Mahlzeiten oder Backwaren
in scheme: mediatopic
created: 2019-07-30T12:00:00+00:00
modified: 2021-07-12T12:00:00+00:00
broader: Essen und Trinken

Bier, Wein und Spirituosen
type: Concept
definition: Interesse am Konsum, der Herstellung und dem Sammeln von alkoholischen Getränken
in scheme: mediatopic
created: 2019-07-30T12:00:00+00:00
modified: 2021-07-12T12:00:00+00:00
broader: Essen und Trinken

Hausrenovierung
type: Concept
definition: Interesse an der Renovierung der eigenen Immobilie
in scheme: mediatopic
created: 2019-07-30T12:00:00+00:00
modified: 2021-07-12T12:00:00+00:00
broader: Wohnungseinrichtung

Inneneinrichtung
type: Concept
definition: Interesse am Dekorieren des eigenen Heims
in scheme: mediatopic
created: 2019-07-30T12:00:00+00:00
modified: 2021-07-12T12:00:00+00:00
broader: Wohnungseinrichtung

Gärtnern
type: Concept
definition: Interesse an der Arbeit im eigenen Garten
in scheme: mediatopic
created: 2019-07-30T12:00:00+00:00
modified: 2021-07-12T12:00:00+00:00
broader: Wohnungseinrichtung

Körpermodifikation
type: Concept
definition: Maßnahmen, die ergriffen werden, um das Aussehen des Körpers dauerhaft oder semi-permanent zu verändern, wie Piercing und Tätowierung
in scheme: mediatopic
created: 2019-07-30T12:00:00+00:00
modified: 2021-07-12T12:00:00+00:00
broader: Trend
narrower: Tätowierung
narrower: Piercing

Bürgerinitiative
type: Concept
definition: Politische Überzeugungen von Nicht-Regierungsangehörigen für Korrekturen oder Veränderungen in Bezug auf schon existente Regeln und Vorschriften.
in scheme: mediatopic
created: 2009-10-22T02:00:00+00:00
modified: 2021-05-12T12:00:00+00:00
broader: Wahl

Wahlsystem
type: Concept
definition: Verfahren, mit denen gewählt wird
in scheme: mediatopic
created: 2009-10-22T02:00:00+00:00
modified: 2024-09-26T12:00:00+00:00
broader: Wahl
broad match: http://cv.iptc.org/newscodes/subjectcode/11000000

staatsübergreifende Wahl
type: Concept
definition: Auswahl einzelner Regierungsvertreter für eine staatsübergreifende Organisation
in scheme: mediatopic
created: 2009-10-22T02:00:00+00:00
modified: 2021-07-12T12:00:00+00:00
broader: Wahl
broad match: http://cv.iptc.org/newscodes/subjectcode/11000000

Kommunalwahl
type: Concept
definition: Wahl einzelner Regierungsvertreter auf der unteren Ebene, wie Stadt, Kreis oder Bezirk
in scheme: mediatopic
created: 2009-10-22T02:00:00+00:00
modified: 2021-07-12T12:00:00+00:00
broader: Wahl

Bundestagswahl
type: Concept
definition: Wahl einzelner Regierungsvertreter auf nationaler Ebene
in scheme: mediatopic
created: 2009-10-22T02:00:00+00:00
modified: 2021-07-12T12:00:00+00:00
broader: Wahl

Wahlkampf
type: Concept
definition: Kampagnen für öffentliche Parteien
in scheme: mediatopic
created: 2009-10-22T02:00:00+00:00
retired: 2024-09-26T12:00:00+00:00
modified: 2024-09-26T12:00:00+00:00
broader: Wahl

Wahlkampffinanzierung
type: Concept
definition: Geld, das Kampagnen für öffentliche Parteien ermöglicht
in scheme: mediatopic
created: 2009-10-22T02:00:00+00:00
modified: 2021-02-18T12:00:00+00:00
broader: Wahl

Kandidat
type: Concept
definition: Individuen, die sich zur Wahl stellen
in scheme: mediatopic
created: 2009-10-22T02:00:00+00:00
modified: 2021-02-18T12:00:00+00:00
broader: Wahl

Vorwahl
type: Concept
definition: Vorwahlen auf lokaler oder regionaler Ebene, die zu einer regionalen oder nationalen Wahl führen
in scheme: mediatopic
created: 2009-10-22T02:00:00+00:00
modified: 2021-07-12T12:00:00+00:00
broader: Wahl

Referendum
type: Concept
definition: Politische Vorschläge, Gesetze und Taten, die von Nicht-Regierungsangehörigen vorgebracht werden und zur Abstimmung durch die Abstimmungsberechtigten vorliegen
in scheme: mediatopic
created: 2009-10-22T02:00:00+00:00
modified: 2024-09-26T12:00:00+00:00
broader: Wahl

Landtagswahl/Bürgerschaftswahl
type: Concept
definition: Wahl einzelner Regierungsvertreter auf der regionalen Ebene
in scheme: mediatopic
created: 2009-10-22T02:00:00+00:00
modified: 2021-07-12T12:00:00+00:00
broader: Wahl

Stimmwahl
type: Concept
definition: Die Wahl eines Individuums, der die eigenen Interessen in der Regierung vertreten soll
in scheme: mediatopic
created: 2009-10-22T02:00:00+00:00
modified: 2021-02-18T12:00:00+00:00
broader: Wahl

Kirchenwahlen
type: Concept
definition: Wahlen zur Wahl von Führungskräften für die Leitung kirchlicher Organisationen auf verschiedenen Ebenen
in scheme: mediatopic
created: 2019-09-05T12:00:00+00:00
retired: 2024-09-26T12:00:00+00:00
modified: 2024-09-26T12:00:00+00:00
broader: Wahl

politische Debatten
type: Concept
definition: Organisierte Debatten zwischen politischen Kandidaten, live vor Publikum oder auf irgendeine Art und Weise übertragen
in scheme: mediatopic
created: 2019-09-05T12:00:00+00:00
modified: 2021-07-12T12:00:00+00:00
broader: Wahl

Nachwahl
type: Concept
definition: Eine Wahl, die dazu dient, ein Amt zu besetzen, das zwischen den allgemeinen Wahlen durch den Tod eines Politikers, einen Rücktritt oder aus anderen Gründen frei geworden ist
in scheme: mediatopic
created: 2024-09-26T12:00:00+00:00
modified: 2024-09-26T12:00:00+00:00
broader: Wahl

Abberufungswahl
type: Concept
definition: Sonderwahlen zur Abwahl eines gewählten Amtsträgers vor Ablauf seiner Amtszeit
in scheme: mediatopic
created: 2024-09-26T12:00:00+00:00
modified: 2024-09-26T12:00:00+00:00
broader: Wahl

Koalitionsverhandlung
type: Concept
definition: Politische Parteien, die eine Vereinbarung zur Teilung der Macht treffen, die in der Regel zustande kommt, wenn keine Partei nach einer Wahl die absolute Mehrheit erreicht hat
in scheme: mediatopic
created: 2024-09-26T12:00:00+00:00
modified: 2024-09-26T12:00:00+00:00
broader: Wahl

Zensur
type: Concept
definition: Versuch durch jede Art von Gemeinschaft, die Redefreiheit, Religion und Ideen, die gedruckt, gezeichnet, im Cyberspace oder auf anderem Wege verbreitet werden, zu kontrollieren. Umfasst nicht offizielle Reglementierungen wie Kino, Werbung oder Fernsehen
in scheme: mediatopic
created: 2009-10-22T02:00:00+00:00
modified: 2021-02-18T12:00:00+00:00
broader: Grundrechte

Religionsfreiheit
type: Concept
definition: Artikel über Religionsrechte und Freiheiten, Unterdrückung und Einschüchterung von Gläubigen, Zensur in den Massenmedien, Vorgehensweisen von Regierungen, Journalistenverbände und andere NGOs im Zusammenhang mit Glaubensfreiheit und deren Praxis
in scheme: mediatopic
created: 2009-10-22T02:00:00+00:00
modified: 2021-05-05T12:00:00+00:00
broader: Grundrechte

Pressefreiheit
type: Concept
definition: Rechte und Freiheiten der Massenmedien, Druck und Einschüchterung von Journalisten, Zensur, Aktivitäten der Regierung, Journalistenverbände und/oder Organisationen die für die Pressefreiheit kämpfen
in scheme: mediatopic
created: 2009-10-22T02:00:00+00:00
modified: 2021-02-18T12:00:00+00:00
broader: Grundrechte

Menschenrechte
type: Concept
definition: Rechte, die von allen Bürgern in Anspruch genommen werden können
in scheme: mediatopic
created: 2009-10-22T02:00:00+00:00
modified: 2021-02-18T12:00:00+00:00
broader: Grundrechte

Datenschutz
type: Concept
definition: Das Recht eines Einzelnen oder einer Gruppe, Informationen über sich selbst geheim zu halten
in scheme: mediatopic
created: 2020-08-05T12:00:00+00:00
modified: 2021-07-12T12:00:00+00:00
broader: Grundrechte

Frauenrechte
type: Concept
definition: Das Recht der Frauen auf Gleichbehandlung mit den Männern, z. B. Lohngleichheit, Feminismus und körperliche Autonomie bei der Abtreibung
in scheme: mediatopic
created: 2021-05-05T12:00:00+00:00
modified: 2021-12-21T12:00:00+00:00
broader: Grundrechte

Öffentlicher Dienst
type: Concept
definition: Bezahlte Dienstleistung von Zivilisten für die Regierung und die oftmals unbezahlte ehrenamtliche Dienstleistung für andere
in scheme: mediatopic
created: 2009-10-22T02:00:00+00:00
retired: 2025-03-31T12:00:00+00:00
modified: 2025-03-31T12:00:00+00:00
broader: Regierung
narrower: Zivildienst

Beamte
type: Concept
definition: Menschen auf allen Ebenen, die im Dienst der Regierung stehen
in scheme: mediatopic
created: 2009-10-22T02:00:00+00:00
modified: 2025-03-31T12:00:00+00:00
broader: Regierung

Ministerialbeamte
type: Concept
definition: Individuen, meist gewählt, die im öffentlichen Dienst stehen oder öffentliche Interessen vertreten.
in scheme: mediatopic
created: 2009-10-22T02:00:00+00:00
modified: 2025-03-31T12:00:00+00:00
broader: Regierung

Verfassung (Gesetz)
type: Concept
definition: Für gewöhnlich ein schriftliches Dokument, was das Funktionieren einer Regierung und die Rechte der Bürger darin festschreibt
in scheme: mediatopic
created: 2009-10-22T02:00:00+00:00
modified: 2025-03-31T12:00:00+00:00
broader: Regierung

Verteidigung
type: Concept
definition: Alles was die Verteidigung des eigenen Landes umfasst
in scheme: mediatopic
created: 2009-10-22T02:00:00+00:00
modified: 2025-03-31T12:00:00+00:00
broader: Regierung
narrower: Streitkräfte/Bundeswehr
narrower: Militärische Ausrüstung
narrower: Waffen
narrower: Sicherheitsmaßnahme (Verteidigung)
narrower: Spionage und Geheimdienst

Bundeskabinett
type: Concept
definition: Der Teil der regulierenden Kraft des Staates, der in alle Regierungsangelegenheiten involviert ist.
in scheme: mediatopic
created: 2009-10-22T02:00:00+00:00
modified: 2025-03-31T12:00:00+00:00
broader: Regierung

Staatshaushalt
type: Concept
definition: Der von der Regierung verkündete nationale Haushalt
in scheme: mediatopic
created: 2009-10-22T02:00:00+00:00
modified: 2025-03-31T12:00:00+00:00
broader: Regierung
narrower: Öffentliche Gelder
broad match: http://cv.iptc.org/newscodes/subjectcode/11013000

Ministerium
type: Concept
definition: Abteilungen der Regierung, die ein spezielles Gebiet vertreten, wie z.B. Gesundheit, Soziales, Wirtschaft oder Verteidigung
in scheme: mediatopic
created: 2009-10-22T02:00:00+00:00
retired: 2025-03-31T12:00:00+00:00
modified: 2025-03-31T12:00:00+00:00
broader: Regierung

Staatsoberhaupt/Bundespräsident
type: Concept
definition: Symbolischer oder aktiver Repräsentant eines Landes, wie z.B. König, Präsident oder Emir.
in scheme: mediatopic
created: 2009-10-22T02:00:00+00:00
modified: 2025-03-31T12:00:00+00:00
broader: Regierung

Amtsvergehen
type: Concept
definition: Verfahren zur Anklage wegen Amtsvergehen von Amtsträgern vor einem Tribunal.
in scheme: mediatopic
created: 2009-10-22T02:00:00+00:00
modified: 2021-02-18T12:00:00+00:00
broader: Regierung

Kommune
type: Concept
definition: Autoritäten in der Stadt, auf Landes- oder Bezirksebene
in scheme: mediatopic
created: 2009-10-22T02:00:00+00:00
modified: 2025-03-31T12:00:00+00:00
broader: Regierung

Minister
type: Concept
definition: Führungsebene verschiedener Regierungsministerien, auch bekannt als Staatssekretäre. Auf anderen Ebenen bilden sie die Legislative. Der oberste Minister ist entweder der Bundeskanzler oder der Vizekanzler
in scheme: mediatopic
created: 2009-10-22T02:00:00+00:00
modified: 2025-03-31T12:00:00+00:00
broader: Regierung

Bundesregierung
type: Concept
definition: Die herrschende, regulierende Kraft eines Staates
in scheme: mediatopic
created: 2009-10-22T02:00:00+00:00
modified: 2021-02-18T12:00:00+00:00
broader: Regierung

Parlament
type: Concept
definition: Die kollektive Gemeinschaft gewählter Volksvertreter
in scheme: mediatopic
created: 2009-10-22T02:00:00+00:00
modified: 2021-03-31T12:00:00+00:00
broader: Regierung
narrower: Unterhaus
narrower: Oberhaus

Bundesland/Kanton
type: Concept
definition: Regierungseinheiten auf Ebenen, die für mehr als eine Gerichtsbarkeit zuständig sind, wie z.B. Länder der BRD oder Österreich, Kantone der Schweiz
in scheme: mediatopic
created: 2009-10-22T02:00:00+00:00
modified: 2025-03-31T12:00:00+00:00
broader: Regierung

Lobby
type: Concept
definition: Der Versuch nichtregierender Einheiten und Einzelner durch Überzeugung oder Fürsprache die Durchsetzung eines Gesetzes zu beeinflussen.
in scheme: mediatopic
created: 2009-10-22T02:00:00+00:00
modified: 2025-03-31T12:00:00+00:00
broader: Regierung

Politische Parteien und Bewegungen
type: Concept
definition: Umfasst sowohl formelle und informelle politische Zusammenschlüsse.
in scheme: mediatopic
created: 2009-10-22T02:00:00+00:00
retired: 2025-03-31T12:00:00+00:00
modified: 2025-03-31T12:00:00+00:00
broader: Regierung

Politikgeschichte
type: Concept
definition: Entstehung und Entwicklung politischer Systeme und die Geschichte der Menschen und Nationen, die mit diesen in Zusammenhang stehen.
in scheme: mediatopic
created: 2009-10-22T02:00:00+00:00
retired: 2025-03-31T12:00:00+00:00
modified: 2025-03-31T12:00:00+00:00
broader: Regierung

Politisches System
type: Concept
definition: Systeme, die geschaffen sind um der Regierung ein Regelwerk zur Verfügung zu stellen
in scheme: mediatopic
created: 2009-10-22T02:00:00+00:00
modified: 2025-03-31T12:00:00+00:00
broader: Regierung
narrower: Demokratie
narrower: Diktatur
narrower: Kommunismus
narrower: Sozialismus
narrower: Theokratie
narrower: Monarchie

Regulierungsbehörde
type: Concept
definition: Behörde, die für die Regulierung oder Überwachung eines Wirtschaftssektors zuständig ist.
in scheme: mediatopic
created: 2016-04-04T12:00:00+00:00
retired: 2025-03-31T12:00:00+00:00
modified: 2025-03-31T12:00:00+00:00
broader: Regierung

politischer Konvent
type: Concept
definition: Treffen der politischen Partei zur Nominierung eines Kandidaten, zur Wahl eines Parteivorsitzenden oder zur Festlegung der Politik
in scheme: mediatopic
created: 2019-09-05T12:00:00+00:00
modified: 2025-03-31T12:00:00+00:00
broader: Regierung

politische Ausschüsse
type: Concept
definition: Eine legislative Untergruppe, die sich auf einen bestimmten Bereich oder eine bestimmte Aktion konzentriert
in scheme: mediatopic
created: 2019-09-05T12:00:00+00:00
modified: 2025-03-31T12:00:00+00:00
broader: Regierung

Regierungschefs
type: Concept
definition: Der höchste Beamte in der Exekutive eines souveränen Staates, eines föderierten Staates oder einer selbstverwalteten Kolonie
in scheme: mediatopic
created: 2019-09-05T12:00:00+00:00
modified: 2025-03-31T12:00:00+00:00
broader: Regierung

öffentliche Untersuchung
type: Concept
definition: Eine offizielle Überprüfung von Ereignissen oder Handlungen, die von einer Regierungsstelle, einschließlich königlicher Kommissionen, angeordnet wurde
in scheme: mediatopic
created: 2019-09-05T12:00:00+00:00
modified: 2021-07-12T12:00:00+00:00
broader: Regierung

Parteivorsitzende
type: Concept
definition: Die Führer innerhalb einer politischen Partei
in scheme: mediatopic
created: 2021-02-18T12:00:00+00:00
modified: 2025-03-31T12:00:00+00:00
broader: Regierung

Partei
type: Concept
definition: Organisation, die Kandidaten koordiniert, die bei einer Wahl für diese Partei kandidieren.
in scheme: mediatopic
created: 2025-03-31T12:00:00+00:00
modified: 2025-03-31T12:00:00+00:00
broader: Regierung

Politische Bewegung und Zusammenschluss
type: Concept
definition: Eine Gruppe von Menschen, die sich zum Ziel gesetzt hat, die Politik der Regierung oder gesellschaftliche Werte zu verändern, um sich gegen den Status quo zu stellen.
in scheme: mediatopic
created: 2025-03-31T12:00:00+00:00
modified: 2025-03-31T12:00:00+00:00
broader: Regierung

Zivildienst
type: Concept
definition: Unbezahlter Dienst für die Gemeinschaft als Zivilist
in scheme: mediatopic
created: 2012-10-04T12:00:00+00:00
retired: 2025-03-31T12:00:00+00:00
modified: 2021-07-12T12:00:00+00:00
broader: Öffentlicher Dienst

Streitkräfte/Bundeswehr
type: Concept
definition: Die Angestellten der Regierung, die im Krieg eingesetzt werden oder die Sicherheit einer Nation durchsetzen
in scheme: mediatopic
created: 2009-10-22T02:00:00+00:00
modified: 2025-03-31T12:00:00+00:00
broader: Verteidigung
narrower: Veteran
narrower: Militärdienst

Militärische Ausrüstung
type: Concept
definition: Ausrüstung der bewaffneten Streitkräfte
in scheme: mediatopic
created: 2009-10-22T02:00:00+00:00
retired: 2025-03-31T12:00:00+00:00
modified: 2025-03-31T12:00:00+00:00
broader: Verteidigung

Waffen
type: Concept
definition: Die gesamte Waffensammlung eines Landes
in scheme: mediatopic
created: 2009-10-22T02:00:00+00:00
modified: 2025-03-31T12:00:00+00:00
broader: Verteidigung

Sicherheitsmaßnahme (Verteidigung)
type: Concept
definition: Mittel eine Nation, einen Staat, ein Gebäude oder eine Person vor Verletzung und äußeren Eingriffen zu schützen
in scheme: mediatopic
created: 2009-10-22T02:00:00+00:00
retired: 2025-03-31T12:00:00+00:00
modified: 2025-03-31T12:00:00+00:00
broader: Verteidigung
narrower: Nationale Sicherheit

Spionage und Geheimdienst
type: Concept
definition: Versteckte Beschaffung von Informationen
in scheme: mediatopic
created: 2009-10-22T02:00:00+00:00
modified: 2025-03-31T12:00:00+00:00
broader: Verteidigung

Veteran
type: Concept
definition: Versorgung und Pensionen für ehemalige Soldaten
in scheme: mediatopic
created: 2009-10-22T02:00:00+00:00
modified: 2021-05-05T12:00:00+00:00
broader: Streitkräfte/Bundeswehr

Militärdienst
type: Concept
definition: Verpflichtender Dienst beim nationalen Militär für eine begrenzte Zeit
in scheme: mediatopic
created: 2012-10-04T12:00:00+00:00
modified: 2021-07-12T12:00:00+00:00
broader: Streitkräfte/Bundeswehr

Nationale Sicherheit
type: Concept
definition: Die Sicherheitsvorstellungen ein Land und seine Grenzen zu schützen, genauso wie das Wohlergehen der Bürger
in scheme: mediatopic
created: 2009-10-22T02:00:00+00:00
retired: 2025-03-31T12:00:00+00:00
modified: 2025-03-31T12:00:00+00:00
broader: Sicherheitsmaßnahme (Verteidigung)

Öffentliche Gelder
type: Concept
definition: Regierungsgelder, die für öffentliche Programme, Dienstleistungen und öffentliche Schulden ausgegeben werden
in scheme: mediatopic
created: 2009-10-22T02:00:00+00:00
retired: 2025-03-31T12:00:00+00:00
modified: 2025-03-31T12:00:00+00:00
broader: Staatshaushalt

Unterhaus
type: Concept
definition: Untere Kammer der Legislative.
in scheme: mediatopic
created: 2009-10-22T02:00:00+00:00
modified: 2021-02-18T12:00:00+00:00
broader: Parlament

Oberhaus
type: Concept
definition: Obere Kammer der Legislative.
in scheme: mediatopic
created: 2009-10-22T02:00:00+00:00
modified: 2021-02-18T12:00:00+00:00
broader: Parlament

Innere Sicherheit
type: Concept
definition: Regierungspolitik, die das Wohlergehen der Bürger schützt
in scheme: mediatopic
created: 2009-10-22T02:00:00+00:00
retired: 2025-03-31T12:00:00+00:00
modified: 2025-03-31T12:00:00+00:00
broader: Regierungspolitik

Steuern
type: Concept
definition: Abgabe zur Finanzierung von Staatsausgaben
in scheme: mediatopic
created: 2009-10-22T02:00:00+00:00
modified: 2025-03-31T12:00:00+00:00
broader: Regierungspolitik
broad match: http://cv.iptc.org/newscodes/subjectcode/11013000

Innenpolitik
type: Concept
definition: Regierungspolitik bezogen auf die inneren Angelegenheiten eines Landes.
in scheme: mediatopic
created: 2009-10-22T02:00:00+00:00
retired: 2025-03-31T12:00:00+00:00
modified: 2025-03-31T12:00:00+00:00
broader: Regierungspolitik

Datenschutz
type: Concept
definition: Bemühungen, persönliche Informationen in geschriebener, gesprochener oder elektronischer Form zu schützen
in scheme: mediatopic
created: 2009-10-22T02:00:00+00:00
modified: 2025-03-31T12:00:00+00:00
broader: Regierungspolitik

Wohnungs- und Städtebaupolitik
type: Concept
definition: Systematisches Planen von städtischen und vorstädtischen Gebieten und deren Bebauung
in scheme: mediatopic
created: 2009-10-22T02:00:00+00:00
modified: 2025-03-31T12:00:00+00:00
broader: Regierungspolitik

Politik gegenüber indigener Bevölkerung
type: Concept
definition: Politik einer Regierung in Bezug auf die indigene Bevölkerung
in scheme: mediatopic
created: 2009-10-22T02:00:00+00:00
modified: 2025-03-31T12:00:00+00:00
broader: Regierungspolitik

Sozialpolitik
type: Concept
definition: Politik der Regierung das Wohlbefinden der Bürger zu unterstützen durch Arbeitslosengeld, Sozialhilfe und vergleichbare Zahlungen.
in scheme: mediatopic
created: 2009-10-22T02:00:00+00:00
modified: 2025-03-31T12:00:00+00:00
broader: Regierungspolitik

Volkszählung
type: Concept
definition: Datensammlung über Einzelpersonen durch die Regierung und andere Behörden
in scheme: mediatopic
created: 2009-10-22T02:00:00+00:00
retired: 2025-03-31T12:00:00+00:00
modified: 2025-03-31T12:00:00+00:00
broader: Regierungspolitik

Waffenkontrolle
type: Concept
definition: Kontrolle der Regierung über den persönlichen Besitz von Gewehren und anderen Waffen, umfasst die Kontrolle von Sportwaffen über Lizenzen und andere Mittel
in scheme: mediatopic
created: 2009-10-22T02:00:00+00:00
modified: 2025-03-31T12:00:00+00:00
broader: Regierungspolitik

Planfeststellungsverfahren
type: Concept
definition: Öffentliche Anhörungen oder Planverfahren über beabsichtigte Bauvorhaben, wie z.B. der Bau eines Wasserkraftwerkes in einem Nationalpark
in scheme: mediatopic
created: 2009-10-22T02:00:00+00:00
retired: 2025-03-31T12:00:00+00:00
modified: 2025-03-31T12:00:00+00:00
broader: Regierungspolitik

Migration
type: Concept
definition: Bewegung einer Gemeinschaft von Menschen von einem Ort zu einem anderen
in scheme: mediatopic
created: 2009-10-22T02:00:00+00:00
modified: 2025-03-31T12:00:00+00:00
broader: Regierungspolitik

Atompolitik
type: Concept
definition: Politik der Regierung in Bezug auf die Nutzung von nuklearer Energie- oder Waffenproduktion
in scheme: mediatopic
created: 2009-10-22T02:00:00+00:00
modified: 2025-03-31T12:00:00+00:00
broader: Regierungspolitik

Regulierungsbehörde
type: Concept
definition: Die Regeln und ausführenden Organe, national und international, die Interessenskonflikte regulieren und für gute Praktizierbarkeit sorgen
in scheme: mediatopic
created: 2009-10-22T02:00:00+00:00
modified: 2025-03-31T12:00:00+00:00
broader: Regierungspolitik
narrower: Lebensmittelkontrolle

Kulturpolitik
type: Concept
definition: Politik einer Regierung kulturelle Themen betreffend
in scheme: mediatopic
created: 2012-10-04T12:00:00+00:00
modified: 2025-03-31T12:00:00+00:00
broader: Regierungspolitik

Integration
type: Concept
definition: Verbesserung des Gemeinsamen von Gruppen der Gesellschaft
in scheme: mediatopic
created: 2012-10-04T12:00:00+00:00
retired: 2025-03-31T12:00:00+00:00
modified: 2025-03-31T12:00:00+00:00
broader: Regierungspolitik

Sportpolitik
type: Concept
definition: Politik einer Regierung sportliche Themen betreffend
in scheme: mediatopic
created: 2012-10-04T12:00:00+00:00
modified: 2025-03-31T12:00:00+00:00
broader: Regierungspolitik

regionale Entwicklungspolitik
type: Concept
definition: Öffentliche oder private Aktionen, die zur Entwicklung einer Region durchgeführt werden.
in scheme: mediatopic
created: 2016-04-04T12:00:00+00:00
modified: 2025-03-31T12:00:00+00:00
broader: Regierungspolitik

Infrastrukturpolitik
type: Concept
definition: Politik in Bezug auf die Entwicklung und Instandhaltung der grundlegenden Einrichtungen eines Landes, einer Stadt oder eines anderen Gebiets, die eine Geschäftstätigkeit ermöglichen, wie Kommunikations-, Transport- und Vertriebsnetze
in scheme: mediatopic
created: 2019-09-05T12:00:00+00:00
modified: 2025-03-31T12:00:00+00:00
broader: Regierungspolitik

Kommunalpolitik
type: Concept
definition: Politik für die Entwicklung und Erhaltung eines lokalen Regierungsgebiets
in scheme: mediatopic
created: 2019-09-05T12:00:00+00:00
modified: 2021-07-12T12:00:00+00:00
broader: Regierungspolitik

Bildungspolitik
type: Concept
definition: Regierungsprogramme und bildungspolitische Maßnahmen sowie Vorschläge zur Änderung oder Proteste gegen diese Positionen
in scheme: mediatopic
created: 2021-12-17T12:00:00+00:00
modified: 2025-03-31T12:00:00+00:00
broader: Regierungspolitik

Flächennutzungsplan
type: Concept
definition: Richtlinien zur Aufteilung von Land in Zonen, für die jeweils bestimmte Vorschriften für neue Bauvorhaben gelten.
in scheme: mediatopic
created: 2025-03-31T12:00:00+00:00
modified: 2025-03-31T12:00:00+00:00
broader: Regierungspolitik

Lebensmittelkontrolle
type: Concept
definition: Regierungspolitik bezogen auf Lebensmittel und Getränke
in scheme: mediatopic
created: 2009-10-22T02:00:00+00:00
modified: 2025-03-31T12:00:00+00:00
broader: Regulierungsbehörde
broad match: http://cv.iptc.org/newscodes/subjectcode/11022000

Diplomatie
type: Concept
definition: Anwendung sprachlicher oder schreibender Fähigkeiten, um andere von den eigenen Standpunkten zu überzeugen
in scheme: mediatopic
created: 2009-10-22T02:00:00+00:00
modified: 2025-03-31T12:00:00+00:00
broader: Internationale Beziehung
narrower: Gipfel
narrower: Internationaler Vertrag

Wirtschaftliche Sanktion
type: Concept
definition: Strafende Handlungen eines Staates gegen einen anderen, Handelseinschränkungen, Embargos etc. beinhaltend
in scheme: mediatopic
created: 2009-10-22T02:00:00+00:00
modified: 2025-03-31T12:00:00+00:00
broader: Internationale Beziehung

Auslandshilfe
type: Concept
definition: Hilfe, die ein Land einem anderen gewährt
in scheme: mediatopic
created: 2009-10-22T02:00:00+00:00
modified: 2025-03-31T12:00:00+00:00
broader: Internationale Beziehung

Internationale Organisation
type: Concept
definition: Beinhaltet Organisationen mit Mitgliedern und Aufgaben, die internationale Grenzen überschreiten, können auch zwischenstaatliche Organisationen und Organisationen von unabhängigen Staaten beinhalten
in scheme: mediatopic
created: 2009-10-22T02:00:00+00:00
modified: 2025-03-31T12:00:00+00:00
broader: Internationale Beziehung

Flüchtling
type: Concept
definition: Eine in einem anderen Land schutzsuchende Person, die Angst vor Verfolgung durch das eigene Land hat
in scheme: mediatopic
created: 2009-10-22T02:00:00+00:00
modified: 2025-03-31T12:00:00+00:00
broader: Internationale Beziehung

Grenzstreitigkeit
type: Concept
definition: Diplomatische Angelegenheiten zwischen zwei Ländern im Grenzbereich, manchmal mit militärischen Auseinandersetzungen
in scheme: mediatopic
created: 2021-02-18T12:00:00+00:00
modified: 2025-03-31T12:00:00+00:00
broader: Internationale Beziehung

Gipfel
type: Concept
definition: Umfasst Treffen von Regierenden, Außen- und Finanzministern der Gruppe der acht größten Staaten und der Gruppe der sieben Industriestaaten (G7/G8)
in scheme: mediatopic
created: 2009-10-22T02:00:00+00:00
modified: 2025-03-31T12:00:00+00:00
broader: Diplomatie

Internationaler Vertrag
type: Concept
definition: Ein Vertrag (wie es durch die Wiener Vertragsrechtskonvention definiert ist) ist eine schriftliche Vereinbarung zwischen internationalen Gremien, die dem internationalen Recht unterliegt
in scheme: mediatopic
created: 2009-10-22T02:00:00+00:00
modified: 2025-03-31T12:00:00+00:00
broader: Diplomatie

Demokratie
type: Concept
definition: Regierung, in der entweder die Menschen die direkte Macht innehaben, oder durch gewählte Vertreter.
in scheme: mediatopic
created: 2009-10-22T02:00:00+00:00
modified: 2025-03-31T12:00:00+00:00
broader: Politisches System

Diktatur
type: Concept
definition: Regierung in der ein einzelner oder eine kleine Gruppe von Einzelnen die Macht haben ohne Einverständnis der Bevölkerung
in scheme: mediatopic
created: 2009-10-22T02:00:00+00:00
modified: 2025-03-31T12:00:00+00:00
broader: Politisches System
broad match: http://cv.iptc.org/newscodes/subjectcode/11006000

Kommunismus
type: Concept
definition: Eine Regierungsform, die darauf abzielt, Privateigentum und eine gewinnorientierte Wirtschaft durch öffentliches Eigentum und kommunale Kontrolle über die Produktionsmittel und natürlichen Ressourcen innerhalb der Gesellschaft zu ersetzen.
in scheme: mediatopic
created: 2025-03-31T12:00:00+00:00
modified: 2025-03-31T12:00:00+00:00
broader: Politisches System

Sozialismus
type: Concept
definition: Eine Regierungsform, die aus einer sozialistischen Wirtschaft besteht, in der die Produktionsmittel in gesellschaftlichem und kollektivem Besitz sind oder kontrolliert werden, und einem demokratischen politischen Regierungssystem, in dem die Amtsträger von den Bürgern gewählt werden.
in scheme: mediatopic
created: 2025-03-31T12:00:00+00:00
modified: 2025-03-31T12:00:00+00:00
broader: Politisches System

Theokratie
type: Concept
definition: Eine Regierungsform, in der eine einzelne Person oder eine kleine Gruppe von Personen ohne die Zustimmung des Volkes die Macht ausübt.
in scheme: mediatopic
created: 2025-03-31T12:00:00+00:00
modified: 2025-03-31T12:00:00+00:00
broader: Politisches System

Monarchie
type: Concept
definition: Staatsform, in der eine Person, die Teil einer Erbfolge ist, als Staatsoberhaupt auf Lebenszeit oder bis zu ihrer Abdankung regiert.
in scheme: mediatopic
created: 2025-03-31T12:00:00+00:00
modified: 2025-03-31T12:00:00+00:00
broader: Politisches System

Buddhismus
type: Concept
definition: Eine verbreitete asiatische Religion, gegründet von Buddha im 6ten Jahrhundert vor Christus in Indien, die verkündet, dass richtiges Denken und Selbstverleugnung in einen göttlichen Geisteszustand frei von Wünschen führt.
in scheme: mediatopic
created: 2009-10-22T02:00:00+00:00
modified: 2021-12-21T12:00:00+00:00
broader: Glaube

Christentum
type: Concept
definition: Menschen, die Jesus Christus und seine Lehren als das Zentrum ihres Glaubens sehen.
in scheme: mediatopic
created: 2009-10-22T02:00:00+00:00
modified: 2021-12-21T12:00:00+00:00
broader: Glaube
narrower: Ökumene
narrower: Mormonen
narrower: Altkatholiken
narrower: Orthodoxe
narrower: Evangelische Kirche
narrower: Römisch-Katholische Kirche
narrower: Katholizismus

Konfuzianismus
type: Concept
definition: Der Weg des Lebens, der durch Konfuzius propagiert wurde im 6.-5. Jahrhundert vor Christus und den die chinesische Bevölkerung seit mehr als 2000 Jahren befolgt. Die Einflüsse haben sich ausgedehnt nach Korea, Japan und Vietnam.
in scheme: mediatopic
created: 2009-10-22T02:00:00+00:00
modified: 2021-12-17T12:00:00+00:00
broader: Glaube

Kult und Sekte
type: Concept
definition: Randerscheinungen von anerkannten religiösen Einheiten, oder kleine eng konzentrierte Gruppen, verbreitet durch ein oder zwei Einzelpersonen
in scheme: mediatopic
created: 2009-10-22T02:00:00+00:00
modified: 2021-12-21T12:00:00+00:00
broader: Glaube

Freimaurer
type: Concept
definition: Eine geheime internationale Gemeinschaft, die auf den Prinzipien von Brüderlichkeit, Wohltätigkeit und gegenseitiger Hilfe basiert.
in scheme: mediatopic
created: 2009-10-22T02:00:00+00:00
retired: 2021-12-17T12:00:00+00:00
modified: 2021-12-17T12:00:00+00:00
broader: Glaube

Hinduismus
type: Concept
definition: Ein religiöses und soziales System, Glaube an ein Kastensystem, in dem der Brahmane die Höchste und die Unberührbaren die niedrigste Stufe darstellen.
in scheme: mediatopic
created: 2009-10-22T02:00:00+00:00
modified: 2021-12-21T12:00:00+00:00
broader: Glaube

Islam
type: Concept
definition: Diejenigen die Allah und seine Lehren als Zentrum ihres Glaubens betrachten.
in scheme: mediatopic
created: 2009-10-22T02:00:00+00:00
modified: 2021-12-17T12:00:00+00:00
broader: Glaube
narrower: Schiitentum
narrower: Sunnitentum

Jainismus
type: Concept
definition: Eine indische Religion, die einen Weg lehrt zu spiritueller Reinheit und Erleuchtung, durch einen disziplinierten Lebensstil auf der Tradition von Gewaltlosigkeit gegenüber allen Lebewesen. Begann im 7.-5. Jahrhundert vor Christus.
in scheme: mediatopic
created: 2009-10-22T02:00:00+00:00
modified: 2021-12-21T12:00:00+00:00
broader: Glaube

Judentum
type: Concept
definition: Eine Gruppe, die an einen Gott glaubt, deren Glauben auf den geschriebene heiligen Schriften und dem Talmud beruht, die das erste Erscheinen des Messias beinhalten.
in scheme: mediatopic
created: 2009-10-22T02:00:00+00:00
modified: 2021-12-21T12:00:00+00:00
broader: Glaube
narrower: Chassidismus

Naturreligion
type: Concept
definition: Verehrung von Naturelementen wie Feuer, Wasser, Bäume, Berge
in scheme: mediatopic
created: 2009-10-22T02:00:00+00:00
modified: 2021-12-21T12:00:00+00:00
broader: Glaube

Zoroastrismus
type: Concept
definition: Eine indische Religion, die der Lehre von Zarathustra folgt, meistens in Bombay, aber auch in (Karachi) Pakistan.
in scheme: mediatopic
created: 2009-10-22T02:00:00+00:00
modified: 2021-12-17T12:00:00+00:00
broader: Glaube

Scientology
type: Concept
definition: Der Gaube dass der Mensch ein spirituelles Wesen ist, ausgestattet mit Fähigkeiten, hinter den für gewöhnlich sichtbaren, er ist in der Lage seine eigenen Probleme zu lösen, Großes zu schaffen und dauerhaftes Glück zu erlangen.
in scheme: mediatopic
created: 2009-10-22T02:00:00+00:00
modified: 2021-12-21T12:00:00+00:00
broader: Glaube

Schintoismus
type: Concept
definition: Ursprünglicher religiöser praktizierter Glaube in Japan. Die Bezeichnung Shinto wurde eingeführt um den ursprünglichen japanischen Glauben vom Buddhismus zu trennen.
in scheme: mediatopic
created: 2009-10-22T02:00:00+00:00
modified: 2021-12-17T12:00:00+00:00
broader: Glaube

Sikhismus
type: Concept
definition: Religion einer indischen Gruppe, die Hinduismus und islamische Elemente verbindet, die in Punjab entdeckt wurde im späten 15. Jahrhundert von Guru Nanak.
in scheme: mediatopic
created: 2009-10-22T02:00:00+00:00
modified: 2021-12-17T12:00:00+00:00
broader: Glaube

Taoismus
type: Concept
definition: Ursprüngliche chinesische religiöse und philosophische Tradition, die seit mehr als 2000 Jahren das chinesische Leben beeinflusst.
in scheme: mediatopic
created: 2009-10-22T02:00:00+00:00
modified: 2021-12-17T12:00:00+00:00
broader: Glaube

Vereinigungsbewegung
type: Concept
definition: Das Glaubenssystem der Mitglieder der Vereinigungskirche, das von Sun Myung Moon festgelegt wurde.
in scheme: mediatopic
created: 2009-10-22T02:00:00+00:00
modified: 2021-12-17T12:00:00+00:00
broader: Glaube

Atheismus und Agnostizismus
type: Concept
definition: Der Glaube, dass Gott nicht existiert oder dass es unmöglich ist, zu wissen, ob ein Gott existiert
in scheme: mediatopic
created: 2021-12-17T12:00:00+00:00
modified: 2021-12-21T12:00:00+00:00
broader: Glaube

Ökumene
type: Concept
definition: Beziehungen zwischen christlichen Kirchen
in scheme: mediatopic
created: 2009-10-22T02:00:00+00:00
retired: 2021-12-17T12:00:00+00:00
modified: 2021-02-18T12:00:00+00:00
broader: Christentum

Mormonen
type: Concept
definition: Mitglieder einer christlichen Gemeinschaft, die an das Buch Mormone und die Visionen des Gründers M.J. Smith glauben.
in scheme: mediatopic
created: 2009-10-22T02:00:00+00:00
modified: 2021-12-21T12:00:00+00:00
broader: Christentum

Altkatholiken
type: Concept
definition: Mitglieder einer katholischen Kirche, die 1870 entstand und die die Lehre über die Unfehlbarkeit des Papstes ablehnt.
in scheme: mediatopic
created: 2009-10-22T02:00:00+00:00
retired: 2021-12-17T12:00:00+00:00
modified: 2021-02-18T12:00:00+00:00
broader: Christentum

Orthodoxe
type: Concept
definition: Kirchen des byzantinischen Ritus, die in der apostolischen Tradition stehen, vor allem in Ost- und Südosteuropa sowie im Mittleren Osten.
in scheme: mediatopic
created: 2009-10-22T02:00:00+00:00
modified: 2021-12-17T12:00:00+00:00
broader: Christentum

Evangelische Kirche
type: Concept
definition: Oberbegriff für christliche Kirchen und religiöse Gemeinschaften, entstanden aus der Reformation des 16. Jahrhunderts
in scheme: mediatopic
created: 2009-10-22T02:00:00+00:00
modified: 2021-12-17T12:00:00+00:00
broader: Christentum
narrower: Anglikaner
narrower: Baptisten
narrower: Lutheraner
narrower: Mennoniten
narrower: Methodisten
narrower: Reformierte

Römisch-Katholische Kirche
type: Concept
definition: Weltweit größte christliche Kirche, die ihre Ursprünge auf Jesus Christus zurückführt.
in scheme: mediatopic
created: 2009-10-22T02:00:00+00:00
retired: 2021-12-17T12:00:00+00:00
modified: 2021-02-18T12:00:00+00:00
broader: Christentum
narrower: Konkordat

Katholizismus
type: Concept
definition: Größte christliche Religion der Welt, bestehend aus der römisch-katholischen Kirche, die vom Papst geleitet wird, und dem Altkatholizismus, einer 1870 gegründeten abtrünnigen Bewegung, die das Dogma der Unfehlbarkeit des Papstes ablehnt
in scheme: mediatopic
created: 2021-12-17T12:00:00+00:00
modified: 2021-12-21T12:00:00+00:00
broader: Christentum

Anglikaner
type: Concept
definition: Mitglieder der weltweiten anglikanischen Gemeinschaft, entstanden im 16. Jahrhundert in England nach dem Bruch mit der römisch-katholischen Kirche.
in scheme: mediatopic
created: 2009-10-22T02:00:00+00:00
retired: 2021-12-17T12:00:00+00:00
modified: 2021-02-18T12:00:00+00:00
broader: Evangelische Kirche

Baptisten
type: Concept
definition: Mitglieder einer christlichen Kirche, die nur Erwachsene tauft.
in scheme: mediatopic
created: 2009-10-22T02:00:00+00:00
retired: 2021-12-17T12:00:00+00:00
modified: 2021-07-12T12:00:00+00:00
broader: Evangelische Kirche

Lutheraner
type: Concept
definition: Christen, die der Lehre des Reformers Martin Luther folgen.
in scheme: mediatopic
created: 2009-10-22T02:00:00+00:00
retired: 2021-12-17T12:00:00+00:00
modified: 2021-02-18T12:00:00+00:00
broader: Evangelische Kirche

Mennoniten
type: Concept
definition: Mitglieder einer aus dem 16. Jahrhundert stammenden christlichen Kirche, die gegen Militärdienst und Kindertaufe sind.
in scheme: mediatopic
created: 2009-10-22T02:00:00+00:00
retired: 2021-12-17T12:00:00+00:00
modified: 2021-12-17T12:00:00+00:00
broader: Evangelische Kirche

Methodisten
type: Concept
definition: Anhänger von John und Charles Wesley, die im 18. Jahrhundert die Kirche von England reformieren wollten und dadurch eine eigene Kirche gründeten.
in scheme: mediatopic
created: 2009-10-22T02:00:00+00:00
retired: 2021-12-17T12:00:00+00:00
modified: 2021-02-18T12:00:00+00:00
broader: Evangelische Kirche

Reformierte
type: Concept
definition: Christen, die der Lehre der Reformer Johannes Calvin und Ulrich Zwingli folgen.
in scheme: mediatopic
created: 2009-10-22T02:00:00+00:00
retired: 2021-12-17T12:00:00+00:00
modified: 2021-02-18T12:00:00+00:00
broader: Evangelische Kirche

Konkordat
type: Concept
definition: Völkerrechtlich verbindlicher Vertrag zwischen dem Heiligen Stuhl und einem anderen Land.
in scheme: mediatopic
created: 2009-10-22T02:00:00+00:00
retired: 2021-12-17T12:00:00+00:00
modified: 2021-12-17T12:00:00+00:00
broader: Römisch-Katholische Kirche

Schiitentum
type: Concept
definition: Der zweitgrößte Zweig des Islam, der glaubt, dass der Prophet Mohammed Ali ibn Abi Talib zu seinem Nachfolger bestimmt hat
in scheme: mediatopic
created: 2021-12-17T12:00:00+00:00
modified: 2021-12-21T12:00:00+00:00
broader: Islam

Sunnitentum
type: Concept
definition: Der größte Zweig des Islams, der glaubt, dass der Prophet Mohammed keinen Nachfolger ernannt hat
in scheme: mediatopic
created: 2021-12-17T12:00:00+00:00
modified: 2021-12-21T12:00:00+00:00
broader: Islam

Chassidismus
type: Concept
definition: Jüdische religiöse Gruppe, die glaubt, dass die Thora das wörtliche Wort Gottes ist und dass die Umsetzung dieses Wortes dem Leben Sinn und Zweck verleiht
in scheme: mediatopic
created: 2021-12-17T12:00:00+00:00
modified: 2021-12-21T12:00:00+00:00
broader: Judentum

Weihnachten
type: Concept
definition: Fest zur Erinnerung an die Geburt von Jesus Christus
in scheme: mediatopic
created: 2009-10-22T02:00:00+00:00
modified: 2021-12-21T12:00:00+00:00
broader: Religionsfest oder Feiertag

Ostern
type: Concept
definition: Fest zur Erinnerung an die Auferstehung von Jesus Christus.
in scheme: mediatopic
created: 2009-10-22T02:00:00+00:00
modified: 2021-12-17T12:00:00+00:00
broader: Religionsfest oder Feiertag

Pfingsten
type: Concept
definition: 50 Tage nach Ostern begangenes Fest zur Erinnerung an das Herabkommen des Heiligen Geistes.
in scheme: mediatopic
created: 2009-10-22T02:00:00+00:00
modified: 2021-12-17T12:00:00+00:00
broader: Religionsfest oder Feiertag

Ramadan
type: Concept
definition: Heiliger Fastenmonat des Islam.
in scheme: mediatopic
created: 2009-10-22T02:00:00+00:00
modified: 2021-12-17T12:00:00+00:00
broader: Religionsfest oder Feiertag

Jom Kippur
type: Concept
definition: Höchster jüdischer Feiertag, beginnt bei Sonnenuntergang vor dem 10. Tischri und dauert bis zum nächsten Sonnenuntergang (September oder Oktober)
in scheme: mediatopic
created: 2009-10-22T02:00:00+00:00
modified: 2021-12-17T12:00:00+00:00
broader: Religionsfest oder Feiertag

Allerheiligen
type: Concept
definition: Christliches Fest, das zu Ehren aller bekannten und unbekannten Heiligen gefeiert wird. Der Feiertag ist auch als Allerheiligentag, Halloween, Allerheiligenfest oder Allerheiligenfeiertag bekannt.
in scheme: mediatopic
created: 2019-09-05T12:00:00+00:00
modified: 2021-12-17T12:00:00+00:00
broader: Religionsfest oder Feiertag

Walpurgisnacht
type: Concept
definition: Der Vorabend des christlichen Festtages der Heiligen Walpurga, einer Äbtissin aus dem 8. Jahrhundert in Frankreich, der in der Nacht vom 30. April auf den 1. Mai gefeiert wird
in scheme: mediatopic
created: 2019-09-05T12:00:00+00:00
modified: 2021-07-12T12:00:00+00:00
broader: Religionsfest oder Feiertag

Eid al-Adha
type: Concept
definition: Muslimisches Fest, das den Höhepunkt der jährlichen Hadsch-Pilgerfahrt markiert und an die Bereitschaft des Propheten Ibrahim erinnert, seinen Sohn zu opfern
in scheme: mediatopic
created: 2021-12-17T12:00:00+00:00
modified: 2021-12-21T12:00:00+00:00
broader: Religionsfest oder Feiertag

Chanukka
type: Concept
definition: Jüdisches Fest, manchmal auch Hanukkah genannt, bei dem die Kerzen einer Menora angezündet werden
in scheme: mediatopic
created: 2021-12-17T12:00:00+00:00
modified: 2021-12-21T12:00:00+00:00
broader: Religionsfest oder Feiertag

Taufe
type: Concept
definition: Ein christlicher religiöser Ritus, bei dem man einer Person Weihwasser auf die Stirn spritzt oder sie in Wasser taucht, was Reinigung und Aufnahme in die Kirche symbolisiert.
in scheme: mediatopic
created: 2019-09-05T12:00:00+00:00
modified: 2021-12-17T12:00:00+00:00
broader: Religionsritual

Bar Mitzwa und Bat Mitzwa
type: Concept
definition: Junge Menschen, die im jüdischen Glauben erwachsen werden
in scheme: mediatopic
created: 2021-12-17T12:00:00+00:00
modified: 2021-12-21T12:00:00+00:00
broader: Religionsritual

Heiligsprechung
type: Concept
definition: Die Erklärung einer verstorbenen Person als offiziell anerkannter Heiliger
in scheme: mediatopic
created: 2021-12-17T12:00:00+00:00
modified: 2021-12-21T12:00:00+00:00
broader: Religionsritual

Kirche
type: Concept
definition: Ein erkennbares Gebäude als Ort für den Gottesdienst der christlichen Religion
in scheme: mediatopic
created: 2009-10-22T02:00:00+00:00
modified: 2021-12-17T12:00:00+00:00
broader: Religiöse Bauwerke
broad match: http://cv.iptc.org/newscodes/subjectcode/12000000

Moschee
type: Concept
definition: Ein erkennbares Gebäude als Ort für den Gottesdienst des Islam
in scheme: mediatopic
created: 2009-10-22T02:00:00+00:00
modified: 2021-12-17T12:00:00+00:00
broader: Religiöse Bauwerke
broad match: http://cv.iptc.org/newscodes/subjectcode/12000000

Synagoge
type: Concept
definition: Ein erkennbares Gebäude als Ort für den Gottesdienst des Judentums
in scheme: mediatopic
created: 2009-10-22T02:00:00+00:00
modified: 2021-12-17T12:00:00+00:00
broader: Religiöse Bauwerke
broad match: http://cv.iptc.org/newscodes/subjectcode/12000000

Tempel
type: Concept
definition: Ein erkennbares Gebäude als Ort für den Gottesdienst
in scheme: mediatopic
created: 2009-10-22T02:00:00+00:00
retired: 2021-12-17T12:00:00+00:00
modified: 2021-02-18T12:00:00+00:00
broader: Religiöse Bauwerke
broad match: http://cv.iptc.org/newscodes/subjectcode/12000000

Papst
type: Concept
definition: Weltweites Oberhaupt der römisch-katholischen Kirche
in scheme: mediatopic
created: 2009-10-22T02:00:00+00:00
modified: 2021-12-17T12:00:00+00:00
broader: Religiöses Oberhaupt

Bibel
type: Concept
definition: Heilige Schrift des Christentums, bestehend aus dem Alten und dem Neuen Testament
in scheme: mediatopic
created: 2009-10-22T02:00:00+00:00
modified: 2021-12-17T12:00:00+00:00
broader: Religiöse Schriften

Koran
type: Concept
definition: Heiliges Buch des Islam
in scheme: mediatopic
created: 2009-10-22T02:00:00+00:00
modified: 2021-02-18T12:00:00+00:00
broader: Religiöse Schriften

Thora
type: Concept
definition: Heiliges Buch des Judentums
in scheme: mediatopic
created: 2009-10-22T02:00:00+00:00
modified: 2021-12-17T12:00:00+00:00
broader: Religiöse Schriften

Biotechnologie
type: Concept
definition: Alle Aspekte des menschlichen Verständnisses sowie der methodischen Erforschung der Natur-, Form- und Sozialwissenschaften, wie Astronomie, Linguistik oder Ökonomie
in scheme: mediatopic
created: 2009-10-22T02:00:00+00:00
modified: 2021-02-18T12:00:00+00:00
broader: Biomedizin

Maschinenbau
type: Concept
definition: Wissenschaft und Anwendung des Designs, der Konstruktion und des Funktionierens von mechanischen Systemen
in scheme: mediatopic
created: 2009-10-22T02:00:00+00:00
modified: 2021-02-18T12:00:00+00:00
broader: Technologie und Technik
broad match: http://cv.iptc.org/newscodes/subjectcode/13002000

Astronomie
type: Concept
definition: Das Studium von Himmelsobjekten durch direkte Beobachtung und theoretische Modelle
in scheme: mediatopic
created: 2009-10-22T02:00:00+00:00
modified: 2021-02-18T12:00:00+00:00
broader: Naturwissenschaft

Biologie
type: Concept
definition: Das Studium der Anatomie, des Verhaltens, der Herkunft, der Physiologie und anderer Aspekte lebender Organismen
in scheme: mediatopic
created: 2009-10-22T02:00:00+00:00
modified: 2021-02-18T12:00:00+00:00
broader: Naturwissenschaft
narrower: Botanik
narrower: Genetik
narrower: Paläontologie
narrower: Physiologie
narrower: Zoologie

Chemie
type: Concept
definition: Die Untersuchung der Zusammensetzung und Eigenschaften der Materie auf der Skala der Atome und Moleküle und der Reaktionen zwischen den Verbindungen
in scheme: mediatopic
created: 2009-10-22T02:00:00+00:00
modified: 2021-02-18T12:00:00+00:00
broader: Naturwissenschaft

Kosmologie
type: Concept
definition: Die Erforschung der Entstehung, Entwicklung, Organisation und Struktur des Universums
in scheme: mediatopic
created: 2009-10-22T02:00:00+00:00
modified: 2021-02-18T12:00:00+00:00
broader: Naturwissenschaft

Geologie
type: Concept
definition: Untersuchung der physikalischen Prozesse, der materiellen Strukturen und der Eigenschaften der Erde
in scheme: mediatopic
created: 2009-10-22T02:00:00+00:00
modified: 2021-02-18T12:00:00+00:00
broader: Naturwissenschaft

Gartenbau
type: Concept
definition: Studium und Kunst der Pflanzenzucht, einschließlich Landschafts- und Gartengestaltung und Pflanzenschutz
in scheme: mediatopic
created: 2009-10-22T02:00:00+00:00
modified: 2021-02-18T12:00:00+00:00
broader: Naturwissenschaft
broad match: http://cv.iptc.org/newscodes/subjectcode/13004000

Meeresforschung
type: Concept
definition: Untersuchung von Lebewesen und Lebensräumen in Salzwasser-Ökosystemen
in scheme: mediatopic
created: 2009-10-22T02:00:00+00:00
modified: 2021-02-18T12:00:00+00:00
broader: Naturwissenschaft

Meteorologie
type: Concept
definition: Studium der Atmosphärenchemie und -physik mit Schwerpunkt Wettervorhersage
in scheme: mediatopic
created: 2009-10-22T02:00:00+00:00
modified: 2021-02-18T12:00:00+00:00
broader: Naturwissenschaft

Physik
type: Concept
definition: Die Untersuchung der Bewegung und Struktur der Materie und ihrer Beziehung zur Energie
in scheme: mediatopic
created: 2009-10-22T02:00:00+00:00
modified: 2021-02-18T12:00:00+00:00
broader: Naturwissenschaft
narrower: Elektromagnetismus
narrower: Atomphysik

Botanik
type: Concept
definition: Untersuchung der physikalischen und physiologischen Struktur, der Genetik, der Ökologie und anderer Aspekte von Pflanzen
in scheme: mediatopic
created: 2009-10-22T02:00:00+00:00
modified: 2021-02-18T12:00:00+00:00
broader: Biologie

Genetik
type: Concept
definition: Die Erforschung von Genen in lebenden Organismen und ihrer Rolle bei Vererbung, Entwicklung oder genetischer Anpassung
in scheme: mediatopic
created: 2009-10-22T02:00:00+00:00
modified: 2021-02-18T12:00:00+00:00
broader: Biologie

Paläontologie
type: Concept
definition: Studium ausgestorbener Tiere und Fossilien
in scheme: mediatopic
created: 2009-10-22T02:00:00+00:00
modified: 2021-02-18T12:00:00+00:00
broader: Biologie

Physiologie
type: Concept
definition: Untersuchung der Lebensprozesse, inneren Organe oder Funktionsmechanismen lebender Organismen
in scheme: mediatopic
created: 2009-10-22T02:00:00+00:00
modified: 2021-02-18T12:00:00+00:00
broader: Biologie

Zoologie
type: Concept
definition: Das Studium der Biologie, Physiologie, Entwicklung, Verhalten oder andere Aspekte der Tiere
in scheme: mediatopic
created: 2009-10-22T02:00:00+00:00
modified: 2021-02-18T12:00:00+00:00
broader: Biologie

Elektromagnetismus
type: Concept
definition: Untersuchung der physikalischen Wechselwirkungen zwischen elektrisch geladenen Teilchen und Magnetfeldern
in scheme: mediatopic
created: 2009-10-22T02:00:00+00:00
modified: 2021-07-12T12:00:00+00:00
broader: Physik
broad match: http://cv.iptc.org/newscodes/subjectcode/13001001

Atomphysik
type: Concept
definition: Untersuchung der Struktur und des Verhaltens von Atomkernen
in scheme: mediatopic
created: 2009-10-22T02:00:00+00:00
modified: 2021-02-18T12:00:00+00:00
broader: Physik
narrower: Teilchenphysik
broad match: http://cv.iptc.org/newscodes/subjectcode/13001001

Teilchenphysik
type: Concept
definition: Die Untersuchung der Natur, der Eigenschaften und der Wechselwirkungen der Elementarteilchen, die die Materie ausmachen
in scheme: mediatopic
created: 2009-10-22T02:00:00+00:00
modified: 2021-02-18T12:00:00+00:00
broader: Atomphysik

Forschung und Entwicklung
type: Concept
definition: Die Entwicklung oder Schaffung neuer wissenschaftlicher oder technologischer Produkte oder Verfahren, wie z.B. biotechnologische oder künstliche Intelligenzanwendungen, robotische Gliedmaßen oder nanoskalige Kameras
in scheme: mediatopic
created: 2009-10-22T02:00:00+00:00
modified: 2021-02-18T12:00:00+00:00
broader: Forschung
broad match: http://cv.iptc.org/newscodes/subjectcode/13006000

Medizinische Forschung
type: Concept
definition: Untersuchungen in den Bereichen Gesundheit und Medizin, wie z.B. genetische Studien, Krankheitsforschung oder Arzneimittelversuche
in scheme: mediatopic
created: 2009-10-22T02:00:00+00:00
modified: 2021-02-18T12:00:00+00:00
broader: Forschung

Wissenschaftliche Forschung
type: Concept
definition: Land-, See- oder Weltraumreisen zur Entdeckung neuer Informationen
in scheme: mediatopic
created: 2009-10-22T02:00:00+00:00
modified: 2021-02-18T12:00:00+00:00
broader: Forschung
narrower: Weltraumforschung

Wissenschaftliche Veröffentlichung
type: Concept
definition: Wissenschaftliche Forschungsergebnisse, die in einer Zeitschrift, einem Buch oder einer Dissertation veröffentlicht wurden
in scheme: mediatopic
created: 2009-10-22T02:00:00+00:00
modified: 2021-02-18T12:00:00+00:00
broader: Forschung
broad match: http://cv.iptc.org/newscodes/subjectcode/13006000

Weltraumforschung
type: Concept
definition: Die wissenschaftliche Erforschung des Weltraums durch bemannte und unbemannte Missionen
in scheme: mediatopic
created: 2009-10-22T02:00:00+00:00
modified: 2021-02-18T12:00:00+00:00
broader: Wissenschaftliche Forschung

Anthropologie
type: Concept
definition: Die Untersuchung des menschlichen Verhaltens und der sozialen Interaktionen im Zeitablauf
in scheme: mediatopic
created: 2009-10-22T02:00:00+00:00
modified: 2021-02-18T12:00:00+00:00
broader: Sozialwissenschaften

Archäologie
type: Concept
definition: Das Studium der menschlichen Tätigkeit im Laufe der Zeit und der Kulturgeschichte unter Verwendung von Artefakten, die von alten Völkern zurückgelassen wurden
in scheme: mediatopic
created: 2009-10-22T02:00:00+00:00
modified: 2021-02-18T12:00:00+00:00
broader: Sozialwissenschaften

Wirtschaftswissenschaft
type: Concept
definition: Das Studium der Gesetze und Prinzipien der Wirtschaft, wie z.B. der Produktion und des Vertriebs von Waren und Dienstleistungen
in scheme: mediatopic
created: 2009-10-22T02:00:00+00:00
modified: 2021-02-18T12:00:00+00:00
broader: Sozialwissenschaften
broad match: http://cv.iptc.org/newscodes/subjectcode/04017000

Geografie
type: Concept
definition: Die Untersuchung der physikalischen Eigenschaften der Erdoberfläche und ihrer politischen Spaltungen
in scheme: mediatopic
created: 2009-10-22T02:00:00+00:00
modified: 2021-02-18T12:00:00+00:00
broader: Sozialwissenschaften

Geschichte
type: Concept
definition: Wissenschaft menschlicher Ereignisse der Vergangenheit
in scheme: mediatopic
created: 2009-10-22T02:00:00+00:00
modified: 2021-02-18T12:00:00+00:00
broader: Sozialwissenschaften

Informationswissenschaft
type: Concept
definition: Das Studium und die Praxis des Sammelns, Klassifizierens, Speicherns, Abrufens und Verbreitens von Informationen
in scheme: mediatopic
created: 2009-10-22T02:00:00+00:00
modified: 2021-02-18T12:00:00+00:00
broader: Sozialwissenschaften
broad match: http://cv.iptc.org/newscodes/subjectcode/13003001

Jura
type: Concept
definition: Wissenschaft der Gesetzgebung und der Philosophie des Rechts
in scheme: mediatopic
created: 2009-10-22T02:00:00+00:00
modified: 2023-10-02T12:00:00+00:00
broader: Sozialwissenschaften
broad match: http://cv.iptc.org/newscodes/subjectcode/13003001

Linguistik
type: Concept
definition: Das Studium aller Aspekte der menschlichen Sprache wie Syntax, Phonetik, geschriebene und gesprochene Formen und Variationen im Laufe der Zeit
in scheme: mediatopic
created: 2009-10-22T02:00:00+00:00
modified: 2021-02-18T12:00:00+00:00
broader: Sozialwissenschaften
broad match: http://cv.iptc.org/newscodes/subjectcode/13000000

Philosophie
type: Concept
definition: Das Studium der Prinzipien und grundsätzlichen Fragen zu Themen wie Geist, Vernunft, Moral oder Werte
in scheme: mediatopic
created: 2009-10-22T02:00:00+00:00
modified: 2021-02-18T12:00:00+00:00
broader: Sozialwissenschaften

Politikwissenschaft
type: Concept
definition: Das Studium der Prinzipien politischer und staatlicher Systeme, des politischen Denkens und Handelns
in scheme: mediatopic
created: 2009-10-22T02:00:00+00:00
modified: 2021-02-18T12:00:00+00:00
broader: Sozialwissenschaften
broad match: http://cv.iptc.org/newscodes/subjectcode/13000000

Psychologie
type: Concept
definition: Das Studium des menschlichen Geistes, der geistigen Eigenschaften und der emotionalen Prozesse
in scheme: mediatopic
created: 2009-10-22T02:00:00+00:00
modified: 2021-02-18T12:00:00+00:00
broader: Sozialwissenschaften

Soziologie
type: Concept
definition: Die Untersuchung menschlicher sozialer Organisation, sozialer Beziehungen und gesellschaftlicher Veränderungen
in scheme: mediatopic
created: 2009-10-22T02:00:00+00:00
modified: 2021-02-18T12:00:00+00:00
broader: Sozialwissenschaften

Luft- und Raumfahrttechnik
type: Concept
definition: Studie, Design, Entwicklung und Bau von Flugzeugen, Raumfahrzeugen und Flugkörpersystemen
in scheme: mediatopic
created: 2009-10-22T02:00:00+00:00
modified: 2021-02-18T12:00:00+00:00
broader: Technologie und Technik
narrower: Raketentechnik
broad match: http://cv.iptc.org/newscodes/subjectcode/04011001

Agrarwissenschaft
type: Concept
definition: Untersuchung und Entwicklung von Techniken und Maschinen zur Verbesserung der landwirtschaftlichen Bewirtschaftung und Produktivität
in scheme: mediatopic
created: 2009-10-22T02:00:00+00:00
modified: 2021-05-05T12:00:00+00:00
broader: Technologie und Technik
broad match: http://cv.iptc.org/newscodes/subjectcode/13020000

Ingenieurwesen
type: Concept
definition: Untersuchung, Planung, Entwicklung und Bau von Bauwerken wie Gebäuden, Brücken, Tunneln, Bewässerungs- und Abwassersystemen, Straßen oder Eisenbahnen
in scheme: mediatopic
created: 2009-10-22T02:00:00+00:00
modified: 2021-02-18T12:00:00+00:00
broader: Technologie und Technik
broad match: http://cv.iptc.org/newscodes/subjectcode/13002000

Eletrotechnik
type: Concept
definition: Studie, Entwurf, Entwicklung und Anwendung von Systemen, die auf dem Austausch von elektrischen Ladungen basieren, wie z.B. Verbrauchergeräte, Kommunikationssysteme oder Industriecomputer
in scheme: mediatopic
created: 2009-10-22T02:00:00+00:00
modified: 2021-02-18T12:00:00+00:00
broader: Technologie und Technik

Technologie zur Identitätsprüfung
type: Concept
definition: Untersuchung, Entwicklung, Anwendung und ethische Überlegungen zu technologischen Methoden zur Identifizierung von Produkten, Tieren oder Menschen, einschließlich Radiofrequenz, Biometrie oder Gesichtserkennung
in scheme: mediatopic
created: 2009-10-22T02:00:00+00:00
modified: 2021-02-18T12:00:00+00:00
broader: Technologie und Technik

Informatik
type: Concept
definition: Untersuchung und Entwurf von Computersystemen, Software und Netzwerken
in scheme: mediatopic
created: 2009-10-22T02:00:00+00:00
modified: 2021-02-18T12:00:00+00:00
broader: Technologie und Technik
narrower: Künstliche Intelligenz

Materialwissenschaft
type: Concept
definition: Untersuchung der Zusammensetzung, Struktur und Eigenschaften von Werkstoffen für den Einsatz in Industrie und Fertigung
in scheme: mediatopic
created: 2009-10-22T02:00:00+00:00
modified: 2021-02-18T12:00:00+00:00
broader: Technologie und Technik

Mikroelektronik
type: Concept
definition: Das Studium und die Entwicklung von Technologien im mikroskopischen Maßstab, wie z.B. Mikrobiologie oder Mikrocomputing
in scheme: mediatopic
created: 2009-10-22T02:00:00+00:00
modified: 2021-02-18T12:00:00+00:00
broader: Technologie und Technik
narrower: Nanotechnologie

Raketentechnik
type: Concept
definition: Studie, Entwurf, Entwicklung und Bau von Raketen
in scheme: mediatopic
created: 2009-10-22T02:00:00+00:00
modified: 2021-02-18T12:00:00+00:00
broader: Luft- und Raumfahrttechnik

Künstliche Intelligenz
type: Concept
definition: Ein Versuch, Computer simulieren zu lassen, wie das menschliche Gehirn arbeitet, indem statistische, heuristische oder maschinelle Lernmethoden und Algorithmen auf große Datensätze angewendet werden. Ermöglicht eine Vielzahl von automatischen Funktionen wie Bilderkennung und Kategorisierung.
in scheme: mediatopic
created: 2020-08-05T12:00:00+00:00
modified: 2021-07-12T12:00:00+00:00
broader: Informatik

Nanotechnologie
type: Concept
definition: Die Erforschung von Technologien, die Materialien oder Vorrichtungen auf atomarer oder molekularer Ebene beinhalten
in scheme: mediatopic
created: 2009-10-22T02:00:00+00:00
modified: 2021-02-18T12:00:00+00:00
broader: Mikroelektronik

Soziales Netzwerk
type: Concept
definition: Bildung von Gemeinschaften auch durch die Nutzung von Online-Medien
in scheme: mediatopic
created: 2009-10-22T02:00:00+00:00
modified: 2021-02-18T12:00:00+00:00
broader: Gesellschaft
broad match: http://cv.iptc.org/newscodes/subjectcode/14000000

gemeinschaftliche Gruppen
type: Concept
definition: Gesellschaftliche Organisationen, deren Mitglieder sich freiwillig zu einem für beide Seiten vorteilhaften Zweck zusammenschließen, z. B. aus sozialen, beruflichen oder ehrenamtlichen Gründen. Zu diesen Gruppen gehören Rotary Clubs, Lions Clubs oder Freimaurer.
in scheme: mediatopic
created: 2022-09-23T12:00:00+00:00
modified: 2022-09-23T12:00:00+00:00
broader: Gesellschaft

Bevölkerungszahl
type: Concept
definition: Die Anzahl von Menschen einer geografischen Region und der Prozess diese zu zählen.
in scheme: mediatopic
created: 2009-10-22T02:00:00+00:00
modified: 2021-05-05T12:00:00+00:00
broader: Bevölkerungsentwicklung

Illegale Einwanderung
type: Concept
definition: Bewegung von Individuen von einem Land in ein anderes auf illegalem Weg
in scheme: mediatopic
created: 2009-10-22T02:00:00+00:00
modified: 2021-02-18T12:00:00+00:00
broader: Einwanderung

Altersdiskriminierung
type: Concept
definition: Schädigendes Verhalten gegenüber einer anderen Gruppe auf der Grundlage des Alters
in scheme: mediatopic
created: 2009-10-22T02:00:00+00:00
modified: 2021-02-18T12:00:00+00:00
broader: Diskriminierung
broad match: http://cv.iptc.org/newscodes/subjectcode/14025003

Rassismus
type: Concept
definition: Schädigendes Verhalten gegenüber einer anderen Gruppe auf der Grundlage von Unterschieden der Abstammung.
in scheme: mediatopic
created: 2009-10-22T02:00:00+00:00
modified: 2021-02-18T12:00:00+00:00
broader: Diskriminierung

Religiöse Diskriminierung
type: Concept
definition: Schädigendes Verhalten gegenüber einer anderen Gruppe auf der Grundlage der Religion oder des unterschiedlichen Glaubens
in scheme: mediatopic
created: 2009-10-22T02:00:00+00:00
modified: 2021-02-18T12:00:00+00:00
broader: Diskriminierung
broad match: http://cv.iptc.org/newscodes/subjectcode/14025003

Sexismus
type: Concept
definition: Schädigendes Verhalten gegenüber einer anderen Gruppe auf der Grundlage des Geschlechts
in scheme: mediatopic
created: 2009-10-22T02:00:00+00:00
modified: 2021-09-30T12:00:00+00:00
broader: Diskriminierung
broad match: http://cv.iptc.org/newscodes/subjectcode/14025003

Adoption
type: Concept
definition: Ein legaler Vorgang ein elternloses Kind in eine Beziehung zu integrieren
in scheme: mediatopic
created: 2009-10-22T02:00:00+00:00
modified: 2021-02-18T12:00:00+00:00
broader: Familie

Partnerwahl
type: Concept
definition: Vorbereitungen um einen Partner zu werben und für sich zu gewinnen
in scheme: mediatopic
created: 2009-10-22T02:00:00+00:00
modified: 2021-07-12T12:00:00+00:00
broader: Familie

Scheidung
type: Concept
definition: Der Vorgang, durch den eine Ehe aufgehoben wird
in scheme: mediatopic
created: 2009-10-22T02:00:00+00:00
modified: 2022-06-14T12:00:00+00:00
broader: Familie

Familienplanung
type: Concept
definition: Bewusste Entscheidungen und Bemühungen in Bezug auf die Fortpflanzung/Reproduktion
in scheme: mediatopic
created: 2009-10-22T02:00:00+00:00
modified: 2022-06-14T12:00:00+00:00
broader: Familie
narrower: Schwangerschaftsabbruch
narrower: Verhütung

Heirat
type: Concept
definition: Die Gemeinschaft von zwei Individuen, die sich Treue, Respekt und gegenseitige Unterstützung versprechen
in scheme: mediatopic
created: 2009-10-22T02:00:00+00:00
modified: 2021-03-15T12:00:00+00:00
broader: Familie

Eltern und Kind
type: Concept
definition: Zwei oder mehrere Personen in einer hierarchischen familiären Beziehung
in scheme: mediatopic
created: 2009-10-22T02:00:00+00:00
modified: 2021-02-18T12:00:00+00:00
broader: Familie

Schwangerschaft und Geburt
type: Concept
definition: Soziale und medizinische Fragen rund um Schwangerschaft und Geburt, einschließlich Doulas und Hebammen, Geburtshilfe und medizinische Fragen
in scheme: mediatopic
created: 2022-06-14T12:00:00+00:00
modified: 2022-06-14T12:00:00+00:00
broader: Familie

Schwangerschaftsabbruch
type: Concept
definition: In der Regel der geplante Abbruch des Prozesses zur Reproduktion menschlichen Lebens
in scheme: mediatopic
created: 2009-10-22T02:00:00+00:00
modified: 2021-02-18T12:00:00+00:00
broader: Familienplanung

Verhütung
type: Concept
definition: Ein Verfahren oder eine Vorrichtung zur Verhinderung einer Schwangerschaft
in scheme: mediatopic
created: 2019-09-05T12:00:00+00:00
modified: 2021-07-12T12:00:00+00:00
broader: Familienplanung

Erwachsener
type: Concept
definition: Menschen, die das Alter der juristischen Volljährigkeit erreicht haben
in scheme: mediatopic
created: 2009-10-22T02:00:00+00:00
modified: 2021-02-18T12:00:00+00:00
broader: Bevölkerung

Kind
type: Concept
definition: Noch nicht entwickelte Menschen, gewöhnlich bis zum Alter der Pubertät
in scheme: mediatopic
created: 2009-10-22T02:00:00+00:00
modified: 2021-02-18T12:00:00+00:00
broader: Bevölkerung

Behinderung
type: Concept
definition: Sowohl körperlich, als auch psychisch oder geistig eingeschränkt sein
in scheme: mediatopic
created: 2009-10-22T02:00:00+00:00
modified: 2024-03-28T12:00:00+00:00
broader: Bevölkerung

Homosexuelle
type: Concept
definition: Menschen, die sich auf sinnliche, erotische oder vergleichbare Weise zu dem eigenen Geschlecht hingezogen fühlen
in scheme: mediatopic
created: 2009-10-22T02:00:00+00:00
modified: 2021-05-05T12:00:00+00:00
broader: Bevölkerung

Geschlecht
type: Concept
definition: Die Einteilung von Individuen in weiblich und männlich
in scheme: mediatopic
created: 2009-10-22T02:00:00+00:00
modified: 2021-02-18T12:00:00+00:00
broader: Bevölkerung
broad match: http://cv.iptc.org/newscodes/subjectcode/14024000

Kleinkind
type: Concept
definition: Menschen von Geburt bis zum 1. oder 2. Lebensjahr, gewöhnlich wenn sie beginnen zu laufen
in scheme: mediatopic
created: 2009-10-22T02:00:00+00:00
modified: 2021-02-18T12:00:00+00:00
broader: Bevölkerung

Nationale oder ethische Minderheit
type: Concept
definition: Gruppe von Menschen, die eine Minderheit bilden auf ethnischer oder nationaler Grundlage, ihres Status, ihrer Probleme und Beziehungen zur Mehrheit
in scheme: mediatopic
created: 2009-10-22T02:00:00+00:00
modified: 2021-02-18T12:00:00+00:00
broader: Bevölkerung

Strahlenopfer
type: Concept
definition: Schließt die Anti-Atomkraftbewegungen mit ein und Entschädigung für Strahlenopfer
in scheme: mediatopic
created: 2009-10-22T02:00:00+00:00
retired: 2019-10-07T12:00:00+00:00
modified: 2021-02-18T12:00:00+00:00
broader: Bevölkerung

Senior
type: Concept
definition: Menschen in dem Alter 60 bis 65 und älter
in scheme: mediatopic
created: 2009-10-22T02:00:00+00:00
modified: 2021-02-18T12:00:00+00:00
broader: Bevölkerung

Jugendlicher
type: Concept
definition: Menschen in dem Alter von 13 bis 19
in scheme: mediatopic
created: 2009-10-22T02:00:00+00:00
modified: 2021-02-18T12:00:00+00:00
broader: Bevölkerung

indigene Völker
type: Concept
definition: Menschen, die die ursprünglichen Eigentümer und Verwalter einer bestimmten Region sind, die auch als Ureinwohner, Erstvölker oder Ureinwohner bezeichnet werden, im Gegensatz zu Gruppen, die das Gebiet in jüngerer Zeit besiedelt, besetzt oder kolonisiert haben
in scheme: mediatopic
created: 2019-11-25T12:00:00+00:00
modified: 2021-07-12T12:00:00+00:00
broader: Bevölkerung

Frauen
type: Concept
definition: Menschen, die sich als weiblich identifizieren, wobei der Schwerpunkt auf der Gruppe als demografischer Gruppe und auf Errungenschaften liegt, wie z. B. die erste Frau, die einen Meilenstein erreicht oder ein Amt bekleidet
in scheme: mediatopic
created: 2021-05-05T12:00:00+00:00
modified: 2021-12-21T12:00:00+00:00
broader: Bevölkerung

Männer
type: Concept
definition: Personen, die sich als männlich identifizieren, mit Schwerpunkt auf der Gruppe als Demografie und der Männlichkeit
in scheme: mediatopic
created: 2021-05-05T12:00:00+00:00
modified: 2021-12-21T12:00:00+00:00
broader: Bevölkerung

Obdachlosigkeit
type: Concept
definition: Der Mangel an festem Wohnsitz
in scheme: mediatopic
created: 2009-10-22T02:00:00+00:00
modified: 2021-02-18T12:00:00+00:00
broader: Soziale Bedingung

Armut
type: Concept
definition: Unzureichende Möglichkeiten sich selbst oder die eigene Familie zu versorgen
in scheme: mediatopic
created: 2009-10-22T02:00:00+00:00
modified: 2021-02-18T12:00:00+00:00
broader: Soziale Bedingung

Misshandlung
type: Concept
definition: Die Misshandlung einer oder mehrerer Individuen durch andere, durch unmenschliche Behandlung, sexuelle und mentale Beleidigungen, Entzug von Sinneswahrnehmungen und körperlichen Bedürfnissen, körperliche Misshandlung wie Schläge mit eingeschlossen, oder andere Formen der Folter
in scheme: mediatopic
created: 2009-10-22T02:00:00+00:00
modified: 2021-02-18T12:00:00+00:00
broader: Soziales Problem

Sucht
type: Concept
definition: Gewohnheitsmäßiges und meist unkontrolliertes Konsumieren von gefährlichen Stoffen, wie Alkohol, Tabak, Medikamente oder Drogen
in scheme: mediatopic
created: 2009-10-22T02:00:00+00:00
modified: 2021-02-18T12:00:00+00:00
broader: Soziales Problem

Jugendkriminalität
type: Concept
definition: Vorfälle in die minderjährige Täter verwickelt sind
in scheme: mediatopic
created: 2009-10-22T02:00:00+00:00
modified: 2021-02-18T12:00:00+00:00
broader: Soziales Problem

Prostitution
type: Concept
definition: Männliche oder weibliche Sexualität als Ware, und diejenigen, die davon profitieren
in scheme: mediatopic
created: 2009-10-22T02:00:00+00:00
modified: 2021-02-18T12:00:00+00:00
broader: Soziales Problem

Sklaverei
type: Concept
definition: Die unfreiwillige Knechtschaft, außerhalb legaler Inhaftierung wegen krimineller Straftaten, von Männern, Frauen und Kindern, schließt unfreiwillige unbezahlte Arbeit, erzwungenes Verhalten und Kinderarbeit mit ein
in scheme: mediatopic
created: 2009-10-22T02:00:00+00:00
modified: 2021-02-18T12:00:00+00:00
broader: Soziales Problem

sexuelles Fehlverhalten
type: Concept
definition: Unerwünschtes Verhalten sexueller Natur, das weniger strafbar ist als schwere sexuelle Übergriffe, insbesondere wenn das Verhalten in einer normalerweise nicht-sexuellen Situation auftritt oder wenn ein Aspekt persönlicher Macht oder Autorität involviert ist
in scheme: mediatopic
created: 2019-04-06T12:00:00+00:00
modified: 2024-07-01T12:00:00+00:00
broader: Soziales Problem

Mobbing
type: Concept
definition: Das Ergreifen von Maßnahmen, die darauf abzielen, eine als verletzlich empfundene Person zu verletzen, zu zwingen und einzuschüchtern. Diese Maßnahmen können persönlich oder online ergriffen werden.
in scheme: mediatopic
created: 2019-11-20T12:00:00+00:00
modified: 2021-07-12T12:00:00+00:00
broader: Soziales Problem

Korruptes Verhalten
type: Concept
definition: Jedes Verhalten, was anderen schadet
in scheme: mediatopic
created: 2009-10-22T02:00:00+00:00
retired: 2019-10-07T12:00:00+00:00
modified: 2021-02-18T12:00:00+00:00
broader: Wertvorstellung

Tod und Sterben
type: Concept
definition: Soziale Aspekte von Tod und Sterben
in scheme: mediatopic
created: 2009-10-22T02:00:00+00:00
modified: 2021-02-18T12:00:00+00:00
broader: Wertvorstellung
narrower: Sterbehilfe
narrower: Selbstmord

Ethik
type: Concept
definition: Glaubenssystem aus akzeptablem Verhalten
in scheme: mediatopic
created: 2009-10-22T02:00:00+00:00
modified: 2021-07-12T12:00:00+00:00
broader: Wertvorstellung

Pornografie
type: Concept
definition: Akustische oder bildliche Darstellungen von verschiedenartigen im Zusammenhang mit Sexualität stehenden Taten, außerhalb der gesellschaftlich akzeptierten Normen
in scheme: mediatopic
created: 2009-10-22T02:00:00+00:00
modified: 2021-02-18T12:00:00+00:00
broader: Wertvorstellung

SexuellesVerhalten
type: Concept
definition: Sexualverhalten von Einzelnen oder Gruppen
in scheme: mediatopic
created: 2009-10-22T02:00:00+00:00
modified: 2021-02-18T12:00:00+00:00
broader: Wertvorstellung
broad match: http://cv.iptc.org/newscodes/subjectcode/12006000

Sterbehilfe
type: Concept
definition: Unterstützung des Sterbens einer kranken Person
in scheme: mediatopic
created: 2009-10-22T02:00:00+00:00
modified: 2021-02-18T12:00:00+00:00
broader: Tod und Sterben
narrower: Beihilfe zum Selbstmord

Selbstmord
type: Concept
definition: Tod durch die eigene Hand
in scheme: mediatopic
created: 2009-10-22T02:00:00+00:00
modified: 2021-02-18T12:00:00+00:00
broader: Tod und Sterben

Beihilfe zum Selbstmord
type: Concept
definition: Freiwilliger Tod durch fremde Hilfe
in scheme: mediatopic
created: 2009-10-22T02:00:00+00:00
modified: 2021-02-18T12:00:00+00:00
broader: Sterbehilfe
broad match: http://cv.iptc.org/newscodes/subjectcode/14005000

Wohltätigkeit
type: Concept
definition: Menschenfreundliche Gabe
in scheme: mediatopic
created: 2009-10-22T02:00:00+00:00
modified: 2021-05-05T12:00:00+00:00
broader: Sozialfürsorge

Langzeitpflege
type: Concept
definition: Umfassende Gesundheitspflege aufgrund ernsthafter Krankheit oder Invalidität
in scheme: mediatopic
created: 2009-10-22T02:00:00+00:00
modified: 2021-05-05T12:00:00+00:00
broader: Sozialfürsorge

Sozialer Dienst
type: Concept
definition: Programme, die von der Regierung unterstützt werden zur Verbesserung des Wohlergehens von Individuen oder Gruppen von Individuen
in scheme: mediatopic
created: 2009-10-22T02:00:00+00:00
modified: 2021-02-18T12:00:00+00:00
broader: Sozialfürsorge

Altenpflege
type: Concept
definition: Die Langzeitpflege älterer Menschen durch stationäre Einrichtungen oder durch bezahlte tägliche Hilfe zu Hause
in scheme: mediatopic
created: 2019-06-26T12:00:00+00:00
modified: 2021-07-12T12:00:00+00:00
broader: Sozialfürsorge

Sozialer Wohnungsbau
type: Concept
definition: Wohnungen, die Eigentum einer Regierung oder einer gemeinnützigen Organisation sind oder von ihr verwaltet werden und an Mieter vermietet werden, mit dem Ziel, Wohnraum erschwinglich zu machen. Die Anspruchsberechtigung für solche Wohnvereinbarungen variiert von Land zu Land.
in scheme: mediatopic
created: 2020-08-05T12:00:00+00:00
modified: 2021-07-12T12:00:00+00:00
broader: Sozialfürsorge

Kinderbetreuung
type: Concept
definition: Dienste und Einrichtungen, die Kinder betreuen, während ihre Eltern arbeiten oder abwesend sind, einschließlich Kindertagesstätten und -programme
in scheme: mediatopic
created: 2021-02-18T12:00:00+00:00
modified: 2021-07-12T12:00:00+00:00
broader: Sozialfürsorge

American football
type: Concept
definition: Mannschaftsballspiel, bei dem zwei Teams gegeneinander spielen, die Gebiete angreifen und verteidigen müssen. Jeder Angriff folgt auf die Verteidigung der anderen, mit dem Versuch einen Ball in das Feld und in die Zone zu bringen, einen Touchdown zu erzielen und damit Punkte zu machen
in scheme: mediatopic
created: 2009-10-22T02:00:00+00:00
modified: 2021-02-18T12:00:00+00:00
broader: Disziplin

Bogenschießen
type: Concept
definition: Bogenschütze benutzt Bogen und Pfeile, um eine Zielscheibe zu treffen mit 1.22 Meter Durchmesser, im Durchschnitt in 70 Meter Entfernung
in scheme: mediatopic
created: 2009-10-22T02:00:00+00:00
modified: 2021-02-18T12:00:00+00:00
broader: Disziplin
narrower: Armbrust
narrower: Langbogen

Leichtathletik
type: Concept
definition: Wettbewerbe im Laufen, Springen und Werfen, die auf einer Bahn im Stadion oder auf der Straße ausgeübt werden können
in scheme: mediatopic
created: 2009-10-22T02:00:00+00:00
modified: 2021-05-05T12:00:00+00:00
broader: Disziplin
narrower: Geländelauf
narrower: Zehnkampf
narrower: Diskuswerfen
narrower: Hammerwerfen
narrower: Siebenkampf
narrower: Hochsprung
narrower: Hürden
narrower: Speerwurf
narrower: Langstreckenlauf
narrower: Weitsprung
narrower: Mittelstreckenlauf
narrower: Fünfkampf
narrower: Stabhochsprung
narrower: Gehen
narrower: Staffellauf
narrower: Kugelstoßen
narrower: Sprint
narrower: Dreisprung
narrower: Hindernislauf (Leichtathletik)

Australian rules football
type: Concept
definition: Football der mit australischen Regeln gespielt wird
in scheme: mediatopic
created: 2009-10-22T02:00:00+00:00
modified: 2021-02-18T12:00:00+00:00
broader: Disziplin

Badminton
type: Concept
definition: Zwei Spieler oder Teams mit zwei Spielern, die einen Federball mit dem ungefähren Gewicht von 5 Gramm über ein hohes Netz schlagen. Das Ziel für jeden Spieler/Team ist es, die Landung des Federballs auf ihrer Seite des Feldes zu verhindern
in scheme: mediatopic
created: 2009-10-22T02:00:00+00:00
modified: 2021-02-18T12:00:00+00:00
broader: Disziplin

Bandy
type: Concept
definition: Wird im Freien auf Eis gespielt. Die Größe des Spielfeldes entspricht einem Fußballfeld. Benutzt werden Schlittschuhe wie im Eishockey und ein kleiner Kunststoffball. Die Schläger der Spieler ähneln Eishockeyschlägern, sind aber kürzer und stärker gerundet
in scheme: mediatopic
created: 2009-10-22T02:00:00+00:00
modified: 2021-02-18T12:00:00+00:00
broader: Disziplin

Baseball
type: Concept
definition: Ein Spiel zwischen zwei Teams von neun auf einem geschlossenen Platz. Das Team mit den meisten Punkten gewinnt. Ein Punkt wird gemacht, wenn ein Spieler über den Platz läuft und dabei 4 Stationen passiert
in scheme: mediatopic
created: 2009-10-22T02:00:00+00:00
modified: 2021-02-18T12:00:00+00:00
broader: Disziplin
narrower: Rubberball

Basketball
type: Concept
definition: Spiel zwischen zwei Teams mit 5 Spielern - Punkte werden gemacht in dem man einen großen aufgepumpten Ball in einen Korb wirft, der 3.05 Meter über dem Boden hängt
in scheme: mediatopic
created: 2009-10-22T02:00:00+00:00
modified: 2021-02-18T12:00:00+00:00
broader: Disziplin

Biathlon
type: Concept
definition: Eine Kombination aus Skilanglauf und Schießen auf Zielscheiben (auf einem 12,5 km langen Kurs, Verfolgungsstart)
in scheme: mediatopic
created: 2009-10-22T02:00:00+00:00
modified: 2021-05-05T12:00:00+00:00
broader: Disziplin

Billard
type: Concept
definition: Ein Spiel, was auf einem flachen Tisch gespielt wird, der mit Stoff bezogen ist, auf dem die Spieler Kugeln mit einem Holzqueue anstoßen nach bestimmten Regeln
in scheme: mediatopic
created: 2009-10-22T02:00:00+00:00
modified: 2021-02-18T12:00:00+00:00
broader: Disziplin
broad match: http://cv.iptc.org/newscodes/subjectcode/15010000
has facet: billiardtype

Bob
type: Concept
definition: Im Bobsport fahren zwei oder vier Athleten in einem Rennschlitten sitzend, der aus einer Verkleidung, einem Rahmen, zwei Achsen und Kufen besteht, eine Bahn (Natureis- oder Kunsteisbahn) hinab. Die Gesamtlaufzeit wird aus den Einzelzeiten der Läufe zusammengezählt und daraus der Gewinner ermittelt
in scheme: mediatopic
created: 2009-10-22T02:00:00+00:00
modified: 2022-02-03T12:00:00+00:00
broader: Disziplin

Boules und Pètanque
type: Concept
definition: Spiel bei dem die Spieler Kugeln auf eine Zielscheibe werfen. Der Gewinner ist derjenige, der am nächsten herankommt
in scheme: mediatopic
created: 2009-10-22T02:00:00+00:00
modified: 2021-05-05T12:00:00+00:00
broader: Disziplin

Boxen
type: Concept
definition: Kampfsport bei dem zwei Männer/Frauen kämpfen mit Fäusten, die geschützt sind durch Handschuhe, in einem Ring von 6 m je Seite. Der Kampf ist in der Regel geteilt in 12 Runden von jeweils 3 Minuten
in scheme: mediatopic
created: 2009-10-22T02:00:00+00:00
modified: 2021-02-18T12:00:00+00:00
broader: Disziplin
narrower: Bantamgewicht (Boxen)
narrower: Cruisergewicht (Boxen)
narrower: Federgewicht (Boxen)
narrower: Fliegengewicht (Boxen)
narrower: Schwergewicht (Boxen)
narrower: Leicht-Fliegengewicht (Boxen)
narrower: Leicht-Schwergewicht (Boxen)
narrower: Leicht-Mittelgewicht (Boxen)
narrower: Leicht-Weltergewicht (Boxen)
narrower: Leichtgewicht (Boxen)
narrower: Mittelgewicht (Boxen)
narrower: Strohgewicht (Boxen)
narrower: Super-Bantamgewicht (Boxen)
narrower: Super-Federgewicht (Boxen)
narrower: Super-Fliegengewicht (Boxen)
narrower: Super-Schwergewicht (Boxen)
narrower: Super-Mittelgewicht (Boxen)
narrower: Weltergewicht (Boxen)
has facet: weightclasstype

Stierkampf
type: Concept
definition: Klassischer Wettkampf Mann gegen Stier
in scheme: mediatopic
created: 2009-10-22T02:00:00+00:00
modified: 2021-02-18T12:00:00+00:00
broader: Disziplin

Canadian Football
type: Concept
definition: Football der mit Kanadischen Regeln gespielt wird
in scheme: mediatopic
created: 2009-10-22T02:00:00+00:00
modified: 2021-02-18T12:00:00+00:00
broader: Disziplin

Kanu
type: Concept
definition: Wettkampf mit Kanus, die meistens kniend mit einem Einzel-Stechpaddel fortbewegt werden
in scheme: mediatopic
created: 2009-10-22T02:00:00+00:00
modified: 2021-02-18T12:00:00+00:00
broader: Disziplin
narrower: C1 (Kanu)
narrower: C2 (Kanu)
narrower: C4 (Kanu)
narrower: Kanusegeln
narrower: Pontoniering
has facet: canoekayaktype
broad match: http://cv.iptc.org/newscodes/subjectcode/15015000

Casting (Angeln)
type: Concept
definition: Ziel- und Weitwerfen mit Angelgeräten
in scheme: mediatopic
created: 2009-10-22T02:00:00+00:00
modified: 2021-07-12T12:00:00+00:00
broader: Disziplin

Bergsteigen
type: Concept
definition: Sich am Berg hochbewegen mit Hilfe von Händen und Füßen
in scheme: mediatopic
created: 2009-10-22T02:00:00+00:00
modified: 2021-02-18T12:00:00+00:00
broader: Disziplin
narrower: Eisklettern
narrower: Alpinismus

Sportklettern
type: Concept
definition: Sportklettern als Spezialdisziplin: Einzelwettbewerb mit Zeitmessung an einer künstlichen Kletterwand
in scheme: mediatopic
created: 2009-10-22T02:00:00+00:00
modified: 2021-07-12T12:00:00+00:00
broader: Disziplin

Kricket
type: Concept
definition: Ballsport mit zwei Teams je 11 Spielern, Bälle, Schlagholz und Pfostentoren. Das Ziel ist so viele Tore wie möglich zu durchschlagen und das andere Team rauszuschmeißen. Ein 'Run' beinhaltet das Rennen eines Spielers zwischen den Pfostentoren. Das gegnerische Team versucht die Konkurrenten rauszuschmeißen
in scheme: mediatopic
created: 2009-10-22T02:00:00+00:00
modified: 2021-02-18T12:00:00+00:00
broader: Disziplin

Crocket
type: Concept
definition: Mit Schlägern werden Bälle durch kleine Pfostentore geschlagen
in scheme: mediatopic
created: 2009-10-22T02:00:00+00:00
modified: 2021-02-18T12:00:00+00:00
broader: Disziplin

Curling
type: Concept
definition: Ein Spiel, das auf dem Eis gespielt wird mit flachen runden Steinen. Ein Spieler wirft einen Stein gezielt auf eine Zielscheibe. Ein Teamhelfer des Spielers, der geworfen hat, kann das Eis vor dem Stein kehren, damit der Stein besser Richtung Zielscheibe rutscht
in scheme: mediatopic
created: 2009-10-22T02:00:00+00:00
modified: 2021-02-18T12:00:00+00:00
broader: Disziplin
narrower: Eisstockschießen

Radsport
type: Concept
definition: Ein Rennen auf Fahrrädern über eine vorgegeben Distanz
in scheme: mediatopic
created: 2009-10-22T02:00:00+00:00
modified: 2021-02-18T12:00:00+00:00
broader: Disziplin
narrower: Kunstfahren
narrower: Bi-Cross
narrower: BMX
narrower: Radball
narrower: Radrennen Sprint
narrower: Querfeldein/Cross
narrower: Einzelverfolgung (Radsport)
narrower: Zeitfahren Einzel (Radsport)
narrower: Keirin
narrower: Madison Race
narrower: Mountainbiken
narrower: Punkterennen (Radsport)
narrower: Straßenrennen
narrower: Etappenrennen
narrower: Sprint Team
narrower: Mannschaftsverfolgung
narrower: Zeitfahren Team (Radsport)
narrower: Bahnradsport (Radsport)
narrower: BMX freestyle
has facet: cyclingtype

Tanzen
type: Concept
definition: Tanzwettbewerb, wo Paare in Technik und Interpretation bewertet werden
in scheme: mediatopic
created: 2009-10-22T02:00:00+00:00
modified: 2024-05-10T12:00:00+00:00
broader: Disziplin
narrower: Breakdance

Dart
type: Concept
definition: Zwei Spieler werfen mit kleinen Pfeilen auf eine runde Scheibe, die in Segmente mit verschiedenen Zahlenwerten aufgeteilt ist
in scheme: mediatopic
created: 2009-10-22T02:00:00+00:00
modified: 2021-02-18T12:00:00+00:00
broader: Disziplin

Turm- und Brettspringen
type: Concept
definition: Wettkämpfer springen von einem festen oder Sprungbrett und werden von sieben Richtern in einer Skala von 10 Punkten für akrobatische Figuren bewertet
in scheme: mediatopic
created: 2009-10-22T02:00:00+00:00
modified: 2021-02-18T12:00:00+00:00
broader: Disziplin
narrower: Plattform
narrower: Sprungbrett
narrower: Synchronspringen Plattform

Unterwassersport
type: Concept
definition: Sport wie Hockey, der unter Wasser ausgeübt wird
in scheme: mediatopic
created: 2009-10-22T02:00:00+00:00
modified: 2021-02-18T12:00:00+00:00
broader: Disziplin

Hunderennen
type: Concept
definition: Hunderennen über eine vorgeschriebene Distanz
in scheme: mediatopic
created: 2009-10-22T02:00:00+00:00
modified: 2021-02-18T12:00:00+00:00
broader: Disziplin
narrower: Hunderennen Verfolgung
narrower: Schlittenhunderennen
has facet: dogracingtype

Duathlon
type: Concept
definition: Sportliches Ereignis, beinhaltet Laufen und Radfahren
in scheme: mediatopic
created: 2009-10-22T02:00:00+00:00
modified: 2021-02-18T12:00:00+00:00
broader: Disziplin

Pferdesport
type: Concept
definition: Sport, der ein Pferd und einen Reiter umfasst
in scheme: mediatopic
created: 2009-10-22T02:00:00+00:00
modified: 2021-07-12T12:00:00+00:00
broader: Disziplin
narrower: Geländeritt
narrower: Dressur
narrower: Springreiten
narrower: Vielseitigkeit
narrower: Fahrsport
has facet: equestriantype

Fechten
type: Concept
definition: Kampfsport mit Schwert oder Florett
in scheme: mediatopic
created: 2009-10-22T02:00:00+00:00
modified: 2021-02-18T12:00:00+00:00
broader: Disziplin
narrower: Degen
narrower: Florett
narrower: Säbel
has facet: fencingtype

Feldhockey
type: Concept
definition: Eine Ballsportart mit zwei Teams je 11 Spielern und einem gebogenen Stock. Das Ziel ist so viele Tore zu machen wie möglich
in scheme: mediatopic
created: 2009-10-22T02:00:00+00:00
modified: 2021-02-18T12:00:00+00:00
broader: Disziplin

Eiskunstlauf
type: Concept
definition: Um von neun Punktrichtern die beste Punktzahl zu bekommen in zwei vorbereiteten Bereichen - beide zu Musik gelaufen - müssen die Wettkämpfer die höchst mögliche Harmonie zwischen artistischem Ausdruck und technischer Präzision erreichen
in scheme: mediatopic
created: 2009-10-22T02:00:00+00:00
modified: 2021-02-18T12:00:00+00:00
broader: Disziplin
narrower: Eistanz
has facet: figureskatingtype

Faustball
type: Concept
definition: Mannschaftssport ähnlich dem Volleyball (mit einem niedriger gespannten Netz), wird hauptsächlich in Turnvereinen gespielt
in scheme: mediatopic
created: 2009-10-22T02:00:00+00:00
modified: 2021-02-18T12:00:00+00:00
broader: Disziplin

Unihockey
type: Concept
definition: Wird in der Halle gespielt auf einem Spielfeld in der Größe eines Basketballfeldes. Ein Team besteht aus fünf Feldspielern und einem Torwart. Der Torwart spielt auf Knien, aber nicht mit einem Torwartschläger wie im Eishockey. Die Spieler benutzen Kunststöcke und leichte Plastikbälle um Pässe und Tore zu schießen
in scheme: mediatopic
created: 2009-10-22T02:00:00+00:00
modified: 2021-02-18T12:00:00+00:00
broader: Disziplin

Frisbee
type: Concept
definition: Eine Reihe von Wettbewerben, die mit einer fliegenden Kunststoffwurfscheibe gespielt werden. Die genauen Regeln für die Wurfscheiben variieren je nach Wettbewerb, aber verwendet werden unzerbrechliche aus solidem Kunststoff gefertigte Scheiben, deren Aussehen nie verändert ist. Manchmal auch Frisbee genannt
in scheme: mediatopic
created: 2009-10-22T02:00:00+00:00
modified: 2021-02-18T12:00:00+00:00
broader: Disziplin
has facet: flyingdisctype

Gaelic football
type: Concept
definition: Ein Spiel mit Ursprung in Irland, wo zwei Teams von fünfzehn ein Tor schießen, entweder durch den Ball oder Schlag mit der Hand. Das Team mit den meisten Punkten gewinnt.
in scheme: mediatopic
created: 2009-10-22T02:00:00+00:00
modified: 2021-02-18T12:00:00+00:00
broader: Disziplin
broad match: http://cv.iptc.org/newscodes/subjectcode/15000000

Golf
type: Concept
definition: Wettkämpfer versuchen einen kleinen weißen Ball mit verschiedenen Schlägern in einem Gelände mit 18 Löchern auf verschiedenen Distanzen einzulochen. Das Ziel ist die wenigsten Schläge zu benötigen
in scheme: mediatopic
created: 2009-10-22T02:00:00+00:00
modified: 2021-02-18T12:00:00+00:00
broader: Disziplin
narrower: Minigolf

Turnen
type: Concept
definition: Sport der aus verschiedenen Disziplinen besteht in denen Turner artistische und akrobatische Figuren zeigen an unterschiedlichen Geräten. Es gibt 6 Disziplinen bei den Männern und 4 bei den Frauen
in scheme: mediatopic
created: 2009-10-22T02:00:00+00:00
modified: 2021-02-18T12:00:00+00:00
broader: Disziplin
narrower: Rhythmische Gymnastik
narrower: Trampolin (Rhythmische Gymnastik)
narrower: Kunstturnen

Handball (Team)
type: Concept
definition: Ein Ballspiel mit den Händen, bestehend aus zwei Teams mit jeweils sieben Spielern, die versuchen den Ball in das gegnerische Tor zu werfen
in scheme: mediatopic
created: 2009-10-22T02:00:00+00:00
modified: 2021-02-18T12:00:00+00:00
broader: Disziplin

Hornussen
type: Concept
definition: Schweizer Mannschaftsportart mit 16 oder 18 Spielern pro Team. Eine gummierte Scheibe (Hornuss) muss ins Feld der gegnerischen Mannschaft geschlagen werden, die versucht den Hornuss in der Luft mit einem hölzernen Abwehrbrett (Schindel) abzufangen
in scheme: mediatopic
created: 2009-10-22T02:00:00+00:00
modified: 2021-02-18T12:00:00+00:00
broader: Disziplin

Pferderennen
type: Concept
definition: Pferderennen mit Reiter
in scheme: mediatopic
created: 2009-10-22T02:00:00+00:00
modified: 2021-02-18T12:00:00+00:00
broader: Disziplin
narrower: Galopprennen
narrower: Trabrennen
narrower: Hindernissrennen

Hurling
type: Concept
definition: Ein Spiel von zwei Mannschaften aus fünfzehn jeweils mit einem gebogenen Holzstock genannt hurley. Die Aufgabe ist es, den kleinen Ball zwischen die gegnerischen Torpfosten, entweder über die Querlatte oder unter ihm in ein Netz zu bekommen, was von einem Torhüter bewacht ist
in scheme: mediatopic
created: 2009-10-22T02:00:00+00:00
modified: 2021-02-18T12:00:00+00:00
broader: Disziplin
broad match: http://cv.iptc.org/newscodes/subjectcode/15000000

Eishockey
type: Concept
definition: Zwei Mannschaften mit jeweils sechs stark gepolsterten Läufern versuchen sich gegenseitig auszutricksen, um den Puck in das gegnerische Tor zu schießen
in scheme: mediatopic
created: 2009-10-22T02:00:00+00:00
modified: 2021-02-18T12:00:00+00:00
broader: Disziplin
narrower: Eisschlittenhockey

Inline Skating
type: Concept
definition: Sportlicher Wettbewerb auf Inlineskates
in scheme: mediatopic
created: 2009-10-22T02:00:00+00:00
retired: 2021-02-18T12:00:00+00:00
modified: 2021-02-18T12:00:00+00:00
broader: Disziplin

Jai Alai (Pelota)
type: Concept
definition: Die Komplexität des Spiels erfordert es zwei Subject Details zu kombinieren, um eine angemessene Identifizierung der speziellen Varianten zu ermöglichen
in scheme: mediatopic
created: 2009-10-22T02:00:00+00:00
modified: 2021-02-18T12:00:00+00:00
broader: Disziplin
has facet: jaialaitype

Kabaddi
type: Concept
definition: Die angreifende Seite punktet durch Berührung, die andere Seite durch Sicherung. Die wiederholten Angriffe nennt man 'kabaddi'.
in scheme: mediatopic
created: 2009-10-22T02:00:00+00:00
modified: 2021-02-18T12:00:00+00:00
broader: Disziplin

Kajak
type: Concept
definition: Wettkampf mit Kajaks, in dem der Paddler mit den Füßen nach vorne sitzt und ein Doppelpaddel benutzt
in scheme: mediatopic
created: 2009-10-22T02:00:00+00:00
modified: 2021-02-18T12:00:00+00:00
broader: Disziplin
narrower: K1 (Kajak)
narrower: K2 (Kajak)
narrower: K4 (Kajak)
broad match: http://cv.iptc.org/newscodes/subjectcode/15015000
has facet: canoekayaktype

Lacrosse
type: Concept
definition: Zwei Teams mit gepolsterten Spielern mit Helmen versuchen sich gegenseitig zu besiegen mit einem Schläger und einem harten Ball
in scheme: mediatopic
created: 2009-10-22T02:00:00+00:00
modified: 2021-02-18T12:00:00+00:00
broader: Disziplin

Rodeln
type: Concept
definition: Wird als Einsitzer oder Doppelsitzer ausgetragen. Der Athlet liegt auf dem Rücken auf einem offenen Rennschlitten und gleitet in einer Kunst- oder Natureisbahn hinab. Der Athlet und der Rennschlitten müssen gemeinsam die Ziellinie passieren
in scheme: mediatopic
created: 2009-10-22T02:00:00+00:00
modified: 2021-02-18T12:00:00+00:00
broader: Disziplin

Marathon
type: Concept
definition: Straßenrennen, bei dem die Wettkämpfer 42,195 km laufen, meist durch die Stadt
in scheme: mediatopic
created: 2009-10-22T02:00:00+00:00
modified: 2021-02-18T12:00:00+00:00
broader: Disziplin

Moderner Fünfkampf
type: Concept
definition: Der moderne Fünfkampf umfasst 5 Ereignisse an einem Tag in der folgenden Reihenfolge: Schießen, Fechten, Schwimmen, Reiten und Laufen
in scheme: mediatopic
created: 2009-10-22T02:00:00+00:00
modified: 2021-02-18T12:00:00+00:00
broader: Disziplin

Motorboot
type: Concept
definition: Rennen zwischen Motorbooten
in scheme: mediatopic
created: 2009-10-22T02:00:00+00:00
modified: 2021-02-18T12:00:00+00:00
broader: Disziplin
broad match: http://cv.iptc.org/newscodes/subjectcode/15046000

Motorsport
type: Concept
definition: Rennen mit Autos
in scheme: mediatopic
created: 2009-10-22T02:00:00+00:00
modified: 2021-02-18T12:00:00+00:00
broader: Disziplin
narrower: Ausdauer
narrower: F3000
narrower: Formel 1
narrower: Indy
narrower: Crossrallye
narrower: Rallye
has facet: motorcarracingtype

Motorradrennen
type: Concept
definition: Rennen mit 2,3 oder 4 rädrigen Fahrzeugen mit Sattel und Lenkstangen
in scheme: mediatopic
created: 2009-10-22T02:00:00+00:00
modified: 2021-02-18T12:00:00+00:00
broader: Disziplin
narrower: Ausdauer
narrower: Enduro
narrower: Grasbahn
narrower: Motoball
narrower: Motocross
narrower: MotoGP
narrower: Rallye
narrower: Beiwagen
narrower: Speedway
narrower: Trial
has facet: motorcyclingtype

Netzball
type: Concept
definition: Sportart für Frauen, ähnlich dem Basketball, aber ohne Brett hinter dem Korb
in scheme: mediatopic
created: 2009-10-22T02:00:00+00:00
modified: 2021-02-18T12:00:00+00:00
broader: Disziplin

Orientierung
type: Concept
definition: Einzelzeitrennen über eine mit Fackeln markierte Strecke, die der Wettkämpfer mithilfe von Kompass und Karte in einer bestimmten Reihenfolge finden muss
in scheme: mediatopic
created: 2009-10-22T02:00:00+00:00
modified: 2021-02-18T12:00:00+00:00
broader: Disziplin
narrower: Ski Orientierung

Fallschirmspringen
type: Concept
definition: Fallschirmsprung Wettbewerbe: Punktlandungen, Spannweite, Einzel und im Team
in scheme: mediatopic
created: 2009-10-22T02:00:00+00:00
modified: 2021-02-18T12:00:00+00:00
broader: Disziplin

Polo
type: Concept
definition: Mithilfe eines Schlägers versuchen zwei Teams mit je vier Reitern einen Bambusball in das gegnerische Tor zu schießen über ein Feld von 250 m Länge und 150 m Breite. Das Spiel ist unterteilt in 4,6 oder 8 Zeitperioden von 7 min 30 sec. 'chukkas' genannt
in scheme: mediatopic
created: 2009-10-22T02:00:00+00:00
modified: 2021-02-18T12:00:00+00:00
broader: Disziplin

Billiard
type: Concept
definition: Ein Spiel, was auf einem flachen Tisch gespielt wird, mit verschieden nummerierten Kugeln
in scheme: mediatopic
created: 2009-10-22T02:00:00+00:00
modified: 2021-02-18T12:00:00+00:00
broader: Disziplin
broad match: http://cv.iptc.org/newscodes/subjectcode/15010000
has facet: billiardtype

Motorbootsport
type: Concept
definition: Rennen zwischen Motorbooten auf Flüssen oder Seen
in scheme: mediatopic
created: 2009-10-22T02:00:00+00:00
modified: 2021-02-18T12:00:00+00:00
broader: Disziplin

Rodeo
type: Concept
definition: Disziplin bei der wilde Pferde und Bullen beritten und gezähmt werden
in scheme: mediatopic
created: 2009-10-22T02:00:00+00:00
modified: 2021-02-18T12:00:00+00:00
broader: Disziplin
narrower: Bareback
narrower: Barrel Racing
narrower: Bullenreiten
narrower: Bulldogging
narrower: Calf Roping
narrower: Goat Roping
narrower: Saddle Bronc

Rudern
type: Concept
definition: Bootsrennen meist in flachen ruhigen Gewässern mit Booten für 1,2,4,oder 8 Ruderern
in scheme: mediatopic
created: 2009-10-22T02:00:00+00:00
modified: 2021-02-18T12:00:00+00:00
broader: Disziplin
narrower: Vierer
narrower: Zweier
narrower: Vierer ohne Steuermann
narrower: Zweier ohne Steuermann
narrower: Doppelzweier
narrower: Achter
narrower: Doppelvierer
narrower: Einer
has facet: rowingtype

Segeln
type: Concept
definition: Segelboot Rennen auf einer Rute die durch Bojen gekennzeichnet ist
in scheme: mediatopic
created: 2009-10-22T02:00:00+00:00
modified: 2021-02-18T12:00:00+00:00
broader: Disziplin
narrower: Mehrmaster
narrower: Dinghy
narrower: Kielboot
narrower: Regatta
narrower: Meersegeln
narrower: Rund um die Welt
narrower: Meersegeln Solo
narrower: Non-Stop Solo
has facet: sailingtype

Sepak Takraw
type: Concept
definition: Ein Spiel ähnlich dem Volleyball, bei dem man nicht unbedingt die Hände benutzen muss. Benutzt wird ein Rattanball
in scheme: mediatopic
created: 2009-10-22T02:00:00+00:00
modified: 2021-02-18T12:00:00+00:00
broader: Disziplin

Shinty
type: Concept
definition: Ein Ballspiel mit zwei Teams mit gebogenen Stöcken camans genannt. Das Ziel ist, Tore zu schießen durch Drücken des kleinen Lederballs durch die Tore.
in scheme: mediatopic
created: 2009-10-22T02:00:00+00:00
modified: 2021-02-18T12:00:00+00:00
broader: Disziplin
broad match: http://cv.iptc.org/newscodes/subjectcode/15000000

Schießen
type: Concept
definition: Präzisionssport unter Benutzung einer Handfeuerwaffe, Gewehr oder Pistole
in scheme: mediatopic
created: 2009-10-22T02:00:00+00:00
modified: 2023-10-02T12:00:00+00:00
broader: Disziplin
narrower: Pistole
narrower: Gewehr
narrower: Laufende Scheibe
narrower: Schnellfeuerpistole
narrower: Sportpistole
has facet: shootingtype

Skeleton
type: Concept
definition: Im Skeleton-Wettbewerb liegt der Athlet auf dem Bauch, während der Fahrt durch die Bahn (Kunsteis- oder Naturbahn). Der Athlet muss die Ziellinie auf dem Schlitten liegend überqueren. Die Gesamtzeit errechnet sich aus den Einzelzeiten der Läufe
in scheme: mediatopic
created: 2009-10-22T02:00:00+00:00
modified: 2021-02-18T12:00:00+00:00
broader: Disziplin

Ski
type: Concept
definition: Wintersport mit unterschiedlichen Typen von Skiern
in scheme: mediatopic
created: 2009-10-22T02:00:00+00:00
modified: 2021-02-18T12:00:00+00:00
broader: Disziplin
narrower: Ski alpin
narrower: Freestyle Ski
narrower: Grasski
narrower: Ski nordisch
narrower: Skispringen
narrower: Skilanglauf
narrower: Nordische Kombination
narrower: Telemark-Skifahren
narrower: Skiwandern
broad match: http://cv.iptc.org/newscodes/subjectcode/15000000

Sky Diving
type: Concept
definition: Fallschirm Wettbewerbe mit freiem Fall auf langer Distanz
in scheme: mediatopic
created: 2009-10-22T02:00:00+00:00
modified: 2021-02-18T12:00:00+00:00
broader: Disziplin

Snooker
type: Concept
definition: Zwei Spieler benutzen einen Queue und eine weiße Kugel, um die anderen farbigen Kugeln in der richtigen Reihenfolge einzulochen
in scheme: mediatopic
created: 2009-10-22T02:00:00+00:00
modified: 2021-02-18T12:00:00+00:00
broader: Disziplin
has facet: billiardtype

Snowboard
type: Concept
definition: Ausgeübt auf einem Brett (anstatt zwei Ski)
in scheme: mediatopic
created: 2009-10-22T02:00:00+00:00
modified: 2021-02-18T12:00:00+00:00
broader: Disziplin
has facet: snowboardingtype

Fußball
type: Concept
definition: Zwei Teams mit jeweils 11 Spielern versuchen den Ball in das gegnerische Tor zu schießen oder zu köpfen über eine Spieldauer von 90 Minuten
in scheme: mediatopic
created: 2009-10-22T02:00:00+00:00
modified: 2024-09-26T12:00:00+00:00
broader: Disziplin
narrower: http://cv.iptc.org/newscodes/mediatopic/20001393
narrower: http://cv.iptc.org/newscodes/mediatopic/20001394

Softball
type: Concept
definition: Ähnlich dem Baseball aber mit größeren und weicheren Bällen, dünneren Schlägern, kürzeren Lücken zwischen den Stationen und weniger Innenfelder
in scheme: mediatopic
created: 2009-10-22T02:00:00+00:00
modified: 2021-02-18T12:00:00+00:00
broader: Disziplin

Eisschnelllauf
type: Concept
definition: Zeitrennen, ausgeübt von zwei Läufern zur gleichen Zeit auf einer ovalen Eisbahn
in scheme: mediatopic
created: 2009-10-22T02:00:00+00:00
modified: 2021-03-31T12:00:00+00:00
broader: Disziplin

Squash
type: Concept
definition: Ein Sport mit Strategie und Ausdauer, Einzeln oder im Doppel in einem Court mit Schläger und einem kleinen Ball
in scheme: mediatopic
created: 2009-10-22T02:00:00+00:00
modified: 2021-02-18T12:00:00+00:00
broader: Disziplin

Sumo
type: Concept
definition: Ein schneller Kampfsport mit viel Zeremonie bei dem zwei Wettkämpfer versuchen den Gegner aus dem markierten Bereich herauszudrängen oder schmeißen. Meist praktiziert von kräftigen Männern in Japan
in scheme: mediatopic
created: 2009-10-22T02:00:00+00:00
modified: 2021-02-18T12:00:00+00:00
broader: Disziplin

Wellenreiten
type: Concept
definition: Wassersport bei dem die Teilnehmer wellen kreuzen oder reiten auf einem Surfboard
in scheme: mediatopic
created: 2009-10-22T02:00:00+00:00
modified: 2021-02-18T12:00:00+00:00
broader: Disziplin

Schwimmen
type: Concept
definition: Wassersport bei dem die Wettkämpfer so schnell wie möglich in einem vorgegebenen Stil schwimmen. Sieger ist, wer zuerst ankommt
in scheme: mediatopic
created: 2009-10-22T02:00:00+00:00
modified: 2021-02-18T12:00:00+00:00
broader: Disziplin
narrower: Rückenschwimmen
narrower: Brustschwimmen
narrower: Schmetterling
narrower: Freistil
narrower: Lagen
narrower: Langstrecke
narrower: Staffel Freistil
narrower: Staffel Lagen
narrower: Kurzbahnen (Schwimmen)
has facet: swimmingtype

Tischtennis
type: Concept
definition: Ballsport für zwei oder vier (im Doppel), wird auf einem Tisch ausgeübt, der durch ein Netz geteilt ist mit einem kleinen Schläger und einem leichten Ball
in scheme: mediatopic
created: 2009-10-22T02:00:00+00:00
modified: 2021-03-15T12:00:00+00:00
broader: Disziplin

Tennis
type: Concept
definition: Sportart, bei der zwei Spieler oder vier im Doppel mit einem Schläger ausgestattet, einen Ball über ein Netz auf die gegnerische Seite des Feldes schlagen. Ziel ist es diesen so zu platzieren, dass er unerreicht innerhalb der Linie auf den Boden geht, damit werden Punkte erreicht
in scheme: mediatopic
created: 2009-10-22T02:00:00+00:00
modified: 2021-02-18T12:00:00+00:00
broader: Disziplin

Bowling
type: Concept
definition: Spiel, wobei ein Spieler Punkte erzielt indem er versucht 10 Kegel mit einer Kugel umzuschmeißen. Wenn er erfolglos ist, hat er einen zweiten Versuch. Ein Spiel besteht aus 10 Aufstellungen
in scheme: mediatopic
created: 2009-10-22T02:00:00+00:00
modified: 2021-02-18T12:00:00+00:00
broader: Disziplin

Triathlon
type: Concept
definition: Ein Ausdauersport, bei dem die Wettkämpfer erst Schwimmen, dann Radfahren und dann auf der Straße laufen. Je nach Wettbewerb variieren die Distanzen, die olympische Version erfordert 1,5 km, 40 km und 10 km.
in scheme: mediatopic
created: 2009-10-22T02:00:00+00:00
modified: 2021-02-18T12:00:00+00:00
broader: Disziplin

Tauziehen
type: Concept
definition: Zwei Teams ziehen gegeneinander an einem Tau
in scheme: mediatopic
created: 2009-10-22T02:00:00+00:00
modified: 2021-02-18T12:00:00+00:00
broader: Disziplin

Volleyball
type: Concept
definition: Zwei Teams mit jeweils 6 machen Punkte indem sie den Ball über ein Netz in das gegnerische Spielfeld schlagen und versuchen ihn solange wie möglich in der Luft zu halten. Punkte werden gemacht wenn ein Fehler gemacht wird und der Ball an den Gegner zurück geht
in scheme: mediatopic
created: 2009-10-22T02:00:00+00:00
modified: 2021-02-18T12:00:00+00:00
broader: Disziplin
narrower: Beachvolleyball

Wasserball
type: Concept
definition: Wird in einem Wasserbecken ausgetragen von zwei Teams mit jeweils 7 Spielern, die sich im Wasser befinden und nur eine Hand benutzen dürfen, um den Ball zu werfen oder mit diesem schwimmen müssen, bevor sie ihn in das gegnerische Netz werfen, um Punkte zu machen
in scheme: mediatopic
created: 2009-10-22T02:00:00+00:00
modified: 2021-02-18T12:00:00+00:00
broader: Disziplin

Wasserski
type: Concept
definition: Wettkämpfer wird auf einem oder zwei Skiern von einem Boot am Seil über die Wasseroberfläche gezogen
in scheme: mediatopic
created: 2009-10-22T02:00:00+00:00
modified: 2021-02-18T12:00:00+00:00
broader: Disziplin
has facet: waterskiingtype

Gewichtheben
type: Concept
definition: Kräftemessen, bei dem die Wettkämpfer ein Gewicht so schwer wie möglich heben.
in scheme: mediatopic
created: 2009-10-22T02:00:00+00:00
modified: 2021-07-12T12:00:00+00:00
broader: Disziplin
narrower: Clean und Jerk (Gewichtheben)
narrower: Kraftdreikampf
narrower: Reißen (Gewichtheben)
has facet: weightliftingtype

Windsurfen
type: Concept
definition: Wettkämpfer müssen so schnell wir möglich einen bestimmten Kurs auf einem Surfboard zurücklegen
in scheme: mediatopic
created: 2009-10-22T02:00:00+00:00
modified: 2021-02-18T12:00:00+00:00
broader: Disziplin
has facet: windsurfingtype

Ringen
type: Concept
definition: Kampfsport, bei dem jeder Ringer versucht den andern zu besiegen, indem er die beiden Schultern auf dem Boden hält. Punkte können auch entscheidend sein
in scheme: mediatopic
created: 2009-10-22T02:00:00+00:00
modified: 2021-02-18T12:00:00+00:00
broader: Disziplin
narrower: Freistil Ringen
narrower: Griechisch-Römisch
narrower: Schweizer Ringen
has facet: weightclasstype

Shorttrack Eisschnellauf
type: Concept
definition: Wettrennen von vier und mehr Eisschnelläufern auf einer kurzen, ovalen Eisbahn.
in scheme: mediatopic
created: 2014-01-20T12:00:00+00:00
modified: 2021-02-18T12:00:00+00:00
broader: Disziplin

Schach
type: Concept
definition: Wettbewerb zwischen zwei Spielern mit einem Schachbrett mit 16 Spielsteinen auf jeder Seite, die je nach ihrer Identität spezifische Bewegungsspielräume haben
in scheme: mediatopic
created: 2014-11-07T12:00:00+00:00
modified: 2021-07-12T12:00:00+00:00
broader: Disziplin

Roller-Sport
type: Concept
definition: Verschiedene Wettbewerbe mit Rollschuhen, Inline-Skates und Skateboards.
in scheme: mediatopic
created: 2014-11-07T12:00:00+00:00
modified: 2021-07-12T12:00:00+00:00
broader: Disziplin
narrower: Rollerhockey
narrower: Skateboarden

Kampfsport
type: Concept
definition: Kampfkünste sind kodifizierte Systeme und Traditionen von Kampfpraktiken, die aus einer Vielzahl von Gründen praktiziert werden: Selbstverteidigung, Wettkampf, körperliche Gesundheit und Fitness, Unterhaltung sowie geistige, körperliche und spirituelle Entwicklung.
in scheme: mediatopic
created: 2015-08-27T12:00:00+00:00
modified: 2021-07-12T12:00:00+00:00
broader: Disziplin
narrower: Judo
narrower: Jukendo
narrower: Karate
narrower: Kendo
narrower: Kyodo
narrower: Naginata
narrower: Taekwon-Do
narrower: Wushu
narrower: gemischte Kampfkünste
narrower: Krav Maga
narrower: Kickboxen
narrower: Sambo

Synchronschwimmen
type: Concept
definition: Eine Sportart, bei der Schwimmer als Solo-, Duett- oder Mannschaftsschwimmer koordinierte oder identische Bewegungen im Takt zur Musik ausführen. Sie werden beurteilt und erhalten Punkte für Körperhaltung, Kontrolle und den Schwierigkeitsgrad der Bewegungen.
in scheme: mediatopic
created: 2016-04-05T12:00:00+00:00
modified: 2021-07-12T12:00:00+00:00
broader: Disziplin
narrower: Synchronschwimmen frei
narrower: Synchronschwimmen Disziplin

Rugby
type: Concept
definition: Eine im Rugby (England) entwickelte Form des Fussballs, die mit einem ovalen Ball gespielt wird, der getreten, getragen und von Hand zu Hand weitergereicht werden kann. Punkte werden erzielt, wenn eine Mannschaft den Ball über die Torlinie der anderen Mannschaft trägt oder den Ball zwischen zwei Torpfosten kickt.
in scheme: mediatopic
created: 2016-04-05T12:00:00+00:00
modified: 2021-07-12T12:00:00+00:00
broader: Disziplin
narrower: Rugbyliga
narrower: Rugby Union
narrower: Rugby 7

E-Sport
type: Concept
definition: Wettbewerbe mit Videospielen, die von professionellen Spielern gespielt werden
in scheme: mediatopic
created: 2018-04-19T12:00:00+00:00
modified: 2021-07-12T12:00:00+00:00
broader: Disziplin

Bodybuilding
type: Concept
definition: Wettbewerbe, bei denen die Teilnehmer bestimmte Posen ausführen, um ihre Muskeln zu zeigen, die durch anstrengende Übungen gestärkt und vergrößert wurden. Die Wettkämpfer werden anhand von Kriterien wie Symmetrie, Muskelkraft und Kondition beurteilt.
in scheme: mediatopic
created: 2019-06-26T12:00:00+00:00
modified: 2021-07-12T12:00:00+00:00
broader: Disziplin

Racquetball
type: Concept
definition: Squashähnlicher Schlägersport, bei dem der Ball vor dem Schlagen einmal abprallen muss und bei dem eine grössere Spielfläche zur Verfügung steht.
in scheme: mediatopic
created: 2019-10-07T12:00:00+00:00
modified: 2021-07-12T12:00:00+00:00
broader: Disziplin

Ringette
type: Concept
definition: Eine Mannschaftssportart, die üblicherweise von Schlittschuhläufern mit einem geraden Stock auf dem Eis ausgeübt wird. Die Spieler passen und schießen einen Gummiring, um ihn im gegnerischen Tor zu platzieren.
in scheme: mediatopic
created: 2019-10-07T12:00:00+00:00
modified: 2021-07-12T12:00:00+00:00
broader: Disziplin

Armdrücken
type: Concept
definition: Eine Form des Ringkampfes, bei der zwei Teilnehmer Arm an Arm kämpfen
in scheme: mediatopic
created: 2019-11-25T12:00:00+00:00
modified: 2021-07-12T12:00:00+00:00
broader: Disziplin

Padel
type: Concept
definition: Schlägersportart, die typischerweise im Doppel auf einem geschlossenen Platz gespielt wird
in scheme: mediatopic
created: 2021-02-18T12:00:00+00:00
modified: 2021-07-12T12:00:00+00:00
broader: Disziplin

Kiten
type: Concept
definition: Action-Sportart, bei der sich eine Person die Kraft des Windes zunutze macht, um sich auf einem Brett, Snowboard oder Skiern über Wasser, Land oder Schnee fortzubewegen. Variationen des Sports werden Kiteboarding/Kitesurfen, Snowkiting oder Landkiting genannt.
in scheme: mediatopic
created: 2021-02-18T12:00:00+00:00
modified: 2021-07-12T12:00:00+00:00
broader: Disziplin

Stand Up Paddling (SUP)
type: Concept
definition: Wassersport, bei dem man sich mit Brett und Paddel im Stehen durch das Wasser bewegt
in scheme: mediatopic
created: 2021-02-18T12:00:00+00:00
modified: 2021-07-12T12:00:00+00:00
broader: Disziplin

Cheerleading
type: Concept
definition: Cheer Squads, die gegeneinander antreten, um eine Routine vorzuführen, die Stunts, Sprünge und Tumbling zu Musik beinhaltet. Die Squads werden nach Schwierigkeit und Ausführung bewertet.
in scheme: mediatopic
created: 2021-02-18T12:00:00+00:00
modified: 2021-07-12T12:00:00+00:00
broader: Disziplin

3×3-Basketball
type: Concept
definition: Eine Variante des Basketballs, die zu dritt auf einen Basketballkorb gespielt wird.
in scheme: mediatopic
created: 2021-07-12T12:00:00+00:00
modified: 2021-12-21T12:00:00+00:00
broader: Disziplin

Kanuslalom
type: Concept
definition: Die Teilnehmer steuern ein Kanu oder ein Kajak auf einer Wildwasserstrecke, wobei sie eine Kombination aus flussaufwärts und flussabwärts gelegenen Toren auf Stromschnellen in der schnellstmöglichen Zeit passieren müssen.
in scheme: mediatopic
created: 2021-07-12T12:00:00+00:00
modified: 2021-12-21T12:00:00+00:00
broader: Disziplin

Kanurennsport
type: Concept
definition: Auf einer Flachwasserstrecke starten mehrere Kanus gleichzeitig und fahren gegeneinander ins Ziel.
in scheme: mediatopic
created: 2021-07-12T12:00:00+00:00
modified: 2021-12-21T12:00:00+00:00
broader: Disziplin

Straßenradsport
type: Concept
definition: Radsportveranstaltungen, die auf der Straße stattfinden, einschließlich Straßenrennen und Zeitfahren
in scheme: mediatopic
created: 2021-07-12T12:00:00+00:00
modified: 2021-12-21T12:00:00+00:00
broader: Disziplin

Bahnradsport
type: Concept
definition: Radsportwettbewerbe auf der Bahn, einschließlich Sprint, Teamsprint, Keirin, Mannschaftsverfolgung, Omnium und Madison
in scheme: mediatopic
created: 2021-07-12T12:00:00+00:00
modified: 2021-12-21T12:00:00+00:00
broader: Disziplin

Kleinfeldfußball
type: Concept
definition: Eine Variante des Verbandsfußballs, bei der jede Mannschaft aus fünf Spielern besteht und auf einem kleineren Spielfeld gespielt wird. Eine offizielle Sportart der Sommer-Paralympics.
in scheme: mediatopic
created: 2021-07-12T12:00:00+00:00
modified: 2021-12-21T12:00:00+00:00
broader: Disziplin

Goalball
type: Concept
definition: Ein Mannschaftssport für Sportler mit einer Sehbehinderung, bei dem ein Ball mit Glocken verwendet wird
in scheme: mediatopic
created: 2021-07-12T12:00:00+00:00
modified: 2021-12-21T12:00:00+00:00
broader: Disziplin

Armbrust
type: Concept
definition: Schießen mit der Armbrust auf Zielscheiben in unterschiedlichen Distanzen
in scheme: mediatopic
created: 2009-10-22T02:00:00+00:00
modified: 2021-02-18T12:00:00+00:00
broader: Bogenschießen

Langbogen
type: Concept
definition: Schießen mit einem Langbogen auf Zielscheiben aus unterschiedlicher Distanz. Der Wettkampf findet draußen auf einem großen flachen Feld statt.
in scheme: mediatopic
created: 2009-10-22T02:00:00+00:00
modified: 2021-05-05T12:00:00+00:00
broader: Bogenschießen
broad match: http://cv.iptc.org/newscodes/subjectcode/15004000

Geländelauf
type: Concept
definition: Wettkämpfer laufen über rauen Untergrund und nicht auf einer Bahn
in scheme: mediatopic
created: 2009-10-22T02:00:00+00:00
modified: 2021-05-05T12:00:00+00:00
broader: Leichtathletik
broad match: http://cv.iptc.org/newscodes/subjectcode/15005000

Zehnkampf
type: Concept
definition: Einzelwettkampf der Männer, der das Erreichen von Punkten in 10 Disziplinen über 2 Tage anstrebt: 1. Tag - 1000 m, Weitsprung, Kugelstoßen, 400 m. 2. Tag - 110 m Hürden, Diskuswerfen, Stabhochsprung, Speerwerfen und 1500 m
in scheme: mediatopic
created: 2009-10-22T02:00:00+00:00
modified: 2021-02-18T12:00:00+00:00
broader: Leichtathletik

Diskuswerfen
type: Concept
definition: Wettkämpfer stehen in einem vernetzten Kreis mit 2.50 Meter Durchmesser und versuchen mit einer Drehbewegung einen Diskus mit 2 kg Gewicht bei Männern und 1 kg für Frauen so weit wie möglich zu werfen
in scheme: mediatopic
created: 2009-10-22T02:00:00+00:00
modified: 2021-02-18T12:00:00+00:00
broader: Leichtathletik

Hammerwerfen
type: Concept
definition: Wettkämpfer werfen einen Hammer aus einem vernetzten Kreis mit 2.13 Meter Durchmesser, der aus einer Metallkugel, einer Kette und einem Griff besteht, so weit sie können. Der Hammer wiegt 7.26 kg bei Männern und 4 kg bei Frauen
in scheme: mediatopic
created: 2009-10-22T02:00:00+00:00
modified: 2021-02-18T12:00:00+00:00
broader: Leichtathletik

Siebenkampf
type: Concept
definition: Einzelwettkampf der Frauen, umfasst 7 Disziplinen über 2 Tage: 1. Tag - 100 m Hürden, Hochsprung, Kugelstoßen, 200 Meter. 2. Tag - Weitsprung, Speerwerfen, 800 Meter
in scheme: mediatopic
created: 2009-10-22T02:00:00+00:00
modified: 2021-02-18T12:00:00+00:00
broader: Leichtathletik

Hochsprung
type: Concept
definition: Wettkämpfer springen so hoch wie möglich über eine Latte, die höher gehängt wird, wenn eine Höhe erreicht ist
in scheme: mediatopic
created: 2009-10-22T02:00:00+00:00
modified: 2021-02-18T12:00:00+00:00
broader: Leichtathletik

Hürden
type: Concept
definition: Ein Wettlauf im Sprint, bei dem die Athleten über eine Reihe von Hürden springen müssen
in scheme: mediatopic
created: 2009-10-22T02:00:00+00:00
modified: 2021-05-05T12:00:00+00:00
broader: Leichtathletik
broad match: http://cv.iptc.org/newscodes/subjectcode/15005000

Speerwurf
type: Concept
definition: Wettkämpfer versuchen in einer speziell markierten Wurfzone einen Speer so weit zu werfen wie möglich. Der Speer wiegt 800 Gramm für Männer und 600 Gramm für Frauen
in scheme: mediatopic
created: 2009-10-22T02:00:00+00:00
modified: 2021-02-18T12:00:00+00:00
broader: Leichtathletik

Langstreckenlauf
type: Concept
definition: Wettlauf über eine Distanz von mehr als 1500 Metern
in scheme: mediatopic
created: 2009-10-22T02:00:00+00:00
modified: 2021-02-18T12:00:00+00:00
broader: Leichtathletik
broad match: http://cv.iptc.org/newscodes/subjectcode/15005000

Weitsprung
type: Concept
definition: Wettkämpfer beschleunigen über eine kurze Distanz ihre Geschwindigkeit und springen dann so weit wie möglich ab einem vorgegeben Punkt in eine Sandgrube
in scheme: mediatopic
created: 2009-10-22T02:00:00+00:00
modified: 2021-02-18T12:00:00+00:00
broader: Leichtathletik

Mittelstreckenlauf
type: Concept
definition: Wettlauf über eine Distanz von mehr als 400 Metern bis zu 1500 Metern
in scheme: mediatopic
created: 2009-10-22T02:00:00+00:00
modified: 2021-02-18T12:00:00+00:00
broader: Leichtathletik
broad match: http://cv.iptc.org/newscodes/subjectcode/15005000

Fünfkampf
type: Concept
definition: Aktuell bei DM/EM/WM in der Halle: 60 m Hürden, Hochsprung, Kugelstoßen, Weitsprung und 800 m.
in scheme: mediatopic
created: 2009-10-22T02:00:00+00:00
modified: 2021-02-18T12:00:00+00:00
broader: Leichtathletik

Stabhochsprung
type: Concept
definition: Wettkämpfer benutzen einen flexiblen Stab, mit dem sie sich selbst in die Luft befördern und eine Latte überspringen, die in jeder Runde höher gehängt wird
in scheme: mediatopic
created: 2009-10-22T02:00:00+00:00
modified: 2021-02-18T12:00:00+00:00
broader: Leichtathletik

Gehen
type: Concept
definition: Ein Wettlauf, bei dem der Läufer immer einen Fuß auf dem Boden haben muss
in scheme: mediatopic
created: 2009-10-22T02:00:00+00:00
modified: 2021-02-18T12:00:00+00:00
broader: Leichtathletik
broad match: http://cv.iptc.org/newscodes/subjectcode/15005000

Staffellauf
type: Concept
definition: Ein Team von Läufern, die eine Staffel über die gleiche Distanz laufen
in scheme: mediatopic
created: 2009-10-22T02:00:00+00:00
modified: 2021-02-18T12:00:00+00:00
broader: Leichtathletik
broad match: http://cv.iptc.org/newscodes/subjectcode/15005000

Kugelstoßen
type: Concept
definition: Wettkämpfer stehen in einem Kreis mit 2.13 Meter Durchmesser und versuchen eine Metallkugel mit einem Gewicht von 7.26 kg für Männer und 4 kg für Frauen, so weit wie möglich zu werfen. Der längste Wurf gewinnt.
in scheme: mediatopic
created: 2009-10-22T02:00:00+00:00
modified: 2021-02-18T12:00:00+00:00
broader: Leichtathletik

Sprint
type: Concept
definition: Wettlauf über eine Distanz bis zu 400 Metern
in scheme: mediatopic
created: 2009-10-22T02:00:00+00:00
modified: 2021-02-18T12:00:00+00:00
broader: Leichtathletik

Dreisprung
type: Concept
definition: Wettkämpfer beschleunigen ihre Geschwindigkeit über eine kurze Distanz und versuchen dann so weit wie möglich zu springen, wobei sie einen Hop, einen Step und einen Jump benutzen
in scheme: mediatopic
created: 2009-10-22T02:00:00+00:00
modified: 2021-02-18T12:00:00+00:00
broader: Leichtathletik

Hindernislauf (Leichtathletik)
type: Concept
definition: Hindernisrennen in der Leichtathletik einschließlich Barrieren und Wassersprünge
in scheme: mediatopic
created: 2019-07-23T12:00:00+00:00
modified: 2021-07-12T12:00:00+00:00
broader: Leichtathletik

Rubberball
type: Concept
definition: Manchmal als 'Softbaseball' bezeichnet, das Spiel wird mit einem gummierten Ball unterschiedlicher Härte, abhängig vom Alter und der Spielstärke der Spieler durchgeführt
in scheme: mediatopic
created: 2009-10-22T02:00:00+00:00
modified: 2021-05-05T12:00:00+00:00
broader: Baseball

Bantamgewicht (Boxen)
type: Concept
definition: Gewichtsklasse die je nach Verband oder der Olympischen Spiele variiert
in scheme: mediatopic
created: 2009-10-22T02:00:00+00:00
retired: 2015-02-24T12:00:00+00:00
modified: 2021-12-21T12:00:00+00:00
broader: Boxen

Cruisergewicht (Boxen)
type: Concept
definition: Gewichtsklasse die je nach Verband oder der Olympischen Spiele variiert
in scheme: mediatopic
created: 2009-10-22T02:00:00+00:00
retired: 2015-02-24T12:00:00+00:00
modified: 2021-12-21T12:00:00+00:00
broader: Boxen

Federgewicht (Boxen)
type: Concept
definition: Gewichtsklasse die je nach Verband oder der Olympischen Spiele variiert
in scheme: mediatopic
created: 2014-04-08T12:00:00+00:00
retired: 2015-02-24T12:00:00+00:00
modified: 2021-12-21T12:00:00+00:00
broader: Boxen

Fliegengewicht (Boxen)
type: Concept
definition: Gewichtsklasse die je nach Verband oder der Olympischen Spiele variiert
in scheme: mediatopic
created: 2009-10-22T02:00:00+00:00
retired: 2015-02-24T12:00:00+00:00
modified: 2021-12-21T12:00:00+00:00
broader: Boxen

Schwergewicht (Boxen)
type: Concept
definition: Gewichtsklasse die je nach Verband oder der Olympischen Spiele variiert
in scheme: mediatopic
created: 2009-10-22T02:00:00+00:00
retired: 2015-02-24T12:00:00+00:00
modified: 2021-12-21T12:00:00+00:00
broader: Boxen

Leicht-Fliegengewicht (Boxen)
type: Concept
definition: Gewichtsklasse die je nach Verband oder der Olympischen Spiele variiert
in scheme: mediatopic
created: 2009-10-22T02:00:00+00:00
retired: 2015-02-24T12:00:00+00:00
modified: 2021-12-21T12:00:00+00:00
broader: Boxen

Leicht-Schwergewicht (Boxen)
type: Concept
definition: Gewichtsklasse die je nach Verband oder der Olympischen Spiele variiert
in scheme: mediatopic
created: 2009-10-22T02:00:00+00:00
retired: 2015-02-24T12:00:00+00:00
modified: 2021-12-21T12:00:00+00:00
broader: Boxen

Leicht-Mittelgewicht (Boxen)
type: Concept
definition: Gewichtsklasse die je nach Verband oder der Olympischen Spiele variiert
in scheme: mediatopic
created: 2009-10-22T02:00:00+00:00
retired: 2015-02-24T12:00:00+00:00
modified: 2021-12-21T12:00:00+00:00
broader: Boxen

Leicht-Weltergewicht (Boxen)
type: Concept
definition: Gewichtsklasse die je nach Verband oder der Olympischen Spiele variiert
in scheme: mediatopic
created: 2009-10-22T02:00:00+00:00
retired: 2015-02-24T12:00:00+00:00
modified: 2021-12-21T12:00:00+00:00
broader: Boxen

Leichtgewicht (Boxen)
type: Concept
definition: Gewichtsklasse die je nach Verband oder der Olympischen Spiele variiert
in scheme: mediatopic
created: 2009-10-22T02:00:00+00:00
retired: 2015-02-24T12:00:00+00:00
modified: 2021-12-21T12:00:00+00:00
broader: Boxen

Mittelgewicht (Boxen)
type: Concept
definition: Gewichtsklasse die je nach Verband oder der Olympischen Spiele variiert
in scheme: mediatopic
created: 2009-10-22T02:00:00+00:00
retired: 2015-02-24T12:00:00+00:00
modified: 2021-12-21T12:00:00+00:00
broader: Boxen

Strohgewicht (Boxen)
type: Concept
definition: Gewichtsklasse die je nach Verband oder der Olympischen Spiele variiert
in scheme: mediatopic
created: 2009-10-22T02:00:00+00:00
retired: 2015-02-24T12:00:00+00:00
modified: 2021-12-21T12:00:00+00:00
broader: Boxen
broad match: http://cv.iptc.org/newscodes/subjectcode/15014000

Super-Bantamgewicht (Boxen)
type: Concept
definition: Gewichtsklasse die je nach Verband oder der Olympischen Spiele variiert
in scheme: mediatopic
created: 2009-10-22T02:00:00+00:00
retired: 2015-02-24T12:00:00+00:00
modified: 2021-12-21T12:00:00+00:00
broader: Boxen

Super-Federgewicht (Boxen)
type: Concept
definition: Gewichtsklasse die je nach Verband oder der Olympischen Spiele variiert
in scheme: mediatopic
created: 2009-10-22T02:00:00+00:00
retired: 2015-02-24T12:00:00+00:00
modified: 2021-12-21T12:00:00+00:00
broader: Boxen

Super-Fliegengewicht (Boxen)
type: Concept
definition: Gewichtsklasse die je nach Verband oder der Olympischen Spiele variiert
in scheme: mediatopic
created: 2009-10-22T02:00:00+00:00
retired: 2015-02-24T12:00:00+00:00
modified: 2021-12-21T12:00:00+00:00
broader: Boxen

Super-Schwergewicht (Boxen)
type: Concept
definition: Gewichtsklasse die je nach Verband oder der Olympischen Spiele variiert
in scheme: mediatopic
created: 2009-10-22T02:00:00+00:00
retired: 2015-02-24T12:00:00+00:00
modified: 2021-12-21T12:00:00+00:00
broader: Boxen

Super-Mittelgewicht (Boxen)
type: Concept
definition: Gewichtsklasse die je nach Verband oder der Olympischen Spiele variiert
in scheme: mediatopic
created: 2009-10-22T02:00:00+00:00
retired: 2015-02-24T12:00:00+00:00
modified: 2021-12-21T12:00:00+00:00
broader: Boxen

Weltergewicht (Boxen)
type: Concept
definition: Gewichtsklasse die je nach Verband oder der Olympischen Spiele variiert
in scheme: mediatopic
created: 2009-10-22T02:00:00+00:00
retired: 2015-02-24T12:00:00+00:00
modified: 2021-12-21T12:00:00+00:00
broader: Boxen

C1 (Kanu)
type: Concept
definition: Einsitzer Kanu (offenes Boot) mit Wettkämpfern die ein Einzelpaddel benutzen
in scheme: mediatopic
created: 2009-10-22T02:00:00+00:00
retired: 2015-02-24T12:00:00+00:00
modified: 2021-12-21T12:00:00+00:00
broader: Kanu

C2 (Kanu)
type: Concept
definition: Zweisitzer Kanu (offenes Boot) mit Wettkämpfern die ein Einzelpaddel benutzen
in scheme: mediatopic
created: 2009-10-22T02:00:00+00:00
retired: 2015-02-24T12:00:00+00:00
modified: 2021-12-21T12:00:00+00:00
broader: Kanu

C4 (Kanu)
type: Concept
definition: Viersitzer Kanu (offenes Boot) mit Wettkämpfern die ein Einzelpaddel benutzen
in scheme: mediatopic
created: 2009-10-22T02:00:00+00:00
retired: 2015-02-24T12:00:00+00:00
modified: 2021-12-21T12:00:00+00:00
broader: Kanu
broad match: http://cv.iptc.org/newscodes/subjectcode/15015010

Kanusegeln
type: Concept
definition: Ein Rennen mit einem Kanu mit Segel
in scheme: mediatopic
created: 2009-10-22T02:00:00+00:00
retired: 2017-07-04T12:00:00+00:00
modified: 2021-05-05T12:00:00+00:00
broader: Kanu

Pontoniering
type: Concept
definition: Mannschaftssport in militärischer Tradition mit Booten, ähnlich der Kanuregatta
in scheme: mediatopic
created: 2009-10-22T02:00:00+00:00
retired: 2017-07-04T12:00:00+00:00
modified: 2021-02-18T12:00:00+00:00
broader: Kanu

Eisklettern
type: Concept
definition: Klettern auf Eisflächen, wie Eisfälle und gefrorene Klippen
in scheme: mediatopic
created: 2009-10-22T02:00:00+00:00
modified: 2021-02-18T12:00:00+00:00
broader: Bergsteigen
broad match: http://cv.iptc.org/newscodes/subjectcode/15016000

Alpinismus
type: Concept
definition: Bergsteigen im Hochgebirge
in scheme: mediatopic
created: 2009-10-22T02:00:00+00:00
modified: 2023-10-02T12:00:00+00:00
broader: Bergsteigen

Eisstockschießen
type: Concept
definition: Ähnlich dem Curling, wird auf Ziele auf dem Eis gespielt, anderer Spielstein mit geradem Stockgriff und abweichenden Regeln, vornehmlich in Alpenländern gespielt
in scheme: mediatopic
created: 2009-10-22T02:00:00+00:00
modified: 2021-02-18T12:00:00+00:00
broader: Curling

Kunstfahren
type: Concept
definition: Einzelne oder Mannschaften auf einem oder zwei Fahrrädern in einer Arena. Punkte werden durch eine Jury vergeben
in scheme: mediatopic
created: 2009-10-22T02:00:00+00:00
modified: 2021-02-18T12:00:00+00:00
broader: Radsport

Bi-Cross
type: Concept
definition: Rennen, bei dem die Wettkämpfer eine Strecke mit Hindernissen so schnell wie möglich zurücklegen müssen
in scheme: mediatopic
created: 2009-10-22T02:00:00+00:00
retired: 2017-07-04T12:00:00+00:00
modified: 2021-02-18T12:00:00+00:00
broader: Radsport

BMX
type: Concept
definition: Fahrrad-Rennen in mit Inline-Start und verschiedene Hindernisse über Pisten im Gelände.
in scheme: mediatopic
created: 2009-10-22T02:00:00+00:00
modified: 2021-07-12T12:00:00+00:00
broader: Radsport
has facet: bmxfreestyletype
broad match: http://cv.iptc.org/newscodes/subjectcode/15019000

Radball
type: Concept
definition: Mannschaftswettbewerb auf Kunsträdern. Ein Radballteam spielt gegen ein anderes, bestehend aus jeweils zwei Spielern. Das Ziel der Wettkämpfer ist den Ball mit den Vorder- und Hinterrädern zu bewegen ohne mit den Füßen den Boden zu berühren
in scheme: mediatopic
created: 2009-10-22T02:00:00+00:00
modified: 2021-02-18T12:00:00+00:00
broader: Radsport

Radrennen Sprint
type: Concept
definition: Rennen zwischen zwei Radfahrern über zwei oder drei Runden, mit einem gestoppten Sprint über die letzten 200 m
in scheme: mediatopic
created: 2009-10-22T02:00:00+00:00
retired: 2017-07-04T12:00:00+00:00
modified: 2021-02-18T12:00:00+00:00
broader: Radsport

Querfeldein/Cross
type: Concept
definition: Ausgetragen auf unterschiedlichen Oberflächen - Erde, Grass, Sand oder Asphalt
in scheme: mediatopic
created: 2009-10-22T02:00:00+00:00
retired: 2017-07-04T12:00:00+00:00
modified: 2021-02-18T12:00:00+00:00
broader: Radsport

Einzelverfolgung (Radsport)
type: Concept
definition: Zwei Radfahrer oder Teams starten von zwei Seiten gegenüber und versuchen die Lücke zwischen sich aufzuholen
in scheme: mediatopic
created: 2009-10-22T02:00:00+00:00
retired: 2017-07-04T12:00:00+00:00
modified: 2021-02-18T12:00:00+00:00
broader: Radsport

Zeitfahren Einzel (Radsport)
type: Concept
definition: Rennen oder eine Etappe gegen die Uhr, bei dem jeder Fahrer einzeln gestartet wird
in scheme: mediatopic
created: 2009-10-22T02:00:00+00:00
retired: 2017-07-04T12:00:00+00:00
modified: 2021-02-18T12:00:00+00:00
broader: Radsport

Keirin
type: Concept
definition: Sprint zwischen sechs Radfahrern, bei dem ein Tempomacher auf einem Moped das Tempo über die ersten 1400 m beschleunigt. Wenn der Tempomacher die Bahn verlässt, entwickelt sich das Rennen zu einem Endspurt über die letzten 6-700 Meter
in scheme: mediatopic
created: 2009-10-22T02:00:00+00:00
retired: 2017-07-04T12:00:00+00:00
modified: 2021-02-18T12:00:00+00:00
broader: Radsport

Madison Race
type: Concept
definition: Punkterennen mit Teams von zwei Radfahrern als Staffel
in scheme: mediatopic
created: 2009-10-22T02:00:00+00:00
retired: 2017-07-04T12:00:00+00:00
modified: 2021-02-18T12:00:00+00:00
broader: Radsport

Mountainbiken
type: Concept
definition: Radfahren im Gelände erfordert Ausdauer und speziell angepasste Mountainbikes
in scheme: mediatopic
created: 2009-10-22T02:00:00+00:00
modified: 2021-02-18T12:00:00+00:00
broader: Radsport
has facet: mountainbikingtype
broad match: http://cv.iptc.org/newscodes/subjectcode/15019015

Punkterennen (Radsport)
type: Concept
definition: Radfahrer die die höchste Anzahl an Runden zu erreichen versuchen. Sonderpunkte sind möglich durch Zwischensprints alle 2500 Meter
in scheme: mediatopic
created: 2009-10-22T02:00:00+00:00
retired: 2017-07-04T12:00:00+00:00
modified: 2021-02-18T12:00:00+00:00
broader: Radsport

Straßenrennen
type: Concept
definition: Straßenrennen bei dem alle Wettkämpfer in der Masse starten
in scheme: mediatopic
created: 2009-10-22T02:00:00+00:00
retired: 2017-07-04T12:00:00+00:00
modified: 2024-07-01T12:00:00+00:00
broader: Radsport

Etappenrennen
type: Concept
definition: Rennen, was in Teams stattfindet, die sich qualifizieren über die Kombination der Zeiten eines Tages
in scheme: mediatopic
created: 2009-10-22T02:00:00+00:00
retired: 2017-07-04T12:00:00+00:00
modified: 2021-05-05T12:00:00+00:00
broader: Radsport

Sprint Team
type: Concept
definition: Bahnrundenrennen, bei dem zwei Teams gegeneinander antreten, beginnend auf gegenüberliegenden Seiten der Bahn, nach der ersten Runde zieht der erste Fahrer weg, während der zweite Fahrer in die nächste Runde geht, das gleiche in der letzten Runde, so dass der dritte Fahrer das Rennen beendet. Das Team mit der schnellsten Zeit gewinnt.
in scheme: mediatopic
created: 2009-10-22T02:00:00+00:00
retired: 2017-07-04T12:00:00+00:00
modified: 2021-02-18T12:00:00+00:00
broader: Radsport
broad match: http://cv.iptc.org/newscodes/subjectcode/15019000

Mannschaftsverfolgung
type: Concept
definition: Bahnrundenrennen, bei der zwei Mannschaften aus der Mitte aus nach unten gegenüber Geraden setzen und versuchen, die Lücke zwischen ihnen zu verringern
in scheme: mediatopic
created: 2009-10-22T02:00:00+00:00
retired: 2017-07-04T12:00:00+00:00
modified: 2021-02-18T12:00:00+00:00
broader: Radsport
broad match: http://cv.iptc.org/newscodes/subjectcode/15019000

Zeitfahren Team (Radsport)
type: Concept
definition: Teams von Radfahrer starten gegen die Uhr
in scheme: mediatopic
created: 2009-10-22T02:00:00+00:00
retired: 2017-07-04T12:00:00+00:00
modified: 2021-02-18T12:00:00+00:00
broader: Radsport
broad match: http://cv.iptc.org/newscodes/subjectcode/15019000

Bahnradsport (Radsport)
type: Concept
definition: Ein Rennen auf einer Strecke in einem Velodrom
in scheme: mediatopic
created: 2009-10-22T02:00:00+00:00
retired: 2017-07-04T12:00:00+00:00
modified: 2021-02-18T12:00:00+00:00
broader: Radsport

BMX freestyle
type: Concept
definition: Die Fahrer haben eine festgelegte Zeit, um akrobatische Tricks und Fertigkeiten vorzuführen, wobei die Tricks nach verschiedenen Aspekten wie Schwierigkeit, Originalität, Ausführung, Höhe und Kreativität bewertet werden.
in scheme: mediatopic
created: 2021-07-12T12:00:00+00:00
modified: 2024-03-28T12:00:00+00:00
broader: Radsport

Breakdance
type: Concept
definition: Tanzwettbewerb mit einem urbanen Tanzstil, der in den 1970er Jahren in den Vereinigten Staaten entstand, seine Wurzeln in der Hip-Hop-Kultur hat und durch akrobatische Bewegungen, stilisierte Fußarbeit und die Schlüsselrolle des DJs und des MCs während der Battles gekennzeichnet ist
in scheme: mediatopic
created: 2024-05-09T12:00:00+00:00
modified: 2024-05-09T12:00:00+00:00
broader: Tanzen

Plattform
type: Concept
definition: Sprung von einer hohen Plattform
in scheme: mediatopic
created: 2009-10-22T02:00:00+00:00
modified: 2021-02-18T12:00:00+00:00
broader: Turm- und Brettspringen
has facet: platformheight
broad match: http://cv.iptc.org/newscodes/subjectcode/15021000

Sprungbrett
type: Concept
definition: Sprung von einem hohen Sprungbrett
in scheme: mediatopic
created: 2009-10-22T02:00:00+00:00
modified: 2021-02-18T12:00:00+00:00
broader: Turm- und Brettspringen
has facet: platformheight
broad match: http://cv.iptc.org/newscodes/subjectcode/15021000

Synchronspringen Plattform
type: Concept
definition: Zwei Wettkämpfer des gleichen Teams starten gleich oder unterschiedlich hohen Plattformen. Sie werden zusätzlich zu den Standard-Kriterien auch noch in Synchronisation bewertet
in scheme: mediatopic
created: 2009-10-22T02:00:00+00:00
modified: 2021-02-18T12:00:00+00:00
broader: Turm- und Brettspringen
broad match: http://cv.iptc.org/newscodes/subjectcode/15021004
has facet: platformheight

Hunderennen Verfolgung
type: Concept
definition: Verfolgungsrennen hinter einem falschen Hasen auf einem ovalen Rundkurs
in scheme: mediatopic
created: 2009-10-22T02:00:00+00:00
retired: 2017-07-04T12:00:00+00:00
modified: 2021-02-18T12:00:00+00:00
broader: Hunderennen

Schlittenhunderennen
type: Concept
definition: Vor einen Schlitten gespannt
in scheme: mediatopic
created: 2009-10-22T02:00:00+00:00
retired: 2017-07-04T12:00:00+00:00
modified: 2021-02-18T12:00:00+00:00
broader: Hunderennen

Geländeritt
type: Concept
definition: Pferdesport-Ereignis in einem markierten Gelände im Freien mit natürlichen und künstlichen Hindernissen
in scheme: mediatopic
created: 2009-10-22T02:00:00+00:00
retired: 2017-07-04T12:00:00+00:00
modified: 2021-05-05T12:00:00+00:00
broader: Pferdesport

Dressur
type: Concept
definition: Der Reiter wird bewertet in einer Reihe von Figuren in drei verschiedenen Gangarten - Schritt, Trab und Gallopp
in scheme: mediatopic
created: 2009-10-22T02:00:00+00:00
retired: 2017-07-04T12:00:00+00:00
modified: 2021-02-18T12:00:00+00:00
broader: Pferdesport

Springreiten
type: Concept
definition: Reiter und Pferd versuchen auf Zeit verschiedene Hindernisse zu überspringen in einer geschlossenen Arena
in scheme: mediatopic
created: 2009-10-22T02:00:00+00:00
retired: 2017-07-04T12:00:00+00:00
modified: 2021-02-18T12:00:00+00:00
broader: Pferdesport

Vielseitigkeit
type: Concept
definition: Pferdesport-Ereignis mit drei Disziplinen - Dressur, Geländeritt und Springen
in scheme: mediatopic
created: 2009-10-22T02:00:00+00:00
retired: 2017-07-04T12:00:00+00:00
modified: 2021-02-18T12:00:00+00:00
broader: Pferdesport

Fahrsport
type: Concept
definition: Pferdesport Veranstaltungen mit Pferden in Trapez, bei dem einzelne Fahrzeuge einen Kurs fahren
in scheme: mediatopic
created: 2009-10-22T02:00:00+00:00
retired: 2017-07-04T12:00:00+00:00
modified: 2021-02-18T12:00:00+00:00
broader: Pferdesport
broad match: http://cv.iptc.org/newscodes/subjectcode/15022000

Degen
type: Concept
definition: Kategorie des Fechtens mit einer Waffe, die aus einer dreieckigen Querschnittklinge besteht und einem kleinen Korbschutz (Glocke) besteht
in scheme: mediatopic
created: 2009-10-22T02:00:00+00:00
retired: 2017-07-04T12:00:00+00:00
modified: 2021-07-12T12:00:00+00:00
broader: Fechten

Florett
type: Concept
definition: Kategorie des Fechtens mit einer Waffe, die aus einer rechteckigen Querschnittklinge besteht und einem kleinen Korbschutz (Glocke) besteht
in scheme: mediatopic
created: 2009-10-22T02:00:00+00:00
retired: 2017-07-04T12:00:00+00:00
modified: 2021-02-18T12:00:00+00:00
broader: Fechten

Säbel
type: Concept
definition: Eine Fechtwaffe mit einem Handschutz und einer flachen Klinge mit schneidenden und stoßenden Bewegungen
in scheme: mediatopic
created: 2009-10-22T02:00:00+00:00
retired: 2017-07-04T12:00:00+00:00
modified: 2021-02-18T12:00:00+00:00
broader: Fechten

Eistanz
type: Concept
definition: Findet über drei Tage statt in folgender Reihenfolge, zwei obligatorische Tänze, ein origineller Tanz (2,30 min) und ein freier Tanz (4 min)
in scheme: mediatopic
created: 2009-10-22T02:00:00+00:00
retired: 2017-07-04T12:00:00+00:00
modified: 2021-02-18T12:00:00+00:00
broader: Eiskunstlauf

Minigolf
type: Concept
definition: Spiel bei dem Bälle eingelocht werden in einem speziellen Kurs mit so wenig Versuchen wie möglich
in scheme: mediatopic
created: 2009-10-22T02:00:00+00:00
modified: 2021-02-18T12:00:00+00:00
broader: Golf

Rhythmische Gymnastik
type: Concept
definition: Eine Mischung aus Tanz und turnerischen Figuren
in scheme: mediatopic
created: 2009-10-22T02:00:00+00:00
modified: 2021-02-18T12:00:00+00:00
broader: Turnen
narrower: Ball (Rhythmische Gymnastik)
narrower: Keulen (Rhythmische Gymnastik)
narrower: Reifen (Rhythmische Gymnastik)
narrower: Bänder (Rhythmische Gymnastik)
narrower: Seil (Rhythmische Gymnastik)
has facet: rhythmgymtype

Trampolin (Rhythmische Gymnastik)
type: Concept
definition: Wettkämpfer zeigen komplizierte Drehungen und Sprünge während sie auf dem Trampolin springen
in scheme: mediatopic
created: 2009-10-22T02:00:00+00:00
modified: 2021-02-18T12:00:00+00:00
broader: Turnen

Kunstturnen
type: Concept
definition: Turner zeigen artistische und akrobatische Figuren an unterschiedlichen Geräten. Es gibt 6 Disziplinen für Männer und 4 für Frauen.
in scheme: mediatopic
created: 2014-04-11T12:00:00+00:00
modified: 2021-07-12T12:00:00+00:00
broader: Turnen
narrower: Schwebebalken (Kunstturnen)
narrower: Bodenturnen (Kunstturnen)
narrower: Reck (Kunstturnen)
narrower: Barren (Kunstturnen)
narrower: Seitpferd (Kunstturnen)
narrower: Ringe (Kunstturnen)
narrower: Stufenbarren (Kunstturnen)
narrower: Pferdsprung (Kunstturnen)
has facet: artisticgymtype

Ball (Rhythmische Gymnastik)
type: Concept
definition: Eine Übung, die unter Benutzung eines Balles auf Beweglichkeit des Körpers beruht
in scheme: mediatopic
created: 2009-10-22T02:00:00+00:00
retired: 2015-02-24T12:00:00+00:00
modified: 2021-12-21T12:00:00+00:00
broader: Rhythmische Gymnastik

Schwebebalken (Kunstturnen)
type: Concept
definition: Turner zeigt Sprünge und Drehungen auf dem meist gefürchteten Schwebebalken mit 10 cm Breite
in scheme: mediatopic
created: 2009-10-22T02:00:00+00:00
retired: 2015-02-24T12:00:00+00:00
modified: 2021-12-21T12:00:00+00:00
broader: Kunstturnen

Keulen (Rhythmische Gymnastik)
type: Concept
definition: Tanz und gymnastische Figuren mit langen kreuzenden Keulen
in scheme: mediatopic
created: 2009-10-22T02:00:00+00:00
retired: 2015-02-24T12:00:00+00:00
modified: 2021-12-21T12:00:00+00:00
broader: Rhythmische Gymnastik

Bodenturnen (Kunstturnen)
type: Concept
definition: Eine gymnastische Bodenübung auf einer 12 m Matte
in scheme: mediatopic
created: 2009-10-22T02:00:00+00:00
retired: 2015-02-24T12:00:00+00:00
modified: 2021-12-21T12:00:00+00:00
broader: Kunstturnen

Reifen (Rhythmische Gymnastik)
type: Concept
definition: Ein Reifen wird lange gerollt und geworfen in einer Tanzperformance
in scheme: mediatopic
created: 2009-10-22T02:00:00+00:00
retired: 2015-02-24T12:00:00+00:00
modified: 2021-12-21T12:00:00+00:00
broader: Rhythmische Gymnastik

Reck (Kunstturnen)
type: Concept
definition: Turner dreht, schwingt und zeigt Pirouetten an dem horizontalen Reck
in scheme: mediatopic
created: 2009-10-22T02:00:00+00:00
retired: 2015-02-24T12:00:00+00:00
modified: 2021-12-21T12:00:00+00:00
broader: Kunstturnen

Barren (Kunstturnen)
type: Concept
definition: Turner schwingt und kreist mit Leichtigkeit und Grazie an den parallelen Barren
in scheme: mediatopic
created: 2009-10-22T02:00:00+00:00
retired: 2015-02-24T12:00:00+00:00
modified: 2021-12-21T12:00:00+00:00
broader: Kunstturnen

Seitpferd (Kunstturnen)
type: Concept
definition: Turner zeigen einen nicht unterbrochenen Schwung über ein Pferd mit Handgriffen unter Einsatz von Balance und Kraft
in scheme: mediatopic
created: 2009-10-22T02:00:00+00:00
retired: 2015-02-24T12:00:00+00:00
modified: 2021-12-21T12:00:00+00:00
broader: Kunstturnen

Bänder (Rhythmische Gymnastik)
type: Concept
definition: Turner arbeiten mit spektakulären, langen Bändern eine vorbereitete Bewegungsfolge ab
in scheme: mediatopic
created: 2009-10-22T02:00:00+00:00
retired: 2015-02-24T12:00:00+00:00
modified: 2021-12-21T12:00:00+00:00
broader: Rhythmische Gymnastik

Seil (Rhythmische Gymnastik)
type: Concept
definition: Sprünge und Figuren werden gezeigt durch die Bewegung eines Seiles
in scheme: mediatopic
created: 2009-10-22T02:00:00+00:00
retired: 2015-02-24T12:00:00+00:00
modified: 2021-12-21T12:00:00+00:00
broader: Rhythmische Gymnastik

Ringe (Kunstturnen)
type: Concept
definition: Turner zeigt Figuren mit Balance und Kraft an den schwingenden Ringen
in scheme: mediatopic
created: 2009-10-22T02:00:00+00:00
retired: 2015-02-24T12:00:00+00:00
modified: 2021-12-21T12:00:00+00:00
broader: Kunstturnen

Stufenbarren (Kunstturnen)
type: Concept
definition: Turner zeigt eine routinierte Schwungfolge zwischen und um die ungleichen Barren herum
in scheme: mediatopic
created: 2009-10-22T02:00:00+00:00
retired: 2015-02-24T12:00:00+00:00
modified: 2021-12-21T12:00:00+00:00
broader: Kunstturnen

Pferdsprung (Kunstturnen)
type: Concept
definition: Turner bringt sich selbst in die Luft durch Abspringen von einem Brett nach einem schellen Lauf von 25 Metern
in scheme: mediatopic
created: 2009-10-22T02:00:00+00:00
retired: 2015-02-24T12:00:00+00:00
modified: 2021-12-21T12:00:00+00:00
broader: Kunstturnen

Galopprennen
type: Concept
definition: Pferderennen in einem flachen Gelände
in scheme: mediatopic
created: 2009-10-22T02:00:00+00:00
retired: 2017-07-04T12:00:00+00:00
modified: 2021-02-18T12:00:00+00:00
broader: Pferderennen

Trabrennen
type: Concept
definition: Pferdewagenrennen mit Jockey im Trab auf einer flachen Bahn.
in scheme: mediatopic
created: 2009-10-22T02:00:00+00:00
retired: 2017-07-04T12:00:00+00:00
modified: 2021-02-18T12:00:00+00:00
broader: Pferderennen

Hindernissrennen
type: Concept
definition: Rennen mit Pferd und Reiter über acht Hindernisse, wovon vier unterschiedlich sein müssen, wie Sprung über Wasser, Sprossenzäune, Schlammwände etc.
in scheme: mediatopic
created: 2009-10-22T02:00:00+00:00
retired: 2017-07-04T12:00:00+00:00
modified: 2021-02-18T12:00:00+00:00
broader: Pferderennen

Eisschlittenhockey
type: Concept
definition: Ähnlich wie Eishockey, aber auf kleinen Schlitten. Die Wettkämpfer bewegen sich mit Hilfe der Arme fort
in scheme: mediatopic
created: 2009-10-22T02:00:00+00:00
modified: 2021-02-18T12:00:00+00:00
broader: Eishockey

Judo
type: Concept
definition: Eine verteidigende Kampfortart
in scheme: mediatopic
created: 2009-10-22T02:00:00+00:00
modified: 2021-02-18T12:00:00+00:00
broader: Kampfsport
narrower: Extra Leichtgewicht (Judo)
narrower: Halb-Schwergewicht (Judo)
narrower: Halb-Leichtgewicht (Judo)
narrower: Halb-Mittelgewicht (Judo)
narrower: Schwergewicht (Judo)
narrower: Leichtgewicht (Judo)
narrower: Mittelgewicht (Judo)
has facet: weightclasstype

Extra Leichtgewicht (Judo)
type: Concept
definition: Bis zu 60 kg bei Männern und 48 kg bei Frauen
in scheme: mediatopic
created: 2009-10-22T02:00:00+00:00
retired: 2015-02-24T12:00:00+00:00
modified: 2021-12-21T12:00:00+00:00
broader: Judo

Halb-Schwergewicht (Judo)
type: Concept
definition: Bis zu 100 kg bei Männern und 78 kg bei Frauen
in scheme: mediatopic
created: 2009-10-22T02:00:00+00:00
retired: 2015-02-24T12:00:00+00:00
modified: 2021-12-21T12:00:00+00:00
broader: Judo

Halb-Leichtgewicht (Judo)
type: Concept
definition: Bis zu 73 kg bei Männern und 57 kg bei Frauen
in scheme: mediatopic
created: 2009-10-22T02:00:00+00:00
retired: 2015-02-24T12:00:00+00:00
modified: 2021-12-21T12:00:00+00:00
broader: Judo

Halb-Mittelgewicht (Judo)
type: Concept
definition: Bis zu 81 kg bei Männern und 63 kg bei Frauen
in scheme: mediatopic
created: 2009-10-22T02:00:00+00:00
retired: 2015-02-24T12:00:00+00:00
modified: 2021-12-21T12:00:00+00:00
broader: Judo

Schwergewicht (Judo)
type: Concept
definition: Gewöhnlich über 100 kg bei Männern und über 78 kg bei Frauen
in scheme: mediatopic
created: 2009-10-22T02:00:00+00:00
retired: 2015-02-24T12:00:00+00:00
modified: 2021-12-21T12:00:00+00:00
broader: Judo

Leichtgewicht (Judo)
type: Concept
definition: Bis zu 66kg bei Männern und 52kg bei Frauen
in scheme: mediatopic
created: 2009-10-22T02:00:00+00:00
retired: 2015-02-24T12:00:00+00:00
modified: 2021-12-21T12:00:00+00:00
broader: Judo

Mittelgewicht (Judo)
type: Concept
definition: Bis zu 90kg bei Männern und 70kg bei Frauen
in scheme: mediatopic
created: 2009-10-22T02:00:00+00:00
retired: 2015-02-24T12:00:00+00:00
modified: 2021-12-21T12:00:00+00:00
broader: Judo

Jukendo
type: Concept
definition: Japanische traditionelle Kampfsportart mit einem Holzgewehr. 'Juken' bedeutet Gewehr oder Waffe mit Bajonett. (Programm des Nationalen Sportfestivals in Japan)
in scheme: mediatopic
created: 2009-10-22T02:00:00+00:00
modified: 2021-02-18T12:00:00+00:00
broader: Kampfsport

K1 (Kajak)
type: Concept
definition: Ein geschlossenes Boot, worin der Wettkämpfer in einem festen Sitz sitzt und ein Doppelpaddel benutzt
in scheme: mediatopic
created: 2009-10-22T02:00:00+00:00
retired: 2015-02-24T12:00:00+00:00
modified: 2021-12-21T12:00:00+00:00
broader: Kajak

K2 (Kajak)
type: Concept
definition: Ein geschlossenes Boot, worin zwei Wettkämpfer in festen Sitzen sitzen und Doppelpaddel benutzen
in scheme: mediatopic
created: 2009-10-22T02:00:00+00:00
retired: 2015-02-24T12:00:00+00:00
modified: 2021-12-21T12:00:00+00:00
broader: Kajak

K4 (Kajak)
type: Concept
definition: Ein geschlossenes Boot, worin vier Wettkämpfer in festen Sitzen sitzen und Doppelpaddel benutzen
in scheme: mediatopic
created: 2009-10-22T02:00:00+00:00
retired: 2015-02-24T12:00:00+00:00
modified: 2021-12-21T12:00:00+00:00
broader: Kajak

Karate
type: Concept
definition: Eine Kampfsportart bei der Hiebe, Schläge, Tritte und Würfe genutzt werden um einen Angreifer abzuwehren
in scheme: mediatopic
created: 2009-10-22T02:00:00+00:00
modified: 2021-02-18T12:00:00+00:00
broader: Kampfsport

Kendo
type: Concept
definition: Traditionelle japanische Kampfsportart mit einem Bambusschwert, auch Japanisches Fechten genannt
in scheme: mediatopic
created: 2009-10-22T02:00:00+00:00
modified: 2021-03-15T12:00:00+00:00
broader: Kampfsport

Kyodo
type: Concept
definition: Japanische traditionelle Kampfsportart mit einem Bambusbogen und Pfeilen, manchmal auch japanisches Bogenschießen genannt
in scheme: mediatopic
created: 2009-10-22T02:00:00+00:00
modified: 2021-02-18T12:00:00+00:00
broader: Kampfsport

Ausdauer
type: Concept
definition: Rennen mit einem oder mehreren Fahrern über eine lange und bestimmte Distanz und Zeit
in scheme: mediatopic
created: 2009-10-22T02:00:00+00:00
retired: 2017-07-04T12:00:00+00:00
modified: 2021-02-18T12:00:00+00:00
broader: Motorsport

F3000
type: Concept
definition: Mit weniger starken Motoren als bei der Formel 1, fahren ausgewählte Konstrukteur-Teams über verschiedene Runden weltweit Geschwindigkeitsrennen im Einzel- und Teamwettbewerb über eine Saison
in scheme: mediatopic
created: 2009-10-22T02:00:00+00:00
retired: 2017-07-04T12:00:00+00:00
modified: 2021-02-18T12:00:00+00:00
broader: Motorsport

Formel 1
type: Concept
definition: Einzelfahrer Autorennen bei dem 20 oder mehr Wettkämpfer ein Kopf-an-Kopf-Rennen über verschiedene Runden weltweit, um Grand Prix Punkte zu gewinnen in einem Einzel- und Konstrukteur-Wettbewerb
in scheme: mediatopic
created: 2009-10-22T02:00:00+00:00
retired: 2017-07-04T12:00:00+00:00
modified: 2021-02-18T12:00:00+00:00
broader: Motorsport

Indy
type: Concept
definition: Nordamerikanische professionelle Topliga der Geschwindigkeitsrennen über Runden
in scheme: mediatopic
created: 2009-10-22T02:00:00+00:00
retired: 2017-07-04T12:00:00+00:00
modified: 2021-02-18T12:00:00+00:00
broader: Motorsport

Crossrallye
type: Concept
definition: Rennen im Stadion über schmutzige Straßen
in scheme: mediatopic
created: 2009-10-22T02:00:00+00:00
retired: 2017-07-04T12:00:00+00:00
modified: 2021-02-18T12:00:00+00:00
broader: Motorsport

Rallye
type: Concept
definition: Ein Saison von Ausdauerrennen über geschlossene Pisten auf dreckigen Straßen und auch unter Schneebedingungen, mit Hilfe von speziellen Straßenfahrzeugens mit einem Fahrer und einem Co-Pilot
in scheme: mediatopic
created: 2009-10-22T02:00:00+00:00
retired: 2017-07-04T12:00:00+00:00
modified: 2021-02-18T12:00:00+00:00
broader: Motorsport

Ausdauer
type: Concept
definition: Straßenrennen mit Belastung und Ausdauer
in scheme: mediatopic
created: 2009-10-22T02:00:00+00:00
retired: 2017-07-04T12:00:00+00:00
modified: 2021-02-18T12:00:00+00:00
broader: Motorradrennen

Enduro
type: Concept
definition: Geschwindigkeitsrennen, Ausdauer und Regeln über verschiedene Oberflächen, z.B durch den Wald und auf schmutzigen Straßen
in scheme: mediatopic
created: 2009-10-22T02:00:00+00:00
retired: 2017-07-04T12:00:00+00:00
modified: 2021-02-18T12:00:00+00:00
broader: Motorradrennen

Grasbahn
type: Concept
definition: Rennen, was auf Gras ausgetragen wird
in scheme: mediatopic
created: 2009-10-22T02:00:00+00:00
retired: 2017-07-04T12:00:00+00:00
modified: 2021-02-18T12:00:00+00:00
broader: Motorradrennen

Motoball
type: Concept
definition: Mannschaftssport bei dem die Fahrer mit einem Ball spielen
in scheme: mediatopic
created: 2009-10-22T02:00:00+00:00
retired: 2017-07-04T12:00:00+00:00
modified: 2021-02-18T12:00:00+00:00
broader: Motorradrennen

Motocross
type: Concept
definition: Rennen über schmutzige Straßen und enge Dämme
in scheme: mediatopic
created: 2009-10-22T02:00:00+00:00
retired: 2017-07-04T12:00:00+00:00
modified: 2021-02-18T12:00:00+00:00
broader: Motorradrennen

MotoGP
type: Concept
definition: Hubraumklasse 1000 Kubikzentimeter
in scheme: mediatopic
created: 2009-10-22T02:00:00+00:00
retired: 2017-07-04T12:00:00+00:00
modified: 2021-02-18T12:00:00+00:00
broader: Motorradrennen

Rallye
type: Concept
definition: Rennen über reguläre Straßen
in scheme: mediatopic
created: 2009-10-22T02:00:00+00:00
retired: 2017-07-04T12:00:00+00:00
modified: 2021-02-18T12:00:00+00:00
broader: Motorradrennen

Beiwagen
type: Concept
definition: Mit verschiedenen Motorenstärken aber an der Seite mit einer Sitzmöglichkeit für einen Beifahrer
in scheme: mediatopic
created: 2009-10-22T02:00:00+00:00
retired: 2017-07-04T12:00:00+00:00
modified: 2021-05-05T12:00:00+00:00
broader: Motorradrennen

Speedway
type: Concept
definition: Rennen mit bis zu sechs Fahrern in einem flachen ovalen Kurs. Speedway Motorräder haben nur einen Gang und keine Bremsen
in scheme: mediatopic
created: 2009-10-22T02:00:00+00:00
retired: 2017-07-04T12:00:00+00:00
modified: 2021-02-18T12:00:00+00:00
broader: Motorradrennen

Trial
type: Concept
definition: Rennen mit Belastung und Ausdauer durch unterschiedliches Gelände
in scheme: mediatopic
created: 2009-10-22T02:00:00+00:00
retired: 2017-07-04T12:00:00+00:00
modified: 2021-02-18T12:00:00+00:00
broader: Motorradrennen

Naginata
type: Concept
definition: Japanische traditionelle Kampfsportart mit einem Holzschwert. 'Naginata' bedeutet Speer mit einem gebogenen Blatt
in scheme: mediatopic
created: 2009-10-22T02:00:00+00:00
modified: 2021-02-18T12:00:00+00:00
broader: Kampfsport

Ski Orientierung
type: Concept
definition: Einzelzeitrennen auf Skiern über eine mit Fackeln markierte Strecke, die der Wettkämpfer mithilfe von Kompass und Karte in einer bestimmten Reihenfolge finden muss
in scheme: mediatopic
created: 2009-10-22T02:00:00+00:00
modified: 2021-02-18T12:00:00+00:00
broader: Orientierung

Bareback
type: Concept
definition: Rodeo Disziplin
in scheme: mediatopic
created: 2009-10-22T02:00:00+00:00
modified: 2021-07-12T12:00:00+00:00
broader: Rodeo

Barrel Racing
type: Concept
definition: Rodeo Disziplin
in scheme: mediatopic
created: 2009-10-22T02:00:00+00:00
modified: 2021-07-12T12:00:00+00:00
broader: Rodeo

Bullenreiten
type: Concept
definition: Rodeo Disziplin
in scheme: mediatopic
created: 2009-10-22T02:00:00+00:00
modified: 2021-07-12T12:00:00+00:00
broader: Rodeo

Bulldogging
type: Concept
definition: Rodeo Disziplin
in scheme: mediatopic
created: 2009-10-22T02:00:00+00:00
modified: 2021-07-12T12:00:00+00:00
broader: Rodeo

Calf Roping
type: Concept
definition: Rodeo Disziplin
in scheme: mediatopic
created: 2009-10-22T02:00:00+00:00
modified: 2021-07-12T12:00:00+00:00
broader: Rodeo

Goat Roping
type: Concept
definition: Rodeo Disziplin
in scheme: mediatopic
created: 2009-10-22T02:00:00+00:00
modified: 2021-07-12T12:00:00+00:00
broader: Rodeo

Saddle Bronc
type: Concept
definition: Rodeo Disziplin
in scheme: mediatopic
created: 2009-10-22T02:00:00+00:00
modified: 2021-07-12T12:00:00+00:00
broader: Rodeo

Rollerhockey
type: Concept
definition: Mannschaftssport ähnlich dem Eishockey, gespielt auf vierrädrigen Rollschuhen mit Schlägern und einem Ball
in scheme: mediatopic
created: 2009-10-22T02:00:00+00:00
modified: 2021-02-18T12:00:00+00:00
broader: Roller-Sport

Vierer
type: Concept
definition: Boot für vier Personen und einem Ruder für jeden mit Steuermann
in scheme: mediatopic
created: 2009-10-22T02:00:00+00:00
retired: 2015-02-24T12:00:00+00:00
modified: 2021-12-21T12:00:00+00:00
broader: Rudern
broad match: http://cv.iptc.org/newscodes/subjectcode/15047000

Zweier
type: Concept
definition: Boot für zwei Personen mit einem Ruder für jeden und mit Steuermann
in scheme: mediatopic
created: 2009-10-22T02:00:00+00:00
retired: 2015-02-24T12:00:00+00:00
modified: 2021-12-21T12:00:00+00:00
broader: Rudern
broad match: http://cv.iptc.org/newscodes/subjectcode/15047000

Vierer ohne Steuermann
type: Concept
definition: Boot für vier Personen und einem Ruder für jeden ohne Steuermann
in scheme: mediatopic
created: 2009-10-22T02:00:00+00:00
retired: 2015-02-24T12:00:00+00:00
modified: 2021-12-21T12:00:00+00:00
broader: Rudern

Zweier ohne Steuermann
type: Concept
definition: Boot für zwei Personen mit einem Ruder für jeden und ohne Steuermann
in scheme: mediatopic
created: 2009-10-22T02:00:00+00:00
retired: 2015-02-24T12:00:00+00:00
modified: 2021-12-21T12:00:00+00:00
broader: Rudern

Doppelzweier
type: Concept
definition: Boot für zwei Personen mit je zwei Rudern
in scheme: mediatopic
created: 2009-10-22T02:00:00+00:00
retired: 2015-02-24T12:00:00+00:00
modified: 2021-12-21T12:00:00+00:00
broader: Rudern

Achter
type: Concept
definition: Boot für acht Personen und einem Ruder pro Person mit Steuermann
in scheme: mediatopic
created: 2009-10-22T02:00:00+00:00
retired: 2015-02-24T12:00:00+00:00
modified: 2021-12-21T12:00:00+00:00
broader: Rudern
broad match: http://cv.iptc.org/newscodes/subjectcode/15047006

Doppelvierer
type: Concept
definition: Boot für vier Personen mit je zwei Rudern und ohne den Steuermann
in scheme: mediatopic
created: 2009-10-22T02:00:00+00:00
retired: 2015-02-24T12:00:00+00:00
modified: 2021-12-21T12:00:00+00:00
broader: Rudern

Einer
type: Concept
definition: Boot für eine Person mit zwei Rudern
in scheme: mediatopic
created: 2009-10-22T02:00:00+00:00
retired: 2015-02-24T12:00:00+00:00
modified: 2021-12-21T12:00:00+00:00
broader: Rudern

Rugbyliga
type: Concept
definition: Zwei Teams mit je 13 Spielern kämpfen um Punktabstand, indem sie Versuche und Strafpunkte bekommen durch Rennen und werfen eines ovalen Balles, der hinter der Torlinie den Boden berühren muss oder zwischen zwei Torpfosten geschossen wird in einem harten körperlichen Wettkampf
in scheme: mediatopic
created: 2009-10-22T02:00:00+00:00
modified: 2021-07-12T12:00:00+00:00
broader: Rugby

Rugby Union
type: Concept
definition: Zwei Teams mit je 15 Spielern kämpfen um Punktabstand, indem sie Versuche und Strafpunkte bekommen durch Rennen und werfen eines ovalen Balles, der hinter der Torlinie den Boden berühren muss oder zwischen zwei Torpfosten geschossen wird in einem harten körperlichen Wettkampf
in scheme: mediatopic
created: 2009-10-22T02:00:00+00:00
modified: 2021-02-18T12:00:00+00:00
broader: Rugby

Rugby 7
type: Concept
definition: Ein lustigere und aufregendere Variante, bei der zwei Teams mit je 7 Spielern um Punktabstand kämpfen, indem sie Versuche und Strafpunkte bekommen durch Rennen und werfen eines ovalen Balles, der hinter der Torlinie den Boden berühren muss oder zwischen zwei Torpfosten geschossen wird in einem harten körperlichen Wettkampf
in scheme: mediatopic
created: 2009-10-22T02:00:00+00:00
modified: 2021-07-12T12:00:00+00:00
broader: Rugby

Mehrmaster
type: Concept
definition: Boot mit mehreren Masten
in scheme: mediatopic
created: 2009-10-22T02:00:00+00:00
retired: 2017-07-04T12:00:00+00:00
modified: 2021-05-05T12:00:00+00:00
broader: Segeln

Dinghy
type: Concept
definition: Boot mit einem Mast ohne festen Kiel
in scheme: mediatopic
created: 2009-10-22T02:00:00+00:00
retired: 2017-07-04T12:00:00+00:00
modified: 2021-02-18T12:00:00+00:00
broader: Segeln
broad match: http://cv.iptc.org/newscodes/subjectcode/15050013

Kielboot
type: Concept
definition: Boot mit einem Mast mit festem Kiel
in scheme: mediatopic
created: 2009-10-22T02:00:00+00:00
retired: 2017-07-04T12:00:00+00:00
modified: 2021-05-05T12:00:00+00:00
broader: Segeln
broad match: http://cv.iptc.org/newscodes/subjectcode/15050013

Regatta
type: Concept
definition: Segel Ereignis
in scheme: mediatopic
created: 2009-10-22T02:00:00+00:00
retired: 2017-07-04T12:00:00+00:00
modified: 2021-05-05T12:00:00+00:00
broader: Segeln
broad match: http://cv.iptc.org/newscodes/subjectcode/15050000

Meersegeln
type: Concept
definition: Segeln auf offener See als Teil eines Rennens
in scheme: mediatopic
created: 2009-10-22T02:00:00+00:00
retired: 2017-07-04T12:00:00+00:00
modified: 2021-05-05T12:00:00+00:00
broader: Segeln
broad match: http://cv.iptc.org/newscodes/subjectcode/15050000

Rund um die Welt
type: Concept
definition: Segeln rund um die Welt als Teil eines Rennens
in scheme: mediatopic
created: 2009-10-22T02:00:00+00:00
retired: 2017-07-04T12:00:00+00:00
modified: 2021-05-05T12:00:00+00:00
broader: Segeln

Meersegeln Solo
type: Concept
definition: Segeln als Einzelperson auf offener See als Teil eines Rennens
in scheme: mediatopic
created: 2009-10-22T02:00:00+00:00
retired: 2017-07-04T12:00:00+00:00
modified: 2021-05-05T12:00:00+00:00
broader: Segeln
broad match: http://cv.iptc.org/newscodes/subjectcode/15050000

Non-Stop Solo
type: Concept
definition: Rennen gegen oder im Uhrzeigersinn einmal um die Welt ohne Stopp zwischen Start und Ziel des Rennens
in scheme: mediatopic
created: 2009-10-22T02:00:00+00:00
retired: 2017-07-04T12:00:00+00:00
modified: 2021-02-18T12:00:00+00:00
broader: Segeln
broad match: http://cv.iptc.org/newscodes/subjectcode/15050012

Pistole
type: Concept
definition: Schießwettkampf mit Pistole
in scheme: mediatopic
created: 2009-10-22T02:00:00+00:00
retired: 2017-07-04T12:00:00+00:00
modified: 2021-02-18T12:00:00+00:00
broader: Schießen
broad match: http://cv.iptc.org/newscodes/subjectcode/15051001

Gewehr
type: Concept
definition: Schießwettkampf mit Gewehr
in scheme: mediatopic
created: 2009-10-22T02:00:00+00:00
retired: 2017-07-04T12:00:00+00:00
modified: 2021-05-05T12:00:00+00:00
broader: Schießen
broad match: http://cv.iptc.org/newscodes/subjectcode/15051002

Laufende Scheibe
type: Concept
definition: Schießwettkampf mit einem Luftgewehr und einer Scheibe, die sich seitwärts bewegt
in scheme: mediatopic
created: 2009-10-22T02:00:00+00:00
retired: 2017-07-04T12:00:00+00:00
modified: 2021-05-05T12:00:00+00:00
broader: Schießen
broad match: http://cv.iptc.org/newscodes/subjectcode/15051003

Schnellfeuerpistole
type: Concept
definition: Schießwettkampf mit einer Schnellfeuerpistole
in scheme: mediatopic
created: 2009-10-22T02:00:00+00:00
retired: 2017-07-04T12:00:00+00:00
modified: 2021-05-05T12:00:00+00:00
broader: Schießen
broad match: http://cv.iptc.org/newscodes/subjectcode/15051004

Sportpistole
type: Concept
definition: Schießwettkampf bei dem auf fliegende Scheiben gezielt wird
in scheme: mediatopic
created: 2009-10-22T02:00:00+00:00
retired: 2017-07-04T12:00:00+00:00
modified: 2021-05-05T12:00:00+00:00
broader: Schießen
broad match: http://cv.iptc.org/newscodes/subjectcode/15051005

Ski alpin
type: Concept
definition: Abfahrtsschnelllauf auf schneebedeckten Pisten. Die Hänge haben verschiedene Tore, deren Abstand abhängig ist von der jeweiligen Disziplin
in scheme: mediatopic
created: 2009-10-22T02:00:00+00:00
modified: 2021-02-18T12:00:00+00:00
broader: Ski
has facet: alpineskiingtype

Freestyle Ski
type: Concept
definition: Wettkämpfer zeigen eine Reihe von atemberaubenden akrobatischen Sätzen mit vorbereiteten Sprüngen. Kombiniert mit Trickski, Schanzenspringen und Skiballett
in scheme: mediatopic
created: 2009-10-22T02:00:00+00:00
modified: 2022-02-03T12:00:00+00:00
broader: Ski
has facet: freestyleskiingtype

Grasski
type: Concept
definition: Alpiner Skirennsport mit Rollskiern auf Graspisten
in scheme: mediatopic
created: 2009-10-22T02:00:00+00:00
modified: 2021-02-18T12:00:00+00:00
broader: Ski

Ski nordisch
type: Concept
definition: Findet in eher flachem, schneebedeckten Gelände statt und basiert auf Kraft und Ausdauer.
in scheme: mediatopic
created: 2009-10-22T02:00:00+00:00
retired: 2019-08-01T12:00:00+00:00
modified: 2021-02-18T12:00:00+00:00
broader: Ski
has facet: nordicskiingtype

Skispringen
type: Concept
definition: Wettkämpfer gleiten auf Skiern eine schneebedeckte Rampe herunter und versuchen so weit wie möglich zu fliegen. Bewertet wird die Distanz, der Flugstil und die Landung
in scheme: mediatopic
created: 2009-10-22T02:00:00+00:00
modified: 2021-02-18T12:00:00+00:00
broader: Ski

Skilanglauf
type: Concept
definition: Wettrennen Ski nordisch im eher flachen, schneebedeckten Gelände auf schmalen Skis
in scheme: mediatopic
created: 2014-01-17T12:00:00+00:00
modified: 2021-02-18T12:00:00+00:00
broader: Ski

Nordische Kombination
type: Concept
definition: Wettkampf der Skilanglauf und Skispringen kombiniert
in scheme: mediatopic
created: 2014-01-20T12:00:00+00:00
modified: 2021-02-18T12:00:00+00:00
broader: Ski

Telemark-Skifahren
type: Concept
definition: Rennen, bei denen Abfahrts- und Skilanglaufrennen mit einzigartigen Telemark-Techniken und -Ausrüstungen kombiniert werden.
in scheme: mediatopic
created: 2014-11-07T12:00:00+00:00
modified: 2021-07-12T12:00:00+00:00
broader: Ski

Skiwandern
type: Concept
definition: Ein Wintersport, der Skifahren und Bergsteigen kombiniert und bei dem man mit Skiern oder zu Fuß Berge besteigt und anschließend mit Skiern wieder hinunterfährt.
in scheme: mediatopic
created: 2025-03-31T12:00:00+00:00
modified: 2025-03-31T12:00:00+00:00
broader: Ski

http://cv.iptc.org/newscodes/mediatopic/20001393
type: Concept
in scheme: mediatopic
created: 2025-10-09T12:00:00+00:00
modified: 2025-10-09T12:00:00+00:00
broader: Fußball

http://cv.iptc.org/newscodes/mediatopic/20001394
type: Concept
in scheme: mediatopic
created: 2025-10-09T12:00:00+00:00
modified: 2026-07-09T12:00:00+00:00
broader: Fußball

Rückenschwimmen
type: Concept
definition: Schwimmstil auf dem Rücken liegend, Beine bewegen sich in schlagender Bewegung, während die Arme den Schwimmer nach vorne treiben
in scheme: mediatopic
created: 2009-10-22T02:00:00+00:00
retired: 2015-02-24T12:00:00+00:00
modified: 2021-12-21T12:00:00+00:00
broader: Schwimmen
broad match: http://cv.iptc.org/newscodes/subjectcode/15062000

Brustschwimmen
type: Concept
definition: Schwimmstil, auf dem Bauch liegend sich vorwärts und außerhalb mit den Armen und rückwärts mit den Beinen bewegend
in scheme: mediatopic
created: 2009-10-22T02:00:00+00:00
retired: 2015-02-24T12:00:00+00:00
modified: 2021-12-21T12:00:00+00:00
broader: Schwimmen
broad match: http://cv.iptc.org/newscodes/subjectcode/15062000

Schmetterling
type: Concept
definition: Schwimmstil in Bauchlage, bei dem beide Schultern parallel zum Wasser bleiben und die Arme sich simultan in Schmetterlingsform bewegen. Die Beine werden zusammengehalten und flossenartig bewegt. Der kraftaufwendigste aller Schwimmstile
in scheme: mediatopic
created: 2009-10-22T02:00:00+00:00
retired: 2015-02-24T12:00:00+00:00
modified: 2021-12-21T12:00:00+00:00
broader: Schwimmen
broad match: http://cv.iptc.org/newscodes/subjectcode/15062000

Freistil
type: Concept
definition: Wettkämpfer schwimmen egal in welchem Stil, wobei meist das Kraulschwimmen bevorzugt wird
in scheme: mediatopic
created: 2009-10-22T02:00:00+00:00
retired: 2015-02-24T12:00:00+00:00
modified: 2021-12-21T12:00:00+00:00
broader: Schwimmen

Lagen
type: Concept
definition: Eine Kombination von vier verschiedenen Schwimmstilen in einem Rennen
in scheme: mediatopic
created: 2009-10-22T02:00:00+00:00
retired: 2015-02-24T12:00:00+00:00
modified: 2021-12-21T12:00:00+00:00
broader: Schwimmen
broad match: http://cv.iptc.org/newscodes/subjectcode/15062000

Langstrecke
type: Concept
definition: Schwimmen einer Langstrecke im offenen Wasser
in scheme: mediatopic
created: 2009-10-22T02:00:00+00:00
modified: 2021-07-12T12:00:00+00:00
broader: Schwimmen
broad match: http://cv.iptc.org/newscodes/subjectcode/15062000

Staffel Freistil
type: Concept
definition: Staffelteam Wettbewerb in einem frei gewählten Schwimmstil
in scheme: mediatopic
created: 2009-10-22T02:00:00+00:00
retired: 2015-02-24T12:00:00+00:00
modified: 2021-12-21T12:00:00+00:00
broader: Schwimmen
broad match: http://cv.iptc.org/newscodes/subjectcode/15062000

Staffel Lagen
type: Concept
definition: Staffelteam Wettbewerb mit vier kombinierten Schwimmstilen
in scheme: mediatopic
created: 2009-10-22T02:00:00+00:00
retired: 2015-02-24T12:00:00+00:00
modified: 2021-12-21T12:00:00+00:00
broader: Schwimmen
broad match: http://cv.iptc.org/newscodes/subjectcode/15062000

Kurzbahnen (Schwimmen)
type: Concept
definition: Rennen, die in einem 25m langen Pool ausgetragen werden
in scheme: mediatopic
created: 2009-10-22T02:00:00+00:00
retired: 2015-02-24T12:00:00+00:00
modified: 2021-12-21T12:00:00+00:00
broader: Schwimmen
broad match: http://cv.iptc.org/newscodes/subjectcode/15062000

Synchronschwimmen frei
type: Concept
definition: In der freien Disziplin sind die Bewegungen, die Musik und die Reihenfolge nicht vorgegeben
in scheme: mediatopic
created: 2009-10-22T02:00:00+00:00
modified: 2021-02-18T12:00:00+00:00
broader: Synchronschwimmen

Synchronschwimmen Disziplin
type: Concept
definition: Wettkämpfer erhalten Punkte von einer zehnköpfigen Jury für synchrone artistische Formen und Bewegungen im Wasser. In der technischen Disziplin müssen die Schwimmer eine Rangfolge von speziellen Bewegungen einhalten
in scheme: mediatopic
created: 2009-10-22T02:00:00+00:00
modified: 2021-02-18T12:00:00+00:00
broader: Synchronschwimmen

Taekwon-Do
type: Concept
definition: Kampfsportart, ursprünglich aus Korea
in scheme: mediatopic
created: 2009-10-22T02:00:00+00:00
modified: 2021-02-18T12:00:00+00:00
broader: Kampfsport

Beachvolleyball
type: Concept
definition: Zwei Teams mit je zwei Spielern spielen auf einem Sandfeld. Anders als beim Volleyball werden nur dann Punkte gemacht, wenn ein Team einen Satz gewinnt oder einen Fehler macht. Der Sanduntergrund macht das Spiel anstrengender als Volleyball
in scheme: mediatopic
created: 2009-10-22T02:00:00+00:00
modified: 2021-02-18T12:00:00+00:00
broader: Volleyball

Clean und Jerk (Gewichtheben)
type: Concept
definition: Die Stange wird zu den Schultern gehoben, dann über den Kopf und dort gehalten während die Beine gestreckt werden
in scheme: mediatopic
created: 2009-10-22T02:00:00+00:00
retired: 2017-07-04T12:00:00+00:00
modified: 2021-07-12T12:00:00+00:00
broader: Gewichtheben

Kraftdreikampf
type: Concept
definition: Kräftemessen, bei dem die Wettkämpfer ein Gewicht so schwer wie möglich heben
in scheme: mediatopic
created: 2009-10-22T02:00:00+00:00
retired: 2017-07-04T12:00:00+00:00
modified: 2021-02-18T12:00:00+00:00
broader: Gewichtheben

Reißen (Gewichtheben)
type: Concept
definition: Die Stange muss vom Boden über den Kopf in einem Zug gehoben werden
in scheme: mediatopic
created: 2009-10-22T02:00:00+00:00
retired: 2017-07-04T12:00:00+00:00
modified: 2021-07-12T12:00:00+00:00
broader: Gewichtheben

Freistil Ringen
type: Concept
definition: Stil bei dem auch das Festhalten der Beine erlaubt ist, d.h. Angriffe auf den ganzen Körper
in scheme: mediatopic
created: 2009-10-22T02:00:00+00:00
modified: 2021-02-18T12:00:00+00:00
broader: Ringen

Griechisch-Römisch
type: Concept
definition: Ein Stil bei dem nur Angriffe zwischen Kopf und Gürtellinie erlaubt sind
in scheme: mediatopic
created: 2009-10-22T02:00:00+00:00
modified: 2021-02-18T12:00:00+00:00
broader: Ringen

Schweizer Ringen
type: Concept
definition: Traditionelle Schweizer Sportart, ähnlich dem Ringen mit speziellen Regeln
in scheme: mediatopic
created: 2009-10-22T02:00:00+00:00
modified: 2021-02-18T12:00:00+00:00
broader: Ringen

Wushu
type: Concept
definition: Grundsätzliche chinesische traditionelle Kampfkunst
in scheme: mediatopic
created: 2009-10-22T02:00:00+00:00
modified: 2021-02-18T12:00:00+00:00
broader: Kampfsport

Doping
type: Concept
definition: Medikamente werden genommen um die Wettbewerbsfähigkeit im Sport zu verbessern
in scheme: mediatopic
created: 2009-10-22T02:00:00+00:00
retired: 2022-09-23T12:00:00+00:00
modified: 2022-09-23T12:00:00+00:00
broader: Doping (allgemein)
broad match: http://cv.iptc.org/newscodes/subjectcode/15000000

Drogentest
type: Concept
definition: Mittel und Wege um den Drogengebrauch im Sport zu überprüfen
in scheme: mediatopic
created: 2009-10-22T02:00:00+00:00
retired: 2022-09-23T12:00:00+00:00
modified: 2022-09-23T12:00:00+00:00
broader: Doping (allgemein)
broad match: http://cv.iptc.org/newscodes/subjectcode/15000000

Medizinisches Doping
type: Concept
definition: Gebrauch von Drogen aus medizinischen Gründen durch Sport Regulatoren gestattet
in scheme: mediatopic
created: 2009-10-22T02:00:00+00:00
retired: 2022-09-23T12:00:00+00:00
modified: 2022-09-23T12:00:00+00:00
broader: Doping (allgemein)
broad match: http://cv.iptc.org/newscodes/subjectcode/15000000

Kontinentale Meisterschaft
type: Concept
definition: Wettkampf, an dem die besten Wettkämpfer oder Teams eines Kontinents teilnehmen. Meisterschaft genannt
in scheme: mediatopic
created: 2009-10-22T02:00:00+00:00
retired: 2021-12-17T12:00:00+00:00
modified: 2021-12-17T12:00:00+00:00
broader: Sportereignis
broad match: http://cv.iptc.org/newscodes/subjectcode/15073028

Kontinentaler Cup
type: Concept
definition: Wettkampf, an dem die besten Wettkämpfer oder Teams eines Kontinents teilnehmen. Cup genannt
in scheme: mediatopic
created: 2009-10-22T02:00:00+00:00
retired: 2021-12-17T12:00:00+00:00
modified: 2021-12-17T12:00:00+00:00
broader: Sportereignis

Kontinentale Spiele
type: Concept
definition: Wettkampf, an dem die besten Wettkämpfer oder Teams eines Kontinents teilnehmen. Spiele genannt
in scheme: mediatopic
created: 2009-10-22T02:00:00+00:00
retired: 2021-12-17T12:00:00+00:00
modified: 2021-12-17T12:00:00+00:00
broader: Sportereignis
broad match: http://cv.iptc.org/newscodes/subjectcode/15073000

Internationale Meisterschaft
type: Concept
definition: Wettkampf, an dem die besten Wettkämpfer und Teams verschiedener Länder teilnehmen. Meisterschaft genannt
in scheme: mediatopic
created: 2009-10-22T02:00:00+00:00
retired: 2021-12-17T12:00:00+00:00
modified: 2021-12-17T12:00:00+00:00
broader: Sportereignis
broad match: http://cv.iptc.org/newscodes/subjectcode/15073000

Internationaler Cup
type: Concept
definition: Wettkampf, an dem die besten Wettkämpfer und Teams verschiedener Länder teilnehmen. Cup genannt
in scheme: mediatopic
created: 2009-10-22T02:00:00+00:00
retired: 2021-12-17T12:00:00+00:00
modified: 2021-12-17T12:00:00+00:00
broader: Sportereignis

Internationale Spiele
type: Concept
definition: Wettkampf, an dem die besten Wettkämpfer und Teams verschiedener Länder teilnehmen. Spiele genannt
in scheme: mediatopic
created: 2009-10-22T02:00:00+00:00
retired: 2021-12-17T12:00:00+00:00
modified: 2021-12-17T12:00:00+00:00
broader: Sportereignis
broad match: http://cv.iptc.org/newscodes/subjectcode/15073000

Nationale Meisterschaft
type: Concept
definition: Wettkampf, an dem die besten Wettkämpfer oder Teams eines Landes teilnehmen. Meisterschaft genannt
in scheme: mediatopic
created: 2009-10-22T02:00:00+00:00
retired: 2021-12-17T12:00:00+00:00
modified: 2021-12-17T12:00:00+00:00
broader: Sportereignis
broad match: http://cv.iptc.org/newscodes/subjectcode/15073000

Nationaler Cup
type: Concept
definition: Wettkampf, an dem die besten Wettkämpfer oder Teams eines Landes teilnehmen. Cup genannt
in scheme: mediatopic
created: 2009-10-22T02:00:00+00:00
retired: 2021-12-17T12:00:00+00:00
modified: 2021-12-17T12:00:00+00:00
broader: Sportereignis

Nationale Spiele
type: Concept
definition: Wettkampf, an dem die besten Wettkämpfer oder Teams eines Landes teilnehmen. Spiele genannt
in scheme: mediatopic
created: 2009-10-22T02:00:00+00:00
retired: 2021-12-17T12:00:00+00:00
modified: 2021-12-17T12:00:00+00:00
broader: Sportereignis
broad match: http://cv.iptc.org/newscodes/subjectcode/15073000

Regionale Meisterschaft
type: Concept
definition: Wettkampf, an dem die besten Wettkämpfer oder Teams einer Region teilnehmen. Meisterschaft genannt
in scheme: mediatopic
created: 2009-10-22T02:00:00+00:00
retired: 2021-12-17T12:00:00+00:00
modified: 2021-12-17T12:00:00+00:00
broader: Sportereignis

Regionaler Cup
type: Concept
definition: Wettkampf, an dem die besten Wettkämpfer oder Teams einer Region teilnehmen. Cup genannt
in scheme: mediatopic
created: 2009-10-22T02:00:00+00:00
retired: 2021-12-17T12:00:00+00:00
modified: 2021-12-17T12:00:00+00:00
broader: Sportereignis

Regionale Spiele
type: Concept
definition: Wettkampf, an dem die besten Wettkämpfer oder Teams einer Region teilnehmen. Spiele genannt
in scheme: mediatopic
created: 2009-10-22T02:00:00+00:00
retired: 2021-12-17T12:00:00+00:00
modified: 2021-12-17T12:00:00+00:00
broader: Sportereignis
broad match: http://cv.iptc.org/newscodes/subjectcode/15073000

Weltmeisterschaft
type: Concept
definition: Wettkampf, an dem die besten Wettkämpfer oder Teams der fünf Kontinente teilnehmen. Meisterschaft genannt
in scheme: mediatopic
created: 2009-10-22T02:00:00+00:00
retired: 2021-12-17T12:00:00+00:00
modified: 2021-12-17T12:00:00+00:00
broader: Sportereignis

Weltcup
type: Concept
definition: Wettkampf, an dem die besten Wettkämpfer oder Teams der fünf Kontinente teilnehmen. Weltcup genannt
in scheme: mediatopic
created: 2009-10-22T02:00:00+00:00
retired: 2021-12-17T12:00:00+00:00
modified: 2021-12-17T12:00:00+00:00
broader: Sportereignis

Weltspiele
type: Concept
definition: Wettkampf, an dem die besten Wettkämpfer oder Teams der fünf Kontinente teilnehmen. Weltspiele genannt
in scheme: mediatopic
created: 2009-10-22T02:00:00+00:00
retired: 2021-12-17T12:00:00+00:00
modified: 2021-12-17T12:00:00+00:00
broader: Sportereignis

Olympische Spiele
type: Concept
definition: Vom Internationalen Olympischen Komitee organisierte Spiele, die alle 4 Jahre im Sommer oder Winter stattfinden.
in scheme: mediatopic
created: 2016-08-24T12:00:00+00:00
modified: 2021-12-17T12:00:00+00:00
broader: Sportereignis

Paralympische Spiele
type: Concept
definition: Vom Internationalen Paralympischen Komitee organisierte Spiele für behinderte Sportler, die alle 4 Jahre im Winter oder Sommer stattfinden
in scheme: mediatopic
created: 2016-08-24T12:00:00+00:00
modified: 2021-12-17T12:00:00+00:00
broader: Sportereignis

Sportsaison
type: Concept
definition: Eine Wettkampfsaison, in der Mannschaften oder Einzelpersonen um einen Platz in der Tabelle oder Rangliste kämpfen
in scheme: mediatopic
created: 2021-12-17T12:00:00+00:00
modified: 2021-12-21T12:00:00+00:00
broader: Sportereignis

Playoffs
type: Concept
definition: Ein Wettbewerbsturnier, das oft nach der regulären Saison einer Sportliga von den besten Teilnehmern ausgetragen wird, um den Meister der Liga oder eine ähnliche Auszeichnung zu ermitteln. Kann sich auch auf ein All-in-Eliminationsturnier beziehen, bei dem ein endgültiger Champion ermittelt wird.
in scheme: mediatopic
created: 2021-12-17T12:00:00+00:00
modified: 2021-12-21T12:00:00+00:00
broader: Sportereignis

Finale
type: Concept
definition: Einzelspiel, in dem der Sieger einer Meisterschaft ermittelt wird, z. B. der Super Bowl oder das Finale der Champions League
in scheme: mediatopic
created: 2021-12-17T12:00:00+00:00
modified: 2021-12-21T12:00:00+00:00
broader: Sportereignis

Messe
type: Concept
definition: Marktplatz zum Ausstellen und Verkaufen von Waren oder Diensten
in scheme: mediatopic
created: 2012-10-04T12:00:00+00:00
modified: 2023-03-31T12:00:00+00:00
broader: Unternehmensdienstleistung

Kaufen (Empfehlung)
type: Concept
definition: Empfehlung eines Analysten, bestimmte Aktien zu kaufen. Kann das Kursziel des Analysten für die Aktie beinhalten.
in scheme: mediatopic
created: 2012-10-04T12:00:00+00:00
retired: 2023-03-31T12:00:00+00:00
modified: 2023-03-31T12:00:00+00:00
broader: Aktienempfehlung

Halten (Empfehlung)
type: Concept
definition: Empfehlung eines Analysten, bestimmte Aktien zu behalten. Kann das Kursziel des Analysten für die Aktie beinhalten.
in scheme: mediatopic
created: 2012-10-04T12:00:00+00:00
retired: 2023-03-31T12:00:00+00:00
modified: 2023-03-31T12:00:00+00:00
broader: Aktienempfehlung

Verkaufen (Empfehlung)
type: Concept
definition: Empfehlung eines Analysten, bestimmte Aktien zu verkaufen. Kann das Kursziel des Analysten für die Aktie beinhalten.
in scheme: mediatopic
created: 2012-10-04T12:00:00+00:00
retired: 2023-03-31T12:00:00+00:00
modified: 2023-03-31T12:00:00+00:00
broader: Aktienempfehlung

Skateboarden
type: Concept
definition: Wettbewerbe mit Stunts und akrobatischen Kunststücken, die auf einem Skateboard unter Verwendung verschiedener Rampen und anderer Hindernisse ausgeführt werden
in scheme: mediatopic
created: 2014-11-07T12:00:00+00:00
modified: 2021-07-12T12:00:00+00:00
broader: Roller-Sport

gemischte Kampfkünste
type: Concept
definition: Ein Vollkontakt-Kampfsport mit Techniken aus verschiedenen Kampfsportarten und Kampfsportarten
in scheme: mediatopic
created: 2019-04-06T12:00:00+00:00
modified: 2021-07-12T12:00:00+00:00
broader: Kampfsport

Krav Maga
type: Concept
definition: Kampf- und Selbstverteidigungssport, der Elemente aus Aikido, Boxen, Judo, Karate und Ringen kombiniert
in scheme: mediatopic
created: 2021-02-18T12:00:00+00:00
modified: 2021-07-12T12:00:00+00:00
broader: Kampfsport

Kickboxen
type: Concept
definition: Stand-up-Kampfsportart, die auf Tritten und Schlägen gegen einen Gegner basiert
in scheme: mediatopic
created: 2021-02-18T12:00:00+00:00
modified: 2021-07-12T12:00:00+00:00
broader: Kampfsport

Sambo
type: Concept
definition: Aus der Sowjetunion stammender Kampfsportstil, der als eine Form des Amateur-Wrestlings anerkannt ist
in scheme: mediatopic
created: 2021-02-18T12:00:00+00:00
modified: 2021-07-12T12:00:00+00:00
broader: Kampfsport

Vermögensverwaltung
type: Concept
definition: Verwaltung von Vermögenswerten oder Fonds zur Erhöhung der Einnahmen durch Investitionen in Aktien, Anleihen, Investmentfonds, Hedge-Fonds usw.
in scheme: mediatopic
created: 2016-04-04T12:00:00+00:00
modified: 2023-03-31T12:00:00+00:00
broader: Finanzdienstleistung

Zahlungsdienst
type: Concept
definition: Dienstleistungen zur Ausführung von Zahlungen, einschließlich Bargeld, Schecks, Kreditkarten, Debitkarten, Lastschriften, elektronischer Geldtransfer, Internet-Banking, elektronische und mobile Zahlungen.
in scheme: mediatopic
created: 2016-04-04T12:00:00+00:00
modified: 2023-03-31T12:00:00+00:00
broader: Unternehmensdienstleistung

medizinische Ausrüstrung
type: Concept
definition: Herstellung von medizinischen und chirurgischen Geräten für Diagnose und Behandlung, wie optische und bildgebende Geräte.
in scheme: mediatopic
created: 2016-04-04T12:00:00+00:00
modified: 2023-03-31T12:00:00+00:00
broader: Gesundheitsindustrie

Influencer
type: Concept
definition: Personen, die Inhalte in Internetforen und sozialen Medien verbreiten und von vielen Menschen verfolgt werden, wodurch sie zum Kauf und zur Nutzung von Produkten beeinflusst werden
in scheme: mediatopic
created: 2019-04-06T12:00:00+00:00
modified: 2021-07-12T12:00:00+00:00
broader: Soziale Medien

Bewegung und Fitness
type: Concept
definition: Körperliche Aktivität mit dem Ziel, Gesundheit und Wohlbefinden zu erhalten und zu verbessern, Ausdauer zu gewinnen oder zum Vergnügen
in scheme: mediatopic
created: 2019-06-26T12:00:00+00:00
modified: 2021-12-17T12:00:00+00:00
broader: Wellness

Heizung und Kühlung
type: Concept
definition: Das Geschäft der Wärme- oder Kälteversorgung von Privatwohnungen und gewerblichen Gebäuden
in scheme: mediatopic
created: 2020-08-05T12:00:00+00:00
modified: 2023-03-31T12:00:00+00:00
broader: Versorgungsunternehmen

Tätowierung
type: Concept
definition: Eine Form der Körpermodifikation, bei der ein Design durch Einbringen von Tinte, Farbstoffen und Pigmenten in die Dermisschicht der Haut hergestellt wird, um das Pigment dauerhaft zu verändern
in scheme: mediatopic
created: 2019-07-30T12:00:00+00:00
modified: 2021-07-12T12:00:00+00:00
broader: Körpermodifikation

Piercing
type: Concept
definition: Eine Form der Körpermodifikation, bei der ein Teil des menschlichen Körpers punktiert oder durchtrennt wird, wodurch eine Öffnung geschaffen wird, in der Schmuck getragen oder ein Implantat eingesetzt werden kann.
in scheme: mediatopic
created: 2019-07-30T12:00:00+00:00
modified: 2021-07-12T12:00:00+00:00
broader: Körpermodifikation

Rekord
type: Concept
definition: Die bisher beste Leistung eines Sportlers in einem bestimmten Bereich
in scheme: mediatopic
created: 2021-02-18T12:00:00+00:00
modified: 2022-09-23T12:00:00+00:00
broader: sportliche Leistung

Medaille
type: Concept
definition: Ehre, die einem Sportler für eine Platzierung in einem sportlichen Wettbewerb, z. B. bei den Olympischen Spielen, zuteil wird
in scheme: mediatopic
created: 2021-02-18T12:00:00+00:00
modified: 2022-09-23T12:00:00+00:00
broader: sportliche Leistung
broad match: Q15229207

sportliche Preise
type: Concept
definition: Anerkennung der Karriere eines Sportlers, wie z. B. die Aufnahme in eine Ruhmeshalle
in scheme: mediatopic
created: 2021-02-18T12:00:00+00:00
modified: 2022-09-23T12:00:00+00:00
broader: sportliche Leistung

Geistiges Wohlbefinden
type: Concept
definition: Das persönliche Streben nach geistiger Gesundheit durch Aktivitäten wie Meditation, Stressabbau, Technologieentgiftung und Tagebuchschreiben
in scheme: mediatopic
created: 2021-12-17T12:00:00+00:00
modified: 2021-12-21T12:00:00+00:00
broader: Wellness

http://cv.iptc.org/newscodes/mediatopic/20001396
type: Concept
in scheme: mediatopic
created: 2026-07-02T12:00:00+00:00
modified: 2026-07-02T12:00:00+00:00
broader: Unternehmensdienstleistung

Kriegsvermisste
type: Concept
definition: Ein Angehöriger der Streitkräfte, der nicht auffindbar ist und dessen Tod nicht bestätigt wurde
in scheme: mediatopic
created: 2024-03-28T12:00:00+00:00
retired: 2024-07-01T12:00:00+00:00
modified: 2024-03-28T12:00:00+00:00
broader: Kriegsopfer