mediatopic
type: ConceptScheme
pref scheme alias: medtop
authority: http://www.iptc.org
rights holder: IPTC, International Press Telecommunications Council - https://iptc.org
licence link: http://creativecommons.org/licenses/by/4.0/
date released: 2025-10-09T12:00:00+00:00
has top concept: kunst, kultur, underholdning og medier
has top concept: kriminalitet, lov og retfærdighed
has top concept: katastrofe, ulykke og nødsituation
has top concept: økonomi, erhvervsliv og finans
has top concept: uddannelse
has top concept: miljø og natur
has top concept: sundhed
has top concept: folk og fæ
has top concept: arbejde
has top concept: livsstil og fritid
has top concept: politik
has top concept: religion og tro
has top concept: videnskab og teknologi
has top concept: samfund
has top concept: sport
has top concept: konflikt, krig og fred
has top concept: vejr

kunst, kultur, underholdning og medier
type: Concept
definition: Kunst, kultur, underholdning og medier.
in scheme: mediatopic
created: 2009-10-22T02:00:00+00:00
modified: 2021-02-18T12:00:00+00:00
narrower: kunst og underholdning
narrower: kultur
narrower: massemedie

kunst og underholdning
type: Concept
definition: Alle former for kunst og underholdning.
in scheme: mediatopic
created: 2009-10-22T02:00:00+00:00
modified: 2021-02-18T12:00:00+00:00
broader: kunst, kultur, underholdning og medier
narrower: animation
narrower: tegneserie
narrower: film
narrower: dans
narrower: mode
narrower: litteratur
narrower: musik
narrower: teater
narrower: visuel kunst
narrower: serie
narrower: festival
broad match: http://cv.iptc.org/newscodes/subjectcode/01000000

kultur
type: Concept
definition: Ideer, skikke, traditioner og kunst for en gruppe mennesker.
in scheme: mediatopic
created: 2009-10-22T02:00:00+00:00
modified: 2021-02-18T12:00:00+00:00
broader: kunst, kultur, underholdning og medier
narrower: kulturhistorie
narrower: skik og tradition
narrower: festlig begivenhed (kultur)
narrower: sprog
narrower: bibliotek og museum
narrower: monument og kulturarv
narrower: udstilling

massemedie
type: Concept
definition: Tekst, lyd og billede sammensat for at blive præsenteret for et større publikum.
in scheme: mediatopic
created: 2009-10-22T02:00:00+00:00
modified: 2021-02-18T12:00:00+00:00
broader: kunst, kultur, underholdning og medier
narrower: nyhedsmedie
narrower: avis
narrower: online medie
narrower: tidssskrift og magasin
narrower: radio
narrower: tv
narrower: socialt medie
narrower: disinformation og misinformation

kriminalitet, lov og retfærdighed
type: Concept
definition: Oprettelse og/eller etablering af samfundets regler, håndhævelsen af disse regler, overtrædelse af reglerne og straf for kriminelle, herunder enkel personer, grupper, organisationer og andre enheder.
in scheme: mediatopic
created: 2009-10-22T02:00:00+00:00
modified: 2021-05-05T12:00:00+00:00
narrower: forbrydelse
narrower: retsvæsen
narrower: retfærdighed
narrower: lov
narrower: retshåndhævelse

forbrydelse
type: Concept
definition: Enkeltpersoner, virksomheder eller organisationer overtræder gældende love.
in scheme: mediatopic
created: 2009-10-22T02:00:00+00:00
modified: 2021-02-18T12:00:00+00:00
broader: kriminalitet, lov og retfærdighed
narrower: folkedrab
narrower: forsætlig brandstiftelse
narrower: overfald
narrower: cyberkriminalitet
narrower: økonomisk kriminalitet
narrower: korruption
narrower: narkokriminalitet
narrower: bedrageri
narrower: kapring
narrower: drab
narrower: kidnapning
narrower: organiseret kriminalitet
narrower: terrorisme
narrower: tyveri
narrower: krigskriminalitet
narrower: færdselsovertrædelser
narrower: menneskesmugling og trafficking
narrower: hærværk
narrower: skyderi
narrower: dyremishandling
narrower: http://cv.iptc.org/newscodes/mediatopic/20001320

retsvæsen
type: Concept
definition: De organer i et samfund, der hjælper med at opretholde loven og straffe dem, der krænker loven.
in scheme: mediatopic
created: 2009-10-22T02:00:00+00:00
modified: 2021-02-18T12:00:00+00:00
broader: kriminalitet, lov og retfærdighed
narrower: domstol
narrower: udenretslig procedure
narrower: retsforfølgelse

retfærdighed
type: Concept
definition: En retfærdig administration af love og regler.
in scheme: mediatopic
created: 2009-10-22T02:00:00+00:00
retired: 2023-10-02T12:00:00+00:00
modified: 2023-10-02T12:00:00+00:00
broader: kriminalitet, lov og retfærdighed

lov
type: Concept
definition: Regler fastlagt af et lands lovgivende myndigheder.
in scheme: mediatopic
created: 2009-10-22T02:00:00+00:00
modified: 2021-02-18T12:00:00+00:00
broader: kriminalitet, lov og retfærdighed
narrower: civilret
narrower: straffelov
narrower: international lov
narrower: Forvaltningsret

retshåndhævelse
type: Concept
definition: Forskellige aktiviteter for at forhindre kriminalitet eller straffe dem, der har begået kriminalitet.
in scheme: mediatopic
created: 2009-10-22T02:00:00+00:00
modified: 2021-02-18T12:00:00+00:00
broader: kriminalitet, lov og retfærdighed
narrower: anholdelse
narrower: efterforskning (kriminel)
narrower: politi
narrower: overvågning

katastrofe, ulykke og nødsituation
type: Concept
definition: Naturlige eller menneskeskabte begivenheder, der forårsager død eller skade på mennesker eller skade på ting og ejendom.
in scheme: mediatopic
created: 2009-10-22T02:00:00+00:00
modified: 2021-05-05T12:00:00+00:00
narrower: ulykke og nødsituation
narrower: katastrofe
narrower: nødsituation
narrower: beredskabsplanlægning
narrower: beredskabsindsats

ulykke og nødsituation
type: Concept
definition: Pludselig uventet hændelser, der forsager konsekvenser eller kræver øjeblikkelig handling for at forhindre alvorlige konsekvenser.
in scheme: mediatopic
created: 2009-10-22T02:00:00+00:00
modified: 2021-02-18T12:00:00+00:00
broader: katastrofe, ulykke og nødsituation
narrower: eksplosionsulykke og -hændelse
narrower: arbejdsulykke
narrower: transportulykke
narrower: konstruktionsulykke
narrower: http://cv.iptc.org/newscodes/mediatopic/20001321

katastrofe
type: Concept
definition: Alvorlig eller pludselig ulykke.
in scheme: mediatopic
created: 2009-10-22T02:00:00+00:00
modified: 2021-02-18T12:00:00+00:00
broader: katastrofe, ulykke og nødsituation
narrower: hungersnød
narrower: ild
narrower: naturkatastrofe

nødsituation
type: Concept
definition: En pludselig, uventet begivenhed, der kræver øjeblikkelig handling for at forhindre alvorlige konsekvenser.
in scheme: mediatopic
created: 2009-10-22T02:00:00+00:00
retired: 2015-08-27T12:00:00+00:00
modified: 2021-12-21T12:00:00+00:00
broader: katastrofe, ulykke og nødsituation
narrower: transporthændelse

beredskabsplanlægning
type: Concept
definition: Planer for aktiviteter, der skal finde sted i pludselige nødsituationer.
in scheme: mediatopic
created: 2009-10-22T02:00:00+00:00
retired: 2019-12-11T12:00:00+00:00
modified: 2021-02-18T12:00:00+00:00
broader: katastrofe, ulykke og nødsituation

beredskabsindsats
type: Concept
definition: Organisationer, der sigter mod at hjælpe mennesker uden mad, vand og ly i pludselige nødsituationer.
in scheme: mediatopic
created: 2009-10-22T02:00:00+00:00
modified: 2021-02-18T12:00:00+00:00
broader: katastrofe, ulykke og nødsituation
broad match: http://cv.iptc.org/newscodes/subjectcode/03012000

økonomi, erhvervsliv og finans
type: Concept
definition: Alt om planlægning, produktion og udveksling af ejendom.
in scheme: mediatopic
created: 2009-10-22T02:00:00+00:00
modified: 2021-07-12T12:00:00+00:00
narrower: virksomhedsinformation
narrower: økonomisk sektor
narrower: økonomi
narrower: erhvervsliv
narrower: marked og børsvæsen

virksomhedsinformation
type: Concept
definition: Oplysninger om individuelle virksomheder, fonde og mere.
in scheme: mediatopic
created: 2009-10-22T02:00:00+00:00
modified: 2021-05-05T12:00:00+00:00
broader: økonomi, erhvervsliv og finans
narrower: virksomhedsfinansiering
narrower: emission
narrower: HR (menneskelige ressourcer)
narrower: strategi og markedsføring
narrower: virksomhedsledelse
narrower: http://cv.iptc.org/newscodes/mediatopic/20001365
narrower: http://cv.iptc.org/newscodes/mediatopic/20001366

økonomisk sektor
type: Concept
definition: Gruppering af økonomiske aktiviteter efter produkt eller service.
in scheme: mediatopic
created: 2009-10-22T02:00:00+00:00
modified: 2023-03-31T12:00:00+00:00
broader: økonomi, erhvervsliv og finans
narrower: landbrug
narrower: fiskeindustri
narrower: skovbrug og træ
narrower: kemikalie
narrower: plast og syntetisk kemikalie
narrower: informationsteknologi
narrower: byggeri og ejendom
narrower: forbrugsvare
narrower: energi og ressourcer
narrower: finans- og servicesektor
narrower: fremstilling og teknik
narrower: medie
narrower: metal og mineral
narrower: procesindustri
narrower: turisme og fritid
narrower: transport
narrower: forsyningsvirksomheder
narrower: salgskanaler
narrower: http://cv.iptc.org/newscodes/mediatopic/20001354
narrower: http://cv.iptc.org/newscodes/mediatopic/20001370
narrower: http://cv.iptc.org/newscodes/mediatopic/20001371
broad match: http://cv.iptc.org/newscodes/subjectcode/04000000

økonomi
type: Concept
definition: Sager relateret til handel og økonomi.
in scheme: mediatopic
created: 2009-10-22T02:00:00+00:00
modified: 2024-03-28T12:00:00+00:00
broader: økonomi, erhvervsliv og finans
narrower: makroøkonomi
narrower: centralbank
narrower: valutakurs
narrower: økonomisk interesseorganisation
narrower: vækstøkonomier
narrower: international økonomisk organisation
narrower: international handel
narrower: pengepolitik
narrower: fond
narrower: deleøkonomi

erhvervsliv
type: Concept
definition: Uafhængige økonomiske organisationer for produktion af varer eller tjenester med fortjeneste.
in scheme: mediatopic
created: 2009-10-22T02:00:00+00:00
modified: 2024-03-28T12:00:00+00:00
broader: økonomi, erhvervsliv og finans
narrower: iværksætteri
narrower: små og mellemstore virksomheder (SMV)
narrower: andelsselskab

marked og børsvæsen
type: Concept
definition: Organiseret handel med aktier, valutaer, råvarer med mere.
in scheme: mediatopic
created: 2009-10-22T02:00:00+00:00
modified: 2024-03-28T12:00:00+00:00
broader: økonomi, erhvervsliv og finans
narrower: råvarebørs
narrower: gældsmarked
narrower: valutamarked
narrower: lånemarked

uddannelse
type: Concept
definition: Alt, hvad angår menneskelig læring fra fødsel til død. Voksenundervisning, videreuddannelse, forældreorganisationer, børnehaver, skoler, lærerforeninger, universiteter osv.
in scheme: mediatopic
created: 2009-10-22T02:00:00+00:00
modified: 2021-09-30T12:00:00+00:00
narrower: forældrebestyrelse
narrower: religiøs undervisning
narrower: skole
narrower: opdragelse
narrower: undervisning og læring
narrower: pensum
narrower: eksamen
narrower: optagelsesprøve
narrower: elev/studerende
narrower: lærer
narrower: erhvervsuddannelse
narrower: karaktergivning
narrower: http://cv.iptc.org/newscodes/mediatopic/20001337

forældrebestyrelse
type: Concept
definition: Gruppe af forældre nedsat for at støtte deres børns uddannelsesaktiviteter.
in scheme: mediatopic
created: 2009-10-22T02:00:00+00:00
modified: 2021-09-30T12:00:00+00:00
broader: uddannelse

religiøs undervisning
type: Concept
definition: Formidling af viden om en religion, som regel, men ikke altid, i skoler, der drives af religiøse organisationer.
in scheme: mediatopic
created: 2009-10-22T02:00:00+00:00
modified: 2021-09-30T12:00:00+00:00
broader: uddannelse

skole
type: Concept
definition: Institution, hvor undervisning foregår.
in scheme: mediatopic
created: 2009-10-22T02:00:00+00:00
modified: 2021-09-30T12:00:00+00:00
broader: uddannelse
narrower: grundskole
narrower: videreuddannelse
narrower: voksenuddannelse
narrower: gymnasium
narrower: videregående uddannelse
narrower: mellemskole
narrower: børnehaveklasse/0. klasse
narrower: religiøs skole
narrower: folkeskole
narrower: privatskole
narrower: uafhængig skole/friskole

opdragelse
type: Concept
definition: At lære sociale kompetencer fra forældre og andre, når man vokser op.
in scheme: mediatopic
created: 2009-10-22T02:00:00+00:00
modified: 2024-07-01T12:00:00+00:00
broader: uddannelse
broad match: http://cv.iptc.org/newscodes/subjectcode/05008000

undervisning og læring
type: Concept
definition: Formidling af viden i organiseret form og på en systematisk måde, især i skolen, og modtagelse af denne formidling.
in scheme: mediatopic
created: 2009-10-22T02:00:00+00:00
retired: 2021-09-30T12:00:00+00:00
modified: 2021-09-30T12:00:00+00:00
broader: uddannelse

pensum
type: Concept
definition: Omfattende instruktioner om skolens uddannelsesindhold, mål og metoder.
in scheme: mediatopic
created: 2009-10-22T02:00:00+00:00
modified: 2021-09-30T12:00:00+00:00
broader: uddannelse

eksamen
type: Concept
definition: Formel høring for at bestemme den studerendes vidensniveau.
in scheme: mediatopic
created: 2009-10-22T02:00:00+00:00
modified: 2021-09-30T12:00:00+00:00
broader: uddannelse
broad match: http://cv.iptc.org/newscodes/subjectcode/05010004

optagelsesprøve
type: Concept
definition: Test for at komme ind på forskellige kurser.
in scheme: mediatopic
created: 2009-10-22T02:00:00+00:00
modified: 2021-09-30T12:00:00+00:00
broader: uddannelse

elev/studerende
type: Concept
definition: Person, der modtager undervisning.
in scheme: mediatopic
created: 2009-10-22T02:00:00+00:00
modified: 2021-09-30T12:00:00+00:00
broader: uddannelse

lærer
type: Concept
definition: Person, der er professionelt engageret i undervisning, mest i skole eller i skolelignende former.
in scheme: mediatopic
created: 2009-10-22T02:00:00+00:00
modified: 2021-09-30T12:00:00+00:00
broader: uddannelse

erhvervsuddannelse
type: Concept
definition: Uddannelse, der er planlagt og implementeret for at give de studerende viden om at kunne udføre et specifikt erhverv direkte.
in scheme: mediatopic
created: 2019-04-06T12:00:00+00:00
modified: 2021-09-30T12:00:00+00:00
broader: uddannelse

karaktergivning
type: Concept
definition: Et mærke eller måling af den studerendes præstation på en prøve, en opgave eller i et bestemt kursus.
in scheme: mediatopic
created: 2019-04-06T12:00:00+00:00
modified: 2021-09-30T12:00:00+00:00
broader: uddannelse

http://cv.iptc.org/newscodes/mediatopic/20001337
type: Concept
in scheme: mediatopic
created: 2021-09-30T12:00:00+00:00
modified: 2021-12-21T12:00:00+00:00
broader: uddannelse

miljø og natur
type: Concept
definition: Alle aspekter af beskyttelse, skader og tilstand på planetens økosystem og dens omgivelser.
in scheme: mediatopic
created: 2009-10-22T02:00:00+00:00
modified: 2025-10-09T12:00:00+00:00
narrower: klimaforandring
narrower: naturbevaring
narrower: forurening
narrower: naturressource
narrower: natur
narrower: http://cv.iptc.org/newscodes/mediatopic/20001374

klimaforandring
type: Concept
definition: Klimaændringer (temperatur, nedbør, vind) på et enkelt sted, i en region eller på jorden som helhed over en længere periode.
in scheme: mediatopic
created: 2009-10-22T02:00:00+00:00
modified: 2025-06-30T12:00:00+00:00
broader: miljø og natur
narrower: global opvarmning

naturbevaring
type: Concept
definition: Forebyggende beskyttelse og pleje af naturen.
in scheme: mediatopic
created: 2009-10-22T02:00:00+00:00
modified: 2025-06-30T12:00:00+00:00
broader: miljø og natur
narrower: energibesparelse
narrower: naturpark og reservat

forurening
type: Concept
definition: Skadeliges stoffers betydning for forringelsen af luft, jord og vand.
in scheme: mediatopic
created: 2009-10-22T02:00:00+00:00
modified: 2025-10-09T12:00:00+00:00
broader: miljø og natur
narrower: luftforurening
narrower: miljøoprensning
narrower: farligt affald
narrower: affald og genanvendelse
narrower: vandforurening

naturressource
type: Concept
definition: Miljøspørgsmål i forbindelse med udnyttelse af naturressourcer.
in scheme: mediatopic
created: 2009-10-22T02:00:00+00:00
modified: 2025-06-30T12:00:00+00:00
broader: miljø og natur
narrower: energiressource
narrower: jordressource
narrower: befolkningstilvækst
narrower: vedvarende energi
narrower: vand

natur
type: Concept
definition: Alt, hvad der har at gøre med den naturlige verden.
in scheme: mediatopic
created: 2009-10-22T02:00:00+00:00
modified: 2025-10-09T12:00:00+00:00
broader: miljø og natur
narrower: skov
narrower: bjerg
narrower: have
narrower: flod og å
narrower: vådområde
narrower: økosystem
narrower: truet art
narrower: invasiv art
narrower: dyr
narrower: plante

http://cv.iptc.org/newscodes/mediatopic/20001374
type: Concept
in scheme: mediatopic
created: 2023-10-02T12:00:00+00:00
modified: 2025-10-09T12:00:00+00:00
broader: miljø og natur

sundhed
type: Concept
definition: Alle aspekter vedrørende levende væseners fysiske og mentale velfærd.
in scheme: mediatopic
created: 2009-10-22T02:00:00+00:00
modified: 2022-06-14T12:00:00+00:00
narrower: sygdom og sygdomstilstand
narrower: sundhedsfacilitet
narrower: sundhedsorganisation
narrower: sundhedsbehandling
narrower: offentlig sygesikring
narrower: privat sygesikring
narrower: privat sundhedspleje
narrower: sundhedspersonale
narrower: ikke-menneskelig sygdom
narrower: http://cv.iptc.org/newscodes/mediatopic/20001358

sygdom og sygdomstilstand
type: Concept
definition: Enhver skadelig eller destruktiv helbredstilstand, der påvirker mennesker.
in scheme: mediatopic
created: 2009-10-22T02:00:00+00:00
modified: 2022-06-14T12:00:00+00:00
broader: sundhed
narrower: kræft
narrower: smitsom sygdom
narrower: hjertekarsygdomme
narrower: øvrig sygdom
narrower: fysisk skade
narrower: medicinsk tilstand
narrower: psykisk og adfærdsmæssig lidelse
narrower: http://cv.iptc.org/newscodes/mediatopic/20001322
narrower: http://cv.iptc.org/newscodes/mediatopic/20001355
broad match: http://cv.iptc.org/newscodes/subjectcode/07001000

sundhedsfacilitet
type: Concept
definition: Faciliteter, der bruges til enhver form for sundhedsydelser.
in scheme: mediatopic
created: 2009-10-22T02:00:00+00:00
modified: 2022-06-14T12:00:00+00:00
broader: sundhed
narrower: hospital
narrower: sundhedsklinik og lægehus
broad match: http://cv.iptc.org/newscodes/subjectcode/07010000

sundhedsorganisation
type: Concept
definition: Specifikke organisationer fokuseret på sundhedsvæsen, såsom patientforeninger, faglige organisationer og internationale grupper.
in scheme: mediatopic
created: 2009-10-22T02:00:00+00:00
modified: 2022-06-14T12:00:00+00:00
broader: sundhed

sundhedsbehandling
type: Concept
definition: Aktiv pleje af mennesker, der lider af sygdom.
in scheme: mediatopic
created: 2009-10-22T02:00:00+00:00
modified: 2022-06-14T12:00:00+00:00
broader: sundhed
narrower: diæt
narrower: medicinsk lægemiddel
narrower: receptpligtig medicin
narrower: medicinsk kontrol og prøve
narrower: medicin
narrower: fysisk kondition
narrower: forebyggende medicin
narrower: vaccine
narrower: terapi
narrower: afvænning
narrower: akut behandling
narrower: kirurgi

offentlig sygesikring
type: Concept
definition: Sundhedspleje leveret af staten.
in scheme: mediatopic
created: 2009-10-22T02:00:00+00:00
modified: 2022-06-14T12:00:00+00:00
broader: sundhed
narrower: sygehjælp
narrower: sundhedsforsikring

privat sygesikring
type: Concept
definition: Privat forsikring, som i tilfælde af sygdom og ulykke giver godtgørelse for omkostninger såsom medicinske udgifter, hospital pleje, operation og mere.
in scheme: mediatopic
created: 2009-10-22T02:00:00+00:00
modified: 2022-06-14T12:00:00+00:00
broader: sundhed

privat sundhedspleje
type: Concept
definition: Sundhedsydelser leveret af privatfinansierede organisationer.
in scheme: mediatopic
created: 2009-10-22T02:00:00+00:00
modified: 2022-06-14T12:00:00+00:00
broader: sundhed

sundhedspersonale
type: Concept
definition: Erhverv, der kræver formel træning i undersøgelsen, diagnose, behandling, pleje og forebyggelse af sygdom, medicinsk tilstand eller skade.
in scheme: mediatopic
created: 2009-10-22T02:00:00+00:00
modified: 2022-06-14T12:00:00+00:00
broader: sundhed
narrower: medicinske støttefunktioner
narrower: medicinsk specialisering
narrower: medicinsk personale
broad match: http://cv.iptc.org/newscodes/subjectcode/07006000

ikke-menneskelig sygdom
type: Concept
definition: Enhver skadelig eller destruktiv helbredstilstand, der påvirker dyr, planter eller mikroorganismer.
in scheme: mediatopic
created: 2009-10-22T02:00:00+00:00
retired: 2022-06-14T12:00:00+00:00
modified: 2022-06-14T12:00:00+00:00
broader: sundhed
broad match: http://cv.iptc.org/newscodes/subjectcode/07001000

http://cv.iptc.org/newscodes/mediatopic/20001358
type: Concept
in scheme: mediatopic
created: 2022-06-14T12:00:00+00:00
modified: 2022-06-14T12:00:00+00:00
broader: sundhed

folk og fæ
type: Concept
definition: Historier om enkeltpersoner, grupper, dyr, planter eller andre genstande med fokus på følelsesmæssige facetter.
in scheme: mediatopic
created: 2009-10-22T02:00:00+00:00
modified: 2021-05-05T12:00:00+00:00
narrower: præstation
narrower: pris og præmie
narrower: rekord
narrower: ceremoni
narrower: personhistorie
narrower: menneskeligt uheld
narrower: overklasse
narrower: berømthed
narrower: jubilæum
narrower: fødselsdag

præstation
type: Concept
definition: Præstationer fra enkeltpersoner eller grupper, dyr, planter eller andre genstande, såsom at vinde en konkurrencepræget konkurrence.
in scheme: mediatopic
created: 2009-10-22T02:00:00+00:00
retired: 2021-05-05T12:00:00+00:00
modified: 2021-05-05T12:00:00+00:00
broader: folk og fæ

pris og præmie
type: Concept
definition: Ære og belønning for en eller anden præstation, herunder dem, der tildeles af staten.
in scheme: mediatopic
created: 2009-10-22T02:00:00+00:00
modified: 2021-05-05T12:00:00+00:00
broader: folk og fæ

rekord
type: Concept
definition: Resultater, der overgår tidligere udført, og som normalt kan angives i antal eller tid, men som ikke er relateret til sport.
in scheme: mediatopic
created: 2009-10-22T02:00:00+00:00
modified: 2021-05-05T12:00:00+00:00
broader: folk og fæ

ceremoni
type: Concept
definition: Ikke-religiøse ritualer såsom kransenedlægning, dåb og lignende.
in scheme: mediatopic
created: 2009-10-22T02:00:00+00:00
modified: 2021-05-05T12:00:00+00:00
broader: folk og fæ
narrower: navngivningsceremoni
narrower: dimission
narrower: begravelse og bisættelse
narrower: bryllup

personhistorie
type: Concept
definition: Personer eller grupper med fokus på følelsesmæssige facetter.
in scheme: mediatopic
created: 2009-10-22T02:00:00+00:00
retired: 2021-05-05T12:00:00+00:00
modified: 2021-02-18T12:00:00+00:00
broader: folk og fæ

menneskeligt uheld
type: Concept
definition: Dum, menneskelig fejl.
in scheme: mediatopic
created: 2009-10-22T02:00:00+00:00
modified: 2021-05-12T12:00:00+00:00
broader: folk og fæ

overklasse
type: Concept
definition: Nyheder om, og beskrivelser af, den højeste klasse i samfundet, især dets sociale liv.
in scheme: mediatopic
created: 2009-10-22T02:00:00+00:00
modified: 2021-05-05T12:00:00+00:00
broader: folk og fæ
narrower: kongelige og kejserlige

berømthed
type: Concept
definition: Nyheder og beskrivelser af berømte mennesker.
in scheme: mediatopic
created: 2009-10-22T02:00:00+00:00
modified: 2021-05-05T12:00:00+00:00
broader: folk og fæ

jubilæum
type: Concept
definition: En fejring af, at der er gået et bestemt antal år siden en bestemt begivenhed fandt sted. Kan både være en rund fødselsdag, en særlig bryllupsdag eller en længere ansættelse.
in scheme: mediatopic
created: 2019-06-26T12:00:00+00:00
modified: 2021-07-12T12:00:00+00:00
broader: folk og fæ

fødselsdag
type: Concept
definition: Årsdagen for, hvornår en person blev født.
in scheme: mediatopic
created: 2019-06-26T12:00:00+00:00
modified: 2021-07-12T12:00:00+00:00
broader: folk og fæ

arbejde
type: Concept
definition: Sociale aspekter, organisationer, regler og betingelser på arbejdsmarkedet.
in scheme: mediatopic
created: 2009-10-22T02:00:00+00:00
modified: 2021-02-18T12:00:00+00:00
narrower: ansættelse
narrower: ansættelseslovgivning
narrower: arbejdsmarked
narrower: overenskomst
narrower: pensionering
narrower: arbejdsløshed
narrower: fagforening

ansættelse
type: Concept
definition: Arbejder for en organisation, et individ eller er selvstændig, herunder frivilligt arbejde.
in scheme: mediatopic
created: 2009-10-22T02:00:00+00:00
modified: 2021-02-18T12:00:00+00:00
broader: arbejde
narrower: pendling
narrower: lærling
narrower: børne- og ungearbejde
narrower: medarbejder
narrower: arbejdsgiver
narrower: jobtræning
narrower: profession og faglighed
narrower: løn og goder
narrower: selvstændig beskæftigelse
narrower: barsels- og forældreorlov
narrower: frivilligt arbejde

ansættelseslovgivning
type: Concept
definition: Juridiske regler, der påvirker forholdet mellem ansatte og arbejdsgivere.
in scheme: mediatopic
created: 2009-10-22T02:00:00+00:00
modified: 2021-02-18T12:00:00+00:00
broader: arbejde
narrower: sundhed og sikkerhed på arbejdspladsen
broad match: http://cv.iptc.org/newscodes/subjectcode/09005000

arbejdsmarked
type: Concept
definition: Marked, hvor arbejdsgivere kræver arbejdskraft mod betaling, og hvor enkeltpersoner tilbyder arbejdskraft til betaling af lønninger.
in scheme: mediatopic
created: 2009-10-22T02:00:00+00:00
modified: 2021-02-18T12:00:00+00:00
broader: arbejde
narrower: tidsbegrænset ansættelse

overenskomst
type: Concept
definition: Forhandlinger mellem arbejdsgivere og arbejdstagere.
in scheme: mediatopic
created: 2009-10-22T02:00:00+00:00
modified: 2021-02-18T12:00:00+00:00
broader: arbejde
narrower: kollektiv aftale
narrower: arbejdskonflikt
broad match: http://cv.iptc.org/newscodes/subjectcode/09012000

pensionering
type: Concept
definition: Årene efter arbejdslivet.
in scheme: mediatopic
created: 2009-10-22T02:00:00+00:00
modified: 2021-02-18T12:00:00+00:00
broader: arbejde
narrower: pension

arbejdsløshed
type: Concept
definition: Når personer der kan arbejde og aktivt søger arbejde, men ikke kan finde arbejde.
in scheme: mediatopic
created: 2009-10-22T02:00:00+00:00
modified: 2021-02-18T12:00:00+00:00
broader: arbejde
narrower: afskedigelse
narrower: arbejdsløshedsunderstøttelse

fagforening
type: Concept
definition: Sammenslutning af arbejdere med henblik på at beskytte deres interesser og udgøre en modpart til arbejdsgivere på lokalt eller nationalt niveau.
in scheme: mediatopic
created: 2009-10-22T02:00:00+00:00
modified: 2021-02-18T12:00:00+00:00
broader: arbejde

livsstil og fritid
type: Concept
definition: Aktiviteter, der udføres til glæde, afslapning eller rekreation uden for lønnet beskæftigelse, herunder spisning og rejse.
in scheme: mediatopic
created: 2009-10-22T02:00:00+00:00
modified: 2021-05-05T12:00:00+00:00
narrower: fritid
narrower: livsstil
narrower: http://cv.iptc.org/newscodes/mediatopic/20001339

fritid
type: Concept
definition: Aktiviteter, der udføres i en persons fritid.
in scheme: mediatopic
created: 2009-10-22T02:00:00+00:00
modified: 2021-02-18T12:00:00+00:00
broader: livsstil og fritid
narrower: klub og forening
narrower: spil
narrower: spil og lotteri
narrower: hobby
narrower: ferie
narrower: underholdningssted
narrower: fritidsaktivitet
narrower: rejse
broad match: http://cv.iptc.org/newscodes/subjectcode/10010000

livsstil
type: Concept
definition: Bevidst valgt måde, at indrette sit liv på som signalerer en bestemt social identitet.
in scheme: mediatopic
created: 2009-10-22T02:00:00+00:00
modified: 2021-02-18T12:00:00+00:00
broader: livsstil og fritid
narrower: økologisk fødevare
narrower: hus og hjem
narrower: trends
narrower: fest
narrower: http://cv.iptc.org/newscodes/mediatopic/20001391
broad match: http://cv.iptc.org/newscodes/subjectcode/10000000

http://cv.iptc.org/newscodes/mediatopic/20001339
type: Concept
in scheme: mediatopic
created: 2021-12-17T12:00:00+00:00
modified: 2021-12-21T12:00:00+00:00
broader: livsstil og fritid
narrower: træning og fitness
narrower: http://cv.iptc.org/newscodes/mediatopic/20001340

politik
type: Concept
definition: Lokal, regional, national og international magtudøvelse såvel som forholdet mellem stater og regeringer. Forsvar, diplomati, valg, hjælpearbejde, flygtninge, regering, parlament, partier, offentligt budget, nationale og internationale aftaler.
in scheme: mediatopic
created: 2009-10-22T02:00:00+00:00
modified: 2025-03-31T12:00:00+00:00
narrower: valg
narrower: regering og Folketing
narrower: regeringspolitik
narrower: international forbindelse
narrower: NGO
narrower: politisk krise
narrower: politisk uoverensstemmelse
narrower: politisk proces

valg
type: Concept
definition: Valg af repræsentanter ved afstemning.
in scheme: mediatopic
created: 2009-10-22T02:00:00+00:00
modified: 2024-09-26T12:00:00+00:00
broader: politik
narrower: borgerforslag
narrower: valgsystem
narrower: mellemstatsligt valg
narrower: lokalvalg
narrower: nationalt valg
narrower: politisk kampagne
narrower: kampagnefinansiering
narrower: politisk kandidat
narrower: primærvalg
narrower: folkeafstemning
narrower: regionalvalg
narrower: afstemning
narrower: kirke- og menighedsrådsvalg
narrower: politisk debatmøde
narrower: http://cv.iptc.org/newscodes/mediatopic/20001380
narrower: http://cv.iptc.org/newscodes/mediatopic/20001381
narrower: http://cv.iptc.org/newscodes/mediatopic/20001382

regering og Folketing
type: Concept
definition: Systemet for styring af et land.
in scheme: mediatopic
created: 2009-10-22T02:00:00+00:00
modified: 2025-03-31T12:00:00+00:00
broader: politik
narrower: offentlig forvaltning
narrower: offentligt ansat
narrower: offentlig embedsmand
narrower: grundlov
narrower: forsvar
narrower: udøvende (regering)
narrower: finanslov
narrower: ministerium
narrower: statsoverhoved
narrower: rigsretssag
narrower: kommune
narrower: minister (regering)
narrower: national regering
narrower: lovgivende parlament
narrower: region
narrower: lobbyvirksomhed
narrower: politisk parti og bevægelse
narrower: politisk udvikling
narrower: politisk system
narrower: styrelse og tilsyn
narrower: politisk kongres eller årsmøde
narrower: politisk udvalg
narrower: regeringschef
narrower: kommission
narrower: partiledelse
narrower: http://cv.iptc.org/newscodes/mediatopic/20001384
narrower: http://cv.iptc.org/newscodes/mediatopic/20001385

regeringspolitik
type: Concept
definition: En overordnet plan eller handlingsforløb, der er fastlagt af en regering, som har til formål at påvirke og lede beslutninger og handlinger mod et ønsket resultat.
in scheme: mediatopic
created: 2009-10-22T02:00:00+00:00
modified: 2025-03-31T12:00:00+00:00
broader: politik
narrower: økonomisk politik
narrower: miljøpolitik
narrower: sundhedspolitik
narrower: borgeres sikkerhed
narrower: skattepolitik
narrower: indenrigspolitik
narrower: IT-sikkerhedspolitik
narrower: bolig- og byplanlægningspolitik
narrower: politik for indfødte
narrower: pensions- og velfærdspolitik
narrower: politik for personlig dataindsamling
narrower: våbenlovgivning
narrower: bygge- og anlægshøring
narrower: migration
narrower: atompolitik
narrower: regulering af industri
narrower: kulturpolitik
narrower: integrationspolitik
narrower: Idrætspolitik
narrower: regional udviklingspolitik
narrower: infrastrukturpolitik
narrower: lokalt selvstyre
narrower: http://cv.iptc.org/newscodes/mediatopic/20001338
narrower: http://cv.iptc.org/newscodes/mediatopic/20001383
broad match: http://cv.iptc.org/newscodes/subjectcode/11006000

international forbindelse
type: Concept
definition: Ikke-voldelige forhold mellem nationer gennem forhandling, traktat, diplomati eller personlige møder.
in scheme: mediatopic
created: 2009-10-22T02:00:00+00:00
modified: 2025-03-31T12:00:00+00:00
broader: politik
narrower: diplomati
narrower: økonomisk sanktion
narrower: udviklingsbistand
narrower: international organisation
narrower: flygtning og internt fordrevet
narrower: grænsestridigheder

NGO
type: Concept
definition: Udpegning af alle ikke-statslige organisationer, såsom forskellige individuelle organisationer, aktionsgrupper, meningsgrupper, frivillige organisationer eller fagforeninger.
in scheme: mediatopic
created: 2009-10-22T02:00:00+00:00
modified: 2025-03-31T12:00:00+00:00
broader: politik

politisk krise
type: Concept
definition: Konflikter, som når niveauer, hvor regeringer kan afsættes.
in scheme: mediatopic
created: 2009-10-22T02:00:00+00:00
retired: 2025-03-31T12:00:00+00:00
modified: 2025-03-31T12:00:00+00:00
broader: politik
broad match: http://cv.iptc.org/newscodes/subjectcode/16011000

politisk uoverensstemmelse
type: Concept
definition: Personer med udtalelser, der afviger fra det gældende eller officielt gældende.
in scheme: mediatopic
created: 2009-10-22T02:00:00+00:00
modified: 2025-03-31T12:00:00+00:00
broader: politik

politisk proces
type: Concept
definition: Deltagelse i driften af en regering, stat eller politisk parti.
in scheme: mediatopic
created: 2009-10-22T02:00:00+00:00
retired: 2025-03-31T12:00:00+00:00
modified: 2025-03-31T12:00:00+00:00
broader: politik

religion og tro
type: Concept
definition: Alle aspekter af menneskelig eksistens, der involverer teologi, filosofi, etik og spiritualitet.
in scheme: mediatopic
created: 2009-10-22T02:00:00+00:00
modified: 2021-12-21T12:00:00+00:00
narrower: religiøs overbevisning
narrower: interreligiøs dialog
narrower: religiøs konflikt
narrower: religiøs begivenhed
narrower: religiøs helligdag og fest
narrower: religiøst ritual
narrower: religiøs facilitet
narrower: stat og religion
narrower: religiøs leder
narrower: religiøs tekst

religiøs overbevisning
type: Concept
definition: Religiøst bestemt livsholdning og fortolkning af livet.
in scheme: mediatopic
created: 2009-10-22T02:00:00+00:00
modified: 2021-12-21T12:00:00+00:00
broader: religion og tro
narrower: buddhisme
narrower: kristendom/folkekirke
narrower: konfucianisme
narrower: kult og sekt
narrower: frimureri
narrower: hinduisme
narrower: islam
narrower: jainisme
narrower: jødedom
narrower: naturreligion
narrower: zoroastrianisme
narrower: Scientology
narrower: shintoisme
narrower: sikhisme
narrower: taoisme
narrower: Moon-bevægelsen
narrower: http://cv.iptc.org/newscodes/mediatopic/20001349

interreligiøs dialog
type: Concept
definition: Alle former for kommunikation mellem forskellige religioner.
in scheme: mediatopic
created: 2009-10-22T02:00:00+00:00
retired: 2021-12-17T12:00:00+00:00
modified: 2021-02-18T12:00:00+00:00
broader: religion og tro

religiøs konflikt
type: Concept
definition: Konflikter, der involverer religiøse forskelle.
in scheme: mediatopic
created: 2009-10-22T02:00:00+00:00
modified: 2021-02-18T12:00:00+00:00
broader: religion og tro

religiøs begivenhed
type: Concept
definition: Begivenheder, der påvirker en religion, men ikke religiøse fester.
in scheme: mediatopic
created: 2009-10-22T02:00:00+00:00
retired: 2021-12-17T12:00:00+00:00
modified: 2021-07-12T12:00:00+00:00
broader: religion og tro

religiøs helligdag og fest
type: Concept
definition: Hellig eller højtidelig dag inden for en religion, som undertiden også er en helligdag.
in scheme: mediatopic
created: 2009-10-22T02:00:00+00:00
modified: 2021-12-17T12:00:00+00:00
broader: religion og tro
narrower: jul
narrower: påske
narrower: pinse
narrower: ramadan
narrower: yom kippur
narrower: allehelgensdag
narrower: valborgsaften
narrower: http://cv.iptc.org/newscodes/mediatopic/20001350
narrower: http://cv.iptc.org/newscodes/mediatopic/20001352

religiøst ritual
type: Concept
definition: Etablerede religiøse ritualer, såsom messe, dåb og bønnemøder.
in scheme: mediatopic
created: 2009-10-22T02:00:00+00:00
modified: 2021-12-17T12:00:00+00:00
broader: religion og tro
narrower: dåb
narrower: http://cv.iptc.org/newscodes/mediatopic/20001345
narrower: http://cv.iptc.org/newscodes/mediatopic/20001346

religiøs facilitet
type: Concept
definition: Enhver facilitet, hvor en gruppe kan udføre sine religiøse ritualer, hvad enten det er en moske, en kirke, et hus eller et telt.
in scheme: mediatopic
created: 2009-10-22T02:00:00+00:00
modified: 2021-12-17T12:00:00+00:00
broader: religion og tro
narrower: kirke
narrower: moské
narrower: synagoge
narrower: tempel
broad match: http://cv.iptc.org/newscodes/subjectcode/12000000

stat og religion
type: Concept
definition: Den juridiske og sociale fordeling mellem religiøse institutioner og statsanliggender.
in scheme: mediatopic
created: 2009-10-22T02:00:00+00:00
modified: 2024-07-01T12:00:00+00:00
broader: religion og tro

religiøs leder
type: Concept
definition: Person eller personer, der har en rituel, juridisk eller på anden måde førende rolle i deres respektive kirke eller religion.
in scheme: mediatopic
created: 2009-10-22T02:00:00+00:00
modified: 2021-02-18T12:00:00+00:00
broader: religion og tro
narrower: pave

religiøs tekst
type: Concept
definition: Skrifterne er hellige eller vigtige for en kirke eller religion.
in scheme: mediatopic
created: 2009-10-22T02:00:00+00:00
modified: 2021-12-17T12:00:00+00:00
broader: religion og tro
narrower: Bibel
narrower: Koran
narrower: Tora

videnskab og teknologi
type: Concept
definition: Alle aspekter, der vedrører menneskelig forståelse af, såvel som metodologisk undersøgelse og forskning i natur-, formel- og samfundsvidenskab, såsom astronomi, sprogvidenskab eller økonomi.
in scheme: mediatopic
created: 2009-10-22T02:00:00+00:00
modified: 2021-02-18T12:00:00+00:00
narrower: biomedicinsk videnskab
narrower: matematik
narrower: naturvidenskab
narrower: videnskabelig undersøgelse
narrower: videnskabelig institution
narrower: samfundsvidenskab
narrower: videnskabelig standard
narrower: teknologi og teknik

biomedicinsk videnskab
type: Concept
definition: Anvendelse af biologibaseret forskning inden for medicinske områder, såsom forskning, kontrol af sundhedsmæssige tilstande eller medicinsk behandling.
in scheme: mediatopic
created: 2009-10-22T02:00:00+00:00
modified: 2021-02-18T12:00:00+00:00
broader: videnskab og teknologi
narrower: bioteknologi
broad match: http://cv.iptc.org/newscodes/subjectcode/13019000

matematik
type: Concept
definition: Undersøgelse af struktur, rum, ændring og antal i abstrakt, ofte ved hjælp af symbolisk logik og sprog, og inkluderer emner som geometri, algebra eller trigonometri.
in scheme: mediatopic
created: 2009-10-22T02:00:00+00:00
modified: 2021-02-18T12:00:00+00:00
broader: videnskab og teknologi

naturvidenskab
type: Concept
definition: De videnskaber, der beskæftiger sig med stof, energi og den fysiske verden, herunder fysik, biologi, kemi og astronomi.
in scheme: mediatopic
created: 2009-10-22T02:00:00+00:00
modified: 2021-02-18T12:00:00+00:00
broader: videnskab og teknologi
narrower: astronomi
narrower: biologi
narrower: kemi
narrower: kosmologi
narrower: geologi
narrower: havebrug
narrower: marinevidenskab
narrower: meteorologi
narrower: fysik

videnskabelig undersøgelse
type: Concept
definition: Proces, der gennem systematisk arbejde kan producere ny viden og øget viden.
in scheme: mediatopic
created: 2009-10-22T02:00:00+00:00
modified: 2021-02-18T12:00:00+00:00
broader: videnskab og teknologi
narrower: videnskabelig innovation
narrower: medicinsk forskning
narrower: videnskabelig ekspedition
narrower: videnskabelig publikation

videnskabelig institution
type: Concept
definition: Institutioner, der udfører eller forvalter videnskabeligt arbejde.
in scheme: mediatopic
created: 2009-10-22T02:00:00+00:00
modified: 2021-02-18T12:00:00+00:00
broader: videnskab og teknologi

samfundsvidenskab
type: Concept
definition: Videnskaben af det menneskelige samfund i aspekter som sprogvidenskab, antropologi, økonomi eller sociologi.
in scheme: mediatopic
created: 2009-10-22T02:00:00+00:00
modified: 2021-02-18T12:00:00+00:00
broader: videnskab og teknologi
narrower: antropologi
narrower: arkæologi
narrower: økonomi (videnskab)
narrower: geografi
narrower: historie
narrower: informationsvidenskab
narrower: jura
narrower: lingvistik
narrower: filosofi
narrower: statskundskab
narrower: psykologi
narrower: sociologi

videnskabelig standard
type: Concept
definition: Nationale eller internationale regler for videnskabelige og tekniske undersøgelser og udvikling, såsom kalibreringsstandarder for videnskabelige instrumenter.
in scheme: mediatopic
created: 2009-10-22T02:00:00+00:00
modified: 2021-02-18T12:00:00+00:00
broader: videnskab og teknologi

teknologi og teknik
type: Concept
definition: Undersøgelse og anvendelse af industrielle eller anvendte videnskaber såsom teknisk fysik, hydrodynamik og termodynamik.
in scheme: mediatopic
created: 2009-10-22T02:00:00+00:00
modified: 2021-02-18T12:00:00+00:00
broader: videnskab og teknologi
narrower: maskiningeniør
narrower: luftfartsteknologi
narrower: landbrugsteknologi
narrower: ingeniørvidenskab
narrower: elektronikteknik
narrower: identifikationsteknologi
narrower: informationsteknologi og datalogi
narrower: materialevidenskab
narrower: mikrovidenskab
broad match: http://cv.iptc.org/newscodes/subjectcode/13000000

samfund
type: Concept
definition: Aspekter af menneskers liv, der påvirker dets forhold.
in scheme: mediatopic
created: 2009-10-22T02:00:00+00:00
modified: 2021-02-18T12:00:00+00:00
narrower: grundlæggende rettighed
narrower: fællesskab
narrower: demografi
narrower: indvandring
narrower: emigrant
narrower: forskelsbehandling
narrower: familie
narrower: befolkningsgrupper
narrower: sociale forhold
narrower: socialt problem
narrower: værdier
narrower: socialhjælp
narrower: http://cv.iptc.org/newscodes/mediatopic/20001373

grundlæggende rettighed
type: Concept
definition: Politiske, sociale og økonomiske rettigheder, som alle har ret til i henhold til loven.
in scheme: mediatopic
created: 2009-10-22T02:00:00+00:00
modified: 2024-09-26T12:00:00+00:00
broader: samfund
narrower: borgerrettighed
narrower: censur
narrower: religionsfrihed
narrower: pressefrihed
narrower: menneskerettighed
narrower: privatliv
narrower: http://cv.iptc.org/newscodes/mediatopic/20001326
broad match: http://cv.iptc.org/newscodes/subjectcode/02007000

fællesskab
type: Concept
definition: En gruppe individer, der aktivt deler en fælles værdi eller interesse.
in scheme: mediatopic
created: 2009-10-22T02:00:00+00:00
modified: 2021-02-18T12:00:00+00:00
broader: samfund
narrower: socialt netværk
narrower: http://cv.iptc.org/newscodes/mediatopic/20001360
broad match: http://cv.iptc.org/newscodes/subjectcode/14024000

demografi
type: Concept
definition: Undersøgelsen af mennesker, og hvor de bor, og hvordan de interagerer.
in scheme: mediatopic
created: 2009-10-22T02:00:00+00:00
modified: 2021-02-18T12:00:00+00:00
broader: samfund
narrower: befolkning og folketælling

indvandring
type: Concept
definition: Bevægelse af enkeltpersoner fra det ene land til det andet.
in scheme: mediatopic
created: 2009-10-22T02:00:00+00:00
modified: 2021-02-18T12:00:00+00:00
broader: samfund
narrower: illegal indvandrer

emigrant
type: Concept
definition: Mennesker, der forlader deres oprindelsesland, deres forhold til deres oprindelsesland og deres tilknytning til andre emigranter.
in scheme: mediatopic
created: 2009-10-22T02:00:00+00:00
modified: 2021-07-12T12:00:00+00:00
broader: samfund

forskelsbehandling
type: Concept
definition: Skadelige holdninger en eller flere mennesker på grund af race, farve, seksuel identitet, religion eller politisk tro.
in scheme: mediatopic
created: 2009-10-22T02:00:00+00:00
modified: 2021-02-18T12:00:00+00:00
broader: samfund
narrower: aldersdiskrimination
narrower: racisme
narrower: religiøs diskrimination
narrower: sexisme

familie
type: Concept
definition: En gruppe af personer, der er forbundet via blod eller via ægteskab.
in scheme: mediatopic
created: 2009-10-22T02:00:00+00:00
modified: 2021-02-18T12:00:00+00:00
broader: samfund
narrower: adoption
narrower: frieri
narrower: skilsmisse
narrower: familieplanlægning
narrower: ægteskab
narrower: forælder og barn
narrower: http://cv.iptc.org/newscodes/mediatopic/20001359

befolkningsgrupper
type: Concept
definition: Sammenfatning af alle mennesker gennem alle tidspunkter eller på et givet tidspunkt.
in scheme: mediatopic
created: 2009-10-22T02:00:00+00:00
modified: 2025-06-30T12:00:00+00:00
broader: samfund
narrower: voksen
narrower: barn
narrower: handicap
narrower: LGBT+
narrower: køn
narrower: spædbarn
narrower: national eller etnisk minoritet
narrower: offer for nuklear stråling
narrower: ældre
narrower: teenager
narrower: oprindeligt folk
narrower: http://cv.iptc.org/newscodes/mediatopic/20001327
narrower: http://cv.iptc.org/newscodes/mediatopic/20001328

sociale forhold
type: Concept
definition: Forhold, under hvilke mennesker lever, med hensyn til bolig, vandforsyning, tilgængelighed af uddannelse.
in scheme: mediatopic
created: 2009-10-22T02:00:00+00:00
modified: 2021-05-05T12:00:00+00:00
broader: samfund
narrower: hjemløshed
narrower: fattigdom

socialt problem
type: Concept
definition: Mangler i levevilkårene for en befolkning, der berører så mange mennesker, at staten eller individuelle organisationer må gribe ind.
in scheme: mediatopic
created: 2009-10-22T02:00:00+00:00
modified: 2021-02-18T12:00:00+00:00
broader: samfund
narrower: stødende eller krænkende opførsel
narrower: afhængighed og misbrug
narrower: ungdomskriminalitet
narrower: prostitution
narrower: slaveri
narrower: sexchikane
narrower: mobning
broad match: http://cv.iptc.org/newscodes/subjectcode/14025002

værdier
type: Concept
definition: Niveauer af adfærd og dets accept af samfundet.
in scheme: mediatopic
created: 2009-10-22T02:00:00+00:00
modified: 2021-02-18T12:00:00+00:00
broader: samfund
narrower: korrupt praksis
narrower: død og døende
narrower: etik
narrower: pornografi
narrower: seksuel adfærd

socialhjælp
type: Concept
definition: Hjælp til dem, der har behov for mad, bolig, sundhed og andre tjenester.
in scheme: mediatopic
created: 2009-10-22T02:00:00+00:00
modified: 2021-02-18T12:00:00+00:00
broader: samfund
narrower: velgørenhed
narrower: langvarig pleje
narrower: social ydelse
narrower: ældrepleje
narrower: socialt byggeri
narrower: børneinstitution

http://cv.iptc.org/newscodes/mediatopic/20001373
type: Concept
in scheme: mediatopic
created: 2023-03-31T12:00:00+00:00
modified: 2023-03-31T12:00:00+00:00
broader: samfund

sport
type: Concept
definition: Konkurrencedygtig aktivitet eller færdighed, der involverer fysisk og/eller mental indsats og organisationer og organer, der er involveret i disse aktiviteter.
in scheme: mediatopic
created: 2009-10-22T02:00:00+00:00
modified: 2021-02-18T12:00:00+00:00
narrower: sportsgren
narrower: disciplinær handling i sport
narrower: stofbrug i sport
narrower: sportsbegivenhed
narrower: sportindustri
narrower: sports -og idrætsorganisation
narrower: sportsarena
narrower: transfermarked
narrower: sportspræstation
narrower: http://cv.iptc.org/newscodes/mediatopic/20001323
narrower: http://cv.iptc.org/newscodes/mediatopic/20001324
narrower: http://cv.iptc.org/newscodes/mediatopic/20001325

sportsgren
type: Concept
definition: Forskellige sportsgrene, der kan udføres i konkurrencer.
in scheme: mediatopic
created: 2009-10-22T02:00:00+00:00
modified: 2021-02-18T12:00:00+00:00
broader: sport
narrower: amerikansk fodbold
narrower: bueskydning
narrower: atletik
narrower: australsk fodbold
narrower: badminton
narrower: bandy
narrower: baseball
narrower: basketball
narrower: skiskydning
narrower: billard
narrower: bobslæde
narrower: bowls og petanque
narrower: boksning
narrower: tyrefægtning
narrower: canadisk fodbold
narrower: kano
narrower: fiskekonkurrence
narrower: bjergklatring
narrower: sportsklatring
narrower: cricket
narrower: kroket
narrower: curling
narrower: cykelsport
narrower: sportsdans
narrower: dart
narrower: udspring
narrower: sportsdykning
narrower: hundeløb
narrower: duathlon
narrower: ridesport
narrower: fægtning
narrower: hockey
narrower: kunstskøjteløb
narrower: fistball
narrower: floorball
narrower: frisbee
narrower: gælisk fodbold
narrower: golf
narrower: gymnastik
narrower: håndbold
narrower: hornuss
narrower: hestevæddeløb
narrower: hurling
narrower: ishockey
narrower: rulleskøjteløb
narrower: jai alai (pelota)
narrower: kabaddi
narrower: kajak
narrower: lacrosse
narrower: kælk
narrower: maratonløb
narrower: moderne femkamp
narrower: motorbådssport
narrower: motorløb
narrower: motorcykelsport
narrower: netbold
narrower: orienteringsløb
narrower: faldskærmsudspring
narrower: polo
narrower: pool
narrower: powerboating
narrower: rodeo
narrower: roning
narrower: sejlsport
narrower: sepak takraw
narrower: shinty
narrower: skydning
narrower: skeleton
narrower: skiløb
narrower: faldskærmsudspring (frit fald)
narrower: snooker
narrower: snowboarding
narrower: fodbold

disciplinær handling i sport
type: Concept
definition: Foranstaltninger, såsom bøder og suspensioner, idømt af sportsorganisationer eller sportshold.
in scheme: mediatopic
created: 2009-10-22T02:00:00+00:00
modified: 2021-02-18T12:00:00+00:00
broader: sport

stofbrug i sport
type: Concept
definition: Brug af stoffer i sport.
in scheme: mediatopic
created: 2009-10-22T02:00:00+00:00
modified: 2022-09-23T12:00:00+00:00
broader: sport
narrower: doping
narrower: dopingtest
narrower: medicinsk stofbrug i sport
broad match: http://cv.iptc.org/newscodes/subjectcode/15000000

sportsbegivenhed
type: Concept
definition: Et arrangement med en eller flere sportskonkurrencer.
in scheme: mediatopic
created: 2009-10-22T02:00:00+00:00
modified: 2021-07-12T12:00:00+00:00
broader: sport
narrower: kontinentalt mesterskab (EM)
narrower: kontinental pokalturnering
narrower: kontinentale lege
narrower: internationalt mesterskab
narrower: international pokal
narrower: internationale lege
narrower: nationalt mesterskab
narrower: national pokalturnering
narrower: nationale lege
narrower: regionalt mesterskab
narrower: regional pokal
narrower: regionale lege
narrower: verdensmesterskab
narrower: World Cup
narrower: verdenslege
narrower: Olympiske Lege (OL)
narrower: Paralympiske Lege
narrower: http://cv.iptc.org/newscodes/mediatopic/20001341
narrower: http://cv.iptc.org/newscodes/mediatopic/20001342
narrower: http://cv.iptc.org/newscodes/mediatopic/20001343

sportindustri
type: Concept
definition: Sport som forretning.
in scheme: mediatopic
created: 2009-10-22T02:00:00+00:00
modified: 2021-02-18T12:00:00+00:00
broader: sport
broad match: http://cv.iptc.org/newscodes/subjectcode/15000000

sports -og idrætsorganisation
type: Concept
definition: Organisationer eller foreninger, der beskæftiger sig med sport.
in scheme: mediatopic
created: 2009-10-22T02:00:00+00:00
modified: 2023-10-02T12:00:00+00:00
broader: sport

sportsarena
type: Concept
definition: Kommerciel facilitet til sportsbegivenhed.
in scheme: mediatopic
created: 2009-10-22T02:00:00+00:00
modified: 2021-03-31T12:00:00+00:00
broader: sport
broad match: http://cv.iptc.org/newscodes/subjectcode/15000000

transfermarked
type: Concept
definition: Markedet, hvor spillerne skifter fra et hold til et andet.
in scheme: mediatopic
created: 2012-10-04T12:00:00+00:00
modified: 2021-07-12T12:00:00+00:00
broader: sport

sportspræstation
type: Concept
definition: Rekord eller milepæl, som en atlet eller et hold har nået.
in scheme: mediatopic
created: 2021-02-18T12:00:00+00:00
modified: 2021-07-12T12:00:00+00:00
broader: sport
narrower: sportsrekord
narrower: sportsmedalje
narrower: sportskåring

http://cv.iptc.org/newscodes/mediatopic/20001323
type: Concept
in scheme: mediatopic
created: 2021-05-05T12:00:00+00:00
modified: 2021-12-21T12:00:00+00:00
broader: sport

http://cv.iptc.org/newscodes/mediatopic/20001324
type: Concept
in scheme: mediatopic
created: 2021-05-05T12:00:00+00:00
modified: 2021-12-21T12:00:00+00:00
broader: sport

http://cv.iptc.org/newscodes/mediatopic/20001325
type: Concept
in scheme: mediatopic
created: 2021-05-05T12:00:00+00:00
modified: 2024-03-28T12:00:00+00:00
broader: sport

konflikt, krig og fred
type: Concept
definition: Socialt eller politisk motiverede protester og/eller voldshandlinger. Terrorisme, væbnede konflikter, social uro, statskup, guerillaaktiviteter, massakrer, optøjer, voldelige demonstrationer og krig, såvel som fredsinitiativer.
in scheme: mediatopic
created: 2009-10-22T02:00:00+00:00
modified: 2021-02-18T12:00:00+00:00
narrower: terrorhandling
narrower: væbnet konflikt
narrower: civil urolighed
narrower: statskup
narrower: massakre
narrower: fredsproces
narrower: genopbygning efter krig
narrower: http://cv.iptc.org/newscodes/mediatopic/20001361
narrower: http://cv.iptc.org/newscodes/mediatopic/20001377
broad match: http://cv.iptc.org/newscodes/subjectcode/16000000

terrorhandling
type: Concept
definition: Organiserede voldshandlinger, der fremkalder frygt og rædsel i befolkningen, ofte udført til politiske formål og af mindre grupper.
in scheme: mediatopic
created: 2009-10-22T02:00:00+00:00
modified: 2021-02-18T12:00:00+00:00
broader: konflikt, krig og fred
narrower: bioterrorisme
narrower: bombning

væbnet konflikt
type: Concept
definition: Tvister mellem væbnede tropper, ikke nødvendigvis formelle krige.
in scheme: mediatopic
created: 2009-10-22T02:00:00+00:00
modified: 2021-02-18T12:00:00+00:00
broader: konflikt, krig og fred
narrower: guerillaaktivitet
narrower: international militær indgriben
narrower: militær besættelse
narrower: krig

civil urolighed
type: Concept
definition: Uro blandt befolkningen, der kommer til udtryk ved strejker, oprør, demonstrationer eller sabotage.
in scheme: mediatopic
created: 2009-10-22T02:00:00+00:00
modified: 2021-02-18T12:00:00+00:00
broader: konflikt, krig og fred
narrower: demonstration
narrower: oprør
narrower: revolution
narrower: optøjer

statskup
type: Concept
definition: Omstyrtning af en etableret regering af en organiseret militær eller politisk gruppe.
in scheme: mediatopic
created: 2009-10-22T02:00:00+00:00
modified: 2021-02-18T12:00:00+00:00
broader: konflikt, krig og fred

massakre
type: Concept
definition: Massedrab på mennesker, ofte civile, under krig eller konflikt
in scheme: mediatopic
created: 2009-10-22T02:00:00+00:00
modified: 2021-02-18T12:00:00+00:00
broader: konflikt, krig og fred

fredsproces
type: Concept
definition: Foranstaltninger til afslutning af en krig eller konflikt, ofte gennem fredsforhandlinger eller -aftaler.
in scheme: mediatopic
created: 2009-10-22T02:00:00+00:00
modified: 2021-02-18T12:00:00+00:00
broader: konflikt, krig og fred
narrower: fredsbevarende styrke
narrower: fredsmægler
narrower: fredsplan
narrower: fredsforhandling
narrower: nedrustning
broad match: http://cv.iptc.org/newscodes/subjectcode/11002003

genopbygning efter krig
type: Concept
definition: Foranstaltninger til at genoprette samfundet, økonomien og det politiske system i et krigshærget område.
in scheme: mediatopic
created: 2009-10-22T02:00:00+00:00
modified: 2021-02-18T12:00:00+00:00
broader: konflikt, krig og fred
narrower: ammunitionsrydning
broad match: http://cv.iptc.org/newscodes/subjectcode/11002000

http://cv.iptc.org/newscodes/mediatopic/20001361
type: Concept
in scheme: mediatopic
created: 2022-09-23T12:00:00+00:00
modified: 2022-09-23T12:00:00+00:00
broader: konflikt, krig og fred

http://cv.iptc.org/newscodes/mediatopic/20001377
type: Concept
in scheme: mediatopic
created: 2024-03-28T12:00:00+00:00
modified: 2024-03-28T12:00:00+00:00
broader: konflikt, krig og fred
narrower: savnet i kamp
narrower: krigsfange
narrower: http://cv.iptc.org/newscodes/mediatopic/20001378

vejr
type: Concept
definition: Undersøgelse, forudsigelse og rapportering af meteorologiske fænomener.
in scheme: mediatopic
created: 2009-10-22T02:00:00+00:00
modified: 2021-02-18T12:00:00+00:00
narrower: vejrudsigt
narrower: vejrfænomen
narrower: vejrstatistik
narrower: vejrvarsel

vejrudsigt
type: Concept
definition: Den langsigtede eller kortvarige meteorologiske forudsigelse og rapportering af det kommende vejr for en given region.
in scheme: mediatopic
created: 2009-10-22T02:00:00+00:00
modified: 2021-02-18T12:00:00+00:00
broader: vejr

vejrfænomen
type: Concept
definition: Kort- eller langvarige meteorologiske fænomener, der er værd at undersøge, rapportere eller offentlig rådgivning, såsom klimaændringer, storme, hedebølge eller tornadoer.
in scheme: mediatopic
created: 2009-10-22T02:00:00+00:00
modified: 2021-05-05T12:00:00+00:00
broader: vejr
broad match: http://cv.iptc.org/newscodes/subjectcode/17003001

vejrstatistik
type: Concept
definition: Numeriske fakta om vejret som temperatur, barometrisk tryk, flodniveauer, fugtighed eller høj og lavvande.
in scheme: mediatopic
created: 2009-10-22T02:00:00+00:00
modified: 2021-02-18T12:00:00+00:00
broader: vejr

vejrvarsel
type: Concept
definition: Underretninger udsendt til offentligheden om hårdt eller bemærkelsesværdigt vejr i deres område.
in scheme: mediatopic
created: 2009-10-22T02:00:00+00:00
modified: 2021-02-18T12:00:00+00:00
broader: vejr

animation
type: Concept
definition: Historier fortalt gennem animerede tegninger eller computergrafik.
in scheme: mediatopic
created: 2009-10-22T02:00:00+00:00
modified: 2021-03-15T12:00:00+00:00
broader: kunst og underholdning

tegneserie
type: Concept
definition: Tegninger, både som underholding og redaktionelle tegninger, der kan bruge humor eller satire.
in scheme: mediatopic
created: 2009-10-22T02:00:00+00:00
modified: 2021-02-18T12:00:00+00:00
broader: kunst og underholdning

film
type: Concept
definition: Historier fortalt gennem film, herunder fiktion og dokumentar.
in scheme: mediatopic
created: 2009-10-22T02:00:00+00:00
modified: 2021-02-18T12:00:00+00:00
broader: kunst og underholdning

dans
type: Concept
definition: Mennesker, der bevæger sig i rytmisk og udtrykker en følelse, eller formidler et budskab
in scheme: mediatopic
created: 2009-10-22T02:00:00+00:00
modified: 2021-02-18T12:00:00+00:00
broader: kunst og underholdning
narrower: ballet
narrower: moderne dans
narrower: traditionel dans

mode
type: Concept
definition: Stil og trends inden for tøj, fodtøj, tilbehør, herunder design og præsentation.
in scheme: mediatopic
created: 2009-10-22T02:00:00+00:00
modified: 2021-02-18T12:00:00+00:00
broader: kunst og underholdning
narrower: smykke
narrower: kosmetik
narrower: frisurer

litteratur
type: Concept
definition: Fortællingen om en historie gennem skriftsprog.
in scheme: mediatopic
created: 2009-10-22T02:00:00+00:00
modified: 2021-02-18T12:00:00+00:00
broader: kunst og underholdning
narrower: drama (litteratur)
narrower: fiktion
narrower: non-fiktion
narrower: poesi

musik
type: Concept
definition: Udtrykke følelser eller formidle budskaber ved hjælp af sang og/eller instrumenter med forskellige lyde, toner og harmonier.
in scheme: mediatopic
created: 2009-10-22T02:00:00+00:00
modified: 2021-02-18T12:00:00+00:00
broader: kunst og underholdning
narrower: musikinstrument
narrower: musikalsk optræden
narrower: musikgenre

teater
type: Concept
definition: En kunstform, der udtrykker følelser og budskaber gennem en historie, der formidles på scenen via dialog og handlinger foran et publikum.
in scheme: mediatopic
created: 2009-10-22T02:00:00+00:00
modified: 2021-02-18T12:00:00+00:00
broader: kunst og underholdning
narrower: opera
narrower: musikteater
narrower: musical
narrower: operette
narrower: drama (teater)
narrower: standupkomedie
narrower: kabaret

visuel kunst
type: Concept
definition: Forskellige former for værker, der primært appellerer til det visuelle, såsom keramik, tegninger, skulpturer, fotos, video og arkitektur.
in scheme: mediatopic
created: 2009-10-22T02:00:00+00:00
modified: 2021-02-18T12:00:00+00:00
broader: kunst og underholdning
narrower: arkitektur
narrower: design (visuel kunst)
narrower: tegning
narrower: maleri
narrower: fotografi
narrower: skulptur
narrower: tekstilkunst
narrower: træbearbejdning
narrower: smedning
broad match: http://cv.iptc.org/newscodes/subjectcode/01000000

serie
type: Concept
definition: Et sammenhængende sæt programmer, der udsendes under samme titel, undertiden over flere sæsoner.
in scheme: mediatopic
created: 2017-11-16T12:00:00+00:00
modified: 2021-07-12T12:00:00+00:00
broader: kunst og underholdning

festival
type: Concept
definition: Begivenheder, der viser kunstneriske bestræbelser, ofte regelmæssigt forekommende, såsom dans, musik, teater, poesi eller komik.
in scheme: mediatopic
created: 2018-04-09T12:00:00+00:00
modified: 2021-07-12T12:00:00+00:00
broader: kunst og underholdning
narrower: filmfestival

filmfestival
type: Concept
definition: Nationale eller internationale samlinger, hvor film vises, priser uddeles, og branchefolk mødes.
in scheme: mediatopic
created: 2009-10-22T02:00:00+00:00
modified: 2021-02-18T12:00:00+00:00
broader: festival

ballet
type: Concept
definition: Klassisk dansestil med trin, positioner og bevægelser.
in scheme: mediatopic
created: 2009-10-22T02:00:00+00:00
modified: 2021-02-18T12:00:00+00:00
broader: dans
broad match: http://cv.iptc.org/newscodes/subjectcode/01006000

moderne dans
type: Concept
definition: Teatralsk dansestil, der ikke er begrænset til klassiske udtryk.
in scheme: mediatopic
created: 2009-10-22T02:00:00+00:00
modified: 2021-02-18T12:00:00+00:00
broader: dans
broad match: http://cv.iptc.org/newscodes/subjectcode/01006000

traditionel dans
type: Concept
definition: Dans, der ofte forekommer som en social aktivitet, undertiden knyttet til lokale kulturelle traditioner.
in scheme: mediatopic
created: 2009-10-22T02:00:00+00:00
modified: 2021-02-18T12:00:00+00:00
broader: dans
broad match: http://cv.iptc.org/newscodes/subjectcode/01006000

smykke
type: Concept
definition: Tilbehør til tøj, såsom ringe, halskæder og øreringe.
in scheme: mediatopic
created: 2009-10-22T02:00:00+00:00
modified: 2021-02-18T12:00:00+00:00
broader: mode

kosmetik
type: Concept
definition: Udviklingen inden for produkter, som påføres dele kroppen for at forandre eller forstærke deres udtryk. Kan være læbestift, neglelak eller mascara.
in scheme: mediatopic
created: 2019-07-30T12:00:00+00:00
modified: 2021-07-12T12:00:00+00:00
broader: mode

frisurer
type: Concept
definition: Trends, der omhandler, hvordan man klipper og sætter sit hår.
in scheme: mediatopic
created: 2019-07-30T12:00:00+00:00
modified: 2021-07-12T12:00:00+00:00
broader: mode

drama (litteratur)
type: Concept
definition: Skrevne historier, der er beregnet til at blive fremført af skuespillere.
in scheme: mediatopic
created: 2009-10-22T02:00:00+00:00
modified: 2021-02-18T12:00:00+00:00
broader: litteratur
broad match: http://cv.iptc.org/newscodes/subjectcode/01010000

fiktion
type: Concept
definition: Skrevne historier, der ikke er baseret på fakta, men på forfatterens fantasi.
in scheme: mediatopic
created: 2009-10-22T02:00:00+00:00
modified: 2021-02-18T12:00:00+00:00
broader: litteratur

non-fiktion
type: Concept
definition: Tekster baseret på fakta.
in scheme: mediatopic
created: 2009-10-22T02:00:00+00:00
modified: 2021-02-18T12:00:00+00:00
broader: litteratur
broad match: http://cv.iptc.org/newscodes/subjectcode/01010000

poesi
type: Concept
definition: Skriftlige værker, der bruger sprogets æstetiske og rytmiske egenskaber til at udtrykke et budskab eller en følelse.
in scheme: mediatopic
created: 2009-10-22T02:00:00+00:00
modified: 2021-02-18T12:00:00+00:00
broader: litteratur

musikinstrument
type: Concept
definition: Objekter, der bruges til at skabe lyd til et kunstnerisk formål.
in scheme: mediatopic
created: 2009-10-22T02:00:00+00:00
modified: 2021-02-18T12:00:00+00:00
broader: musik
broad match: http://cv.iptc.org/newscodes/subjectcode/01011000

musikalsk optræden
type: Concept
definition: Musiker, der fremfører sang og/eller musik for publikum.
in scheme: mediatopic
created: 2009-10-22T02:00:00+00:00
modified: 2021-02-18T12:00:00+00:00
broader: musik
broad match: http://cv.iptc.org/newscodes/subjectcode/01011000

musikgenre
type: Concept
definition: En karakteristisk type af musik.
in scheme: mediatopic
created: 2009-10-22T02:00:00+00:00
modified: 2021-02-18T12:00:00+00:00
broader: musik
narrower: klassisk musik
narrower: countrymusik
narrower: folkemusik
narrower: jazzmusik
narrower: popmusik
narrower: rockmusik
narrower: hip hop
narrower: r&b
narrower: heavy metal
narrower: dansktop
narrower: elektronisk musik
narrower: børnemusik
broad match: http://cv.iptc.org/newscodes/subjectcode/01011000

klassisk musik
type: Concept
definition: Musik, der følger klassiske metoder og udtryk med hensyn til harmonier og rytmer.
in scheme: mediatopic
created: 2009-10-22T02:00:00+00:00
modified: 2021-02-18T12:00:00+00:00
broader: musikgenre

countrymusik
type: Concept
definition: En genre af musik, der stammer fra det sydlige USA, ofte bestående af ballader eller dansemelodier og med strengeinstrumenter som banjoer, violiner og guitarer.
in scheme: mediatopic
created: 2009-10-22T02:00:00+00:00
modified: 2021-02-18T12:00:00+00:00
broader: musikgenre

folkemusik
type: Concept
definition: Musik, der stammer fra ældre folketraditioner, og som ofte fortæller en historie.
in scheme: mediatopic
created: 2009-10-22T02:00:00+00:00
modified: 2021-02-18T12:00:00+00:00
broader: musikgenre

jazzmusik
type: Concept
definition: Musik med blandede harmonier, ofte improviseret, med rødder i blues og ragtime i det afroamerikanske samfund i New Orleans.
in scheme: mediatopic
created: 2009-10-22T02:00:00+00:00
modified: 2021-02-18T12:00:00+00:00
broader: musikgenre

popmusik
type: Concept
definition: Musikstil, der er bredt tilgængelig og komponeret for at tiltrække mange lyttere.
in scheme: mediatopic
created: 2009-10-22T02:00:00+00:00
modified: 2021-02-18T12:00:00+00:00
broader: musikgenre

rockmusik
type: Concept
definition: En genre af musik, der stammer fra USA i slutningen af 1940'erne og begyndelsen af 1950'erne, hvor den udviklede sig fra afroamerikanske musikalske stilarter som gospel, jump blues, jazz, boogie woogie og rytme og blues.
in scheme: mediatopic
created: 2009-10-22T02:00:00+00:00
modified: 2021-02-18T12:00:00+00:00
broader: musikgenre

hip hop
type: Concept
definition: En musikstil udviklet af afroamerikanere i amerikanske byer i løbet af 1970'erne, der også omfatter rap.
in scheme: mediatopic
created: 2019-04-06T12:00:00+00:00
modified: 2021-07-12T12:00:00+00:00
broader: musikgenre

r&b
type: Concept
definition: En musikalsk stil udviklet blandt afroamerikanere i løbet af 1940'erne.
in scheme: mediatopic
created: 2019-04-06T12:00:00+00:00
modified: 2021-07-12T12:00:00+00:00
broader: musikgenre

heavy metal
type: Concept
definition: En tung musikstil, der hovedsageligt blev udviklet i England i slutningen af 60'erne og begyndelsen af 70'erne.
in scheme: mediatopic
created: 2019-04-06T12:00:00+00:00
modified: 2021-07-12T12:00:00+00:00
broader: musikgenre

dansktop
type: Concept
definition: En svensk inspireret musikgenre, der er karakteriseret ved swing, schlager, country, jazz og rock og som ofte er dansevenligt til pardans.
in scheme: mediatopic
created: 2019-04-06T12:00:00+00:00
modified: 2021-07-12T12:00:00+00:00
broader: musikgenre

elektronisk musik
type: Concept
definition: En bred genre af elektronisk baseret dansemusik.
in scheme: mediatopic
created: 2019-04-06T12:00:00+00:00
modified: 2021-07-12T12:00:00+00:00
broader: musikgenre

børnemusik
type: Concept
definition: En musikgenre med sange komponeret og udført for børn.
in scheme: mediatopic
created: 2019-04-06T12:00:00+00:00
modified: 2021-07-12T12:00:00+00:00
broader: musikgenre

opera
type: Concept
definition: Udførelse af musikværker, ofte dramatiske, af klassisk trænede sangere og musikere.
in scheme: mediatopic
created: 2009-10-22T02:00:00+00:00
modified: 2021-09-30T12:00:00+00:00
broader: teater
broad match: http://cv.iptc.org/newscodes/subjectcode/01017001

musikteater
type: Concept
definition: En kunstform, der udtrykker følelser og budskaber gennem en historie formidlet via dialog, musik og handlinger, såsom musicals og operetter.
in scheme: mediatopic
created: 2009-10-22T02:00:00+00:00
retired: 2021-09-30T12:00:00+00:00
modified: 2021-09-30T12:00:00+00:00
broader: teater

musical
type: Concept
definition: Teater, hvor musik og sang er en vigtig del af selve historien.
in scheme: mediatopic
created: 2012-10-04T12:00:00+00:00
modified: 2021-09-30T12:00:00+00:00
broader: teater

operette
type: Concept
definition: En kunstform, der minder om opera, men hvor både handling og musik er mere lette og humoristiske.
in scheme: mediatopic
created: 2012-10-04T12:00:00+00:00
modified: 2021-09-30T12:00:00+00:00
broader: teater

drama (teater)
type: Concept
definition: En teatergenre, hvor et drama eller en komedie udelukkende udføres med tale og skuespil af skuespillere på en scene.
in scheme: mediatopic
created: 2018-04-09T12:00:00+00:00
modified: 2021-07-12T12:00:00+00:00
broader: teater

standupkomedie
type: Concept
definition: En stil, hvor en komiker udfører en række vittigheder eller historier foran et levende publikum og ofte taler direkte til dem.
in scheme: mediatopic
created: 2019-04-06T12:00:00+00:00
modified: 2021-07-12T12:00:00+00:00
broader: teater

kabaret
type: Concept
definition: En kunstform med musik, sang, dialog og dans, der ofte opføres i et severingslokale.
in scheme: mediatopic
created: 2019-04-06T12:00:00+00:00
modified: 2021-09-30T12:00:00+00:00
broader: teater

arkitektur
type: Concept
definition: Den mere visuelle del af beslutningen om, hvordan bygninger, monumenter og anlagte områder skal se ud.
in scheme: mediatopic
created: 2009-10-22T02:00:00+00:00
modified: 2021-02-18T12:00:00+00:00
broader: visuel kunst

design (visuel kunst)
type: Concept
definition: En kunstnerisk disciplin, der fokuserer på visuel kommunikation og præsentation af et slutprodukt, kan spænde fra smykker til interiørdesign.
in scheme: mediatopic
created: 2009-10-22T02:00:00+00:00
modified: 2021-02-18T12:00:00+00:00
broader: visuel kunst
broad match: http://cv.iptc.org/newscodes/subjectcode/01000000

tegning
type: Concept
definition: En form for visuel kunst, hvor penne, farveblyanter og lignende bruges.
in scheme: mediatopic
created: 2009-10-22T02:00:00+00:00
modified: 2021-02-18T12:00:00+00:00
broader: visuel kunst
broad match: http://cv.iptc.org/newscodes/subjectcode/01000000

maleri
type: Concept
definition: En form for visuel kunst, der bruger pensel og forskellige farver.
in scheme: mediatopic
created: 2009-10-22T02:00:00+00:00
modified: 2021-02-18T12:00:00+00:00
broader: visuel kunst

fotografi
type: Concept
definition: En form for visuel kunst ved hjælp af fotografiske billeder.
in scheme: mediatopic
created: 2009-10-22T02:00:00+00:00
modified: 2021-02-18T12:00:00+00:00
broader: visuel kunst

skulptur
type: Concept
definition: En kunstart, hvor genstande er lavet af en form for fast materiale, såsom sten, træ eller ler.
in scheme: mediatopic
created: 2009-10-22T02:00:00+00:00
modified: 2021-05-05T12:00:00+00:00
broader: visuel kunst

tekstilkunst
type: Concept
definition: Håndværk, hvor forskellige former for fiber bruges til at fremstille praktiske og/eller dekorative genstande.
in scheme: mediatopic
created: 2019-04-06T12:00:00+00:00
modified: 2021-07-12T12:00:00+00:00
broader: visuel kunst

træbearbejdning
type: Concept
definition: Håndværk, hvor man anvender træ og forskellige værktøjer til fremstilling af genstande eller detaljer til genstande.
in scheme: mediatopic
created: 2019-04-06T12:00:00+00:00
modified: 2021-07-12T12:00:00+00:00
broader: visuel kunst

smedning
type: Concept
definition: Håndværk, hvor man arbejder med opvarmet metal med værktøjer til fremstilling af redskaber eller dekorative genstande.
in scheme: mediatopic
created: 2019-04-06T12:00:00+00:00
modified: 2021-07-12T12:00:00+00:00
broader: visuel kunst

kulturhistorie
type: Concept
definition: Historien om, hvordan kunst og kultur har udviklet sig over forskellige tidsperioder.
in scheme: mediatopic
created: 2009-10-22T02:00:00+00:00
modified: 2021-02-18T12:00:00+00:00
broader: kultur

skik og tradition
type: Concept
definition: En bestemt måde at opføre sig på eller observationer, der har udviklet sig over tid af en gruppe mennesker.
in scheme: mediatopic
created: 2009-10-22T02:00:00+00:00
modified: 2021-02-18T12:00:00+00:00
broader: kultur

festlig begivenhed (kultur)
type: Concept
definition: En begivenhed fejret af en gruppe mennesker med samme interesse, og som fokuserer på et karakteristisk aspekt af gruppen og dens traditioner.
in scheme: mediatopic
created: 2009-10-22T02:00:00+00:00
modified: 2021-02-18T12:00:00+00:00
broader: kultur

sprog
type: Concept
definition: Metode til menneskelig kommunikation, enten talt eller skrevet, bestående af ord, der bruges på en struktureret og konventionel måde.
in scheme: mediatopic
created: 2009-10-22T02:00:00+00:00
modified: 2021-02-18T12:00:00+00:00
broader: kultur

bibliotek og museum
type: Concept
definition: Institutioner, der samler bøger, musikoptagelser, film, kunstværker og gamle ting fra forskellige epoker og lader interesserede se på dem og i nogle tilfælde låne dem hjem.
in scheme: mediatopic
created: 2009-10-22T02:00:00+00:00
modified: 2021-05-05T12:00:00+00:00
broader: kultur

monument og kulturarv
type: Concept
definition: Mindesmærker over historiske mennesker, begivenheder eller bestemte områder i form af strukturer som skulpturer, statuer eller bygninger.
in scheme: mediatopic
created: 2009-10-22T02:00:00+00:00
modified: 2021-05-05T12:00:00+00:00
broader: kultur
narrower: renovering

udstilling
type: Concept
definition: Midlertidig præsentation af kunst eller særemner på museer, kunsthaller eller gallerier.
in scheme: mediatopic
created: 2012-10-04T12:00:00+00:00
modified: 2023-03-31T12:00:00+00:00
broader: kultur

renovering
type: Concept
definition: Renovering af en bygning svarende til ny tilstand.
in scheme: mediatopic
created: 2009-10-22T02:00:00+00:00
modified: 2023-03-31T12:00:00+00:00
broader: monument og kulturarv

nyhedsmedie
type: Concept
definition: Præsentation af nyheder til offentligheden gennem forskellige platforme, såsom tv, radio, aviser, magasiner, websider og blogs.
in scheme: mediatopic
created: 2009-10-22T02:00:00+00:00
modified: 2021-02-18T12:00:00+00:00
broader: massemedie

avis
type: Concept
definition: Regelmæssigt producerede publikationer, der indeholder nyheder og andet indhold af interesse for læserne.
in scheme: mediatopic
created: 2009-10-22T02:00:00+00:00
modified: 2021-02-18T12:00:00+00:00
broader: massemedie

online medie
type: Concept
definition: Nyheder og andet indhold distribueret via internettet.
in scheme: mediatopic
created: 2009-10-22T02:00:00+00:00
modified: 2021-05-05T12:00:00+00:00
broader: massemedie
broad match: http://cv.iptc.org/newscodes/subjectcode/01026000

tidssskrift og magasin
type: Concept
definition: Publikation, der normalt offentliggøres ugentligt, månedligt eller årligt, såsom magasiner, tidsskrifter eller nyhedsbreve.
in scheme: mediatopic
created: 2009-10-22T02:00:00+00:00
modified: 2021-02-18T12:00:00+00:00
broader: massemedie

radio
type: Concept
definition: Programmer, der kun består af lyd og distribueres trådløst eller over internettet.
in scheme: mediatopic
created: 2009-10-22T02:00:00+00:00
modified: 2021-02-18T12:00:00+00:00
broader: massemedie

tv
type: Concept
definition: Programmer, der omfatter både lyd og video og distribueres trådløst eller via Internettet.
in scheme: mediatopic
created: 2009-10-22T02:00:00+00:00
modified: 2021-02-18T12:00:00+00:00
broader: massemedie

socialt medie
type: Concept
definition: Indhold, der stilles til rådighed af både virksomheder og enkeltpersoner via fora på internettet.
in scheme: mediatopic
created: 2018-04-09T12:00:00+00:00
modified: 2021-07-12T12:00:00+00:00
broader: massemedie
narrower: influencer

disinformation og misinformation
type: Concept
definition: Spredning af falske nyheder eller informationer, uanset hensigten.
in scheme: mediatopic
created: 2021-02-18T12:00:00+00:00
modified: 2021-07-12T12:00:00+00:00
broader: massemedie

bioterrorisme
type: Concept
definition: Biologiske angreb for at øge frygt hos mennesker.
in scheme: mediatopic
created: 2009-10-22T02:00:00+00:00
modified: 2021-02-18T12:00:00+00:00
broader: terrorhandling

bombning
type: Concept
definition: Forsætlig brug af eksplosionsanordninger mod mennesker, bygninger eller andre strukturer.
in scheme: mediatopic
created: 2009-10-22T02:00:00+00:00
modified: 2023-03-31T12:00:00+00:00
broader: terrorhandling

guerillaaktivitet
type: Concept
definition: Krigsførelse beregnet til at fratage modstanderen en etableret kontrol over et område, primært gennem den mobile kamp om adskillige mindre enheder, ofte ved anvendelse sabotage og overraskelsesangreb.
in scheme: mediatopic
created: 2009-10-22T02:00:00+00:00
modified: 2021-02-18T12:00:00+00:00
broader: væbnet konflikt

international militær indgriben
type: Concept
definition: Midlertidig brug af internationale tropper i et land eller en region, som har brug for hjælp udefra til at løse en krise.
in scheme: mediatopic
created: 2009-10-22T02:00:00+00:00
modified: 2021-02-18T12:00:00+00:00
broader: væbnet konflikt

militær besættelse
type: Concept
definition: Overtage kontrol over et land eller område med militære midler.
in scheme: mediatopic
created: 2009-10-22T02:00:00+00:00
modified: 2021-02-18T12:00:00+00:00
broader: væbnet konflikt
broad match: http://cv.iptc.org/newscodes/subjectcode/16000000

krig
type: Concept
definition: Tilstand med væbnet kamp i stor skala mellem nationer eller andre geopolitiske enheder.
in scheme: mediatopic
created: 2009-10-22T02:00:00+00:00
modified: 2021-02-18T12:00:00+00:00
broader: væbnet konflikt
narrower: borgerkrig
narrower: krigsforbrydelse

fredsbevarende styrke
type: Concept
definition: Militære tropper fra forskellige lande, der under en samlet international organisation eller samarbejde opretholder fred i konfliktområder.
in scheme: mediatopic
created: 2009-10-22T02:00:00+00:00
modified: 2024-03-28T12:00:00+00:00
broader: fredsproces

savnet i kamp
type: Concept
definition: Mennesker, både civile og militære, der er savnet under og efter en krig.
in scheme: mediatopic
created: 2009-10-22T02:00:00+00:00
modified: 2024-07-01T12:00:00+00:00
broader: http://cv.iptc.org/newscodes/mediatopic/20001377

borgerkrig
type: Concept
definition: Krig mellem forskellige grupper inden for samme nation, undertiden med målet om at dele landet.
in scheme: mediatopic
created: 2009-10-22T02:00:00+00:00
modified: 2021-02-18T12:00:00+00:00
broader: krig

krigsforbrydelse
type: Concept
definition: Alvorlige krænkelser af krigslovene, for eksempel gennem brug af forbudte våben, ordrer om eller deltagelse i tortur eller andet alvorligt overgreb på krigsfanger eller civile.
in scheme: mediatopic
created: 2009-10-22T02:00:00+00:00
retired: 2016-04-05T12:00:00+00:00
modified: 2021-05-05T12:00:00+00:00
broader: krig

demonstration
type: Concept
definition: Offentlig kollektiv meningstilkendegivelse i form af en masseforsamling og/eller march med slagord på plakater og bannere.
in scheme: mediatopic
created: 2009-10-22T02:00:00+00:00
modified: 2021-02-18T12:00:00+00:00
broader: civil urolighed

oprør
type: Concept
definition: Organiseret angreb på statsmagten af en gruppe i det samme land, ofte voldeligt og med det formål at vælte regeringen og ændre det politiske system.
in scheme: mediatopic
created: 2009-10-22T02:00:00+00:00
modified: 2021-02-18T12:00:00+00:00
broader: civil urolighed

revolution
type: Concept
definition: Større, væbnet og organiseret omstyrtning af det eksisterende samfund.
in scheme: mediatopic
created: 2009-10-22T02:00:00+00:00
modified: 2021-02-18T12:00:00+00:00
broader: civil urolighed

optøjer
type: Concept
definition: Midlertidig voldelig opførsel af menneskegrupper uden for myndighedernes kontrol.
in scheme: mediatopic
created: 2009-10-22T02:00:00+00:00
modified: 2021-02-18T12:00:00+00:00
broader: civil urolighed

folkedrab
type: Concept
definition: Systematisk drab på en folkegruppe eller dele af en folkegruppe.
in scheme: mediatopic
created: 2009-10-22T02:00:00+00:00
modified: 2024-03-28T12:00:00+00:00
broader: forbrydelse

fredsmægler
type: Concept
definition: Person eller organisation, der initierer og implementerer en fredsproces.
in scheme: mediatopic
created: 2009-10-22T02:00:00+00:00
modified: 2021-07-12T12:00:00+00:00
broader: fredsproces
broad match: http://cv.iptc.org/newscodes/subjectcode/11002003

fredsplan
type: Concept
definition: En strategi for at opnå fred i et krigs- eller konfliktområde.
in scheme: mediatopic
created: 2009-10-22T02:00:00+00:00
modified: 2021-02-18T12:00:00+00:00
broader: fredsproces
broad match: http://cv.iptc.org/newscodes/subjectcode/11002003

fredsforhandling
type: Concept
definition: Drøftelser mellem lande, regioner eller geopolitiske enheder i krig eller konflikt, ofte med en mægler, hvor målet er at nå en løsning, der fører til fred.
in scheme: mediatopic
created: 2009-10-22T02:00:00+00:00
modified: 2021-05-05T12:00:00+00:00
broader: fredsproces
broad match: http://cv.iptc.org/newscodes/subjectcode/11002003

nedrustning
type: Concept
definition: Nedlægge eller nedtrappe et lands våbenarsenal.
in scheme: mediatopic
created: 2009-10-22T02:00:00+00:00
modified: 2024-03-28T12:00:00+00:00
broader: fredsproces
broad match: http://cv.iptc.org/newscodes/subjectcode/11002000

ammunitionsrydning
type: Concept
definition: Fjernelse eller neutralisering af miner og klyngebomber efter en krig eller konflikt.
in scheme: mediatopic
created: 2009-10-22T02:00:00+00:00
modified: 2021-02-18T12:00:00+00:00
broader: genopbygning efter krig

krigsfange
type: Concept
definition: Et menneske, der er blevet fanget og frihedsberøvet under krig.
in scheme: mediatopic
created: 2009-10-22T02:00:00+00:00
modified: 2024-03-28T12:00:00+00:00
broader: http://cv.iptc.org/newscodes/mediatopic/20001377

forsætlig brandstiftelse
type: Concept
definition: Med forsættelighed at brænde noget af, som man ikke har ret til.
in scheme: mediatopic
created: 2009-10-22T02:00:00+00:00
modified: 2021-02-18T12:00:00+00:00
broader: forbrydelse

overfald
type: Concept
definition: Alle former for fysisk vold mod en eller flere personer.
in scheme: mediatopic
created: 2009-10-22T02:00:00+00:00
modified: 2021-02-18T12:00:00+00:00
broader: forbrydelse
narrower: seksualforbrydelse

cyberkriminalitet
type: Concept
definition: Kriminel aktivitet, der primært udføres ved hjælp af computere og/eller internettet, for eksempel hacking, phishing og identitetstyveri.
in scheme: mediatopic
created: 2009-10-22T02:00:00+00:00
modified: 2023-03-31T12:00:00+00:00
broader: forbrydelse

økonomisk kriminalitet
type: Concept
definition: En forbrydelse, der er begået af en virksomhed eller personer, der repræsenterer virksomheden.
in scheme: mediatopic
created: 2009-10-22T02:00:00+00:00
modified: 2021-02-18T12:00:00+00:00
broader: forbrydelse
narrower: konkurrencekriminalitet
narrower: kontraktbrud
narrower: underslæb
narrower: insiderhandel
narrower: konkurrencebegrænsning
narrower: regnskabskriminalitet

korruption
type: Concept
definition: Ulovlige handlinger udført af en eller flere personer, der udnytter deres position til at modtage penge eller anden form for personlig vinding.
in scheme: mediatopic
created: 2009-10-22T02:00:00+00:00
modified: 2021-02-18T12:00:00+00:00
broader: forbrydelse
narrower: bestikkelse

narkokriminalitet
type: Concept
definition: Aktiviteter, der overtræder love om håndtering af narkotiske stoffer og udstyr.
in scheme: mediatopic
created: 2009-10-22T02:00:00+00:00
modified: 2021-02-18T12:00:00+00:00
broader: forbrydelse
narrower: narkosmugling
broad match: http://cv.iptc.org/newscodes/subjectcode/02001000

bedrageri
type: Concept
definition: Planlagte aktiviteter for at bedrage penge eller værdigenstande fra andre mennesker, virksomheder eller organisationer.
in scheme: mediatopic
created: 2009-10-22T02:00:00+00:00
modified: 2021-02-18T12:00:00+00:00
broader: forbrydelse
narrower: skatteunddragelse

kapring
type: Concept
definition: Overtagelse af transportmiddel ved tvang.
in scheme: mediatopic
created: 2009-10-22T02:00:00+00:00
modified: 2021-02-18T12:00:00+00:00
broader: forbrydelse
broad match: http://cv.iptc.org/newscodes/subjectcode/02001000

drab
type: Concept
definition: Drab på en anden person.
in scheme: mediatopic
created: 2009-10-22T02:00:00+00:00
modified: 2021-03-31T12:00:00+00:00
broader: forbrydelse

kidnapning
type: Concept
definition: Tilfangetagelse og tilbageholdelse af en anden person mod dennes vilje ved brug af trusler og magt.
in scheme: mediatopic
created: 2009-10-22T02:00:00+00:00
modified: 2021-02-18T12:00:00+00:00
broader: forbrydelse

organiseret kriminalitet
type: Concept
definition: Planlagt kriminalitet udført af kriminelle i en gruppe, for eksempel mafiaen.
in scheme: mediatopic
created: 2009-10-22T02:00:00+00:00
modified: 2021-02-18T12:00:00+00:00
broader: forbrydelse
narrower: bandekriminalitet

terrorisme
type: Concept
definition: Vold, der bruges til at skræmme store dele af en befolkning og sigter mod at nå politiske eller ideologiske mål.
in scheme: mediatopic
created: 2009-10-22T02:00:00+00:00
modified: 2021-02-18T12:00:00+00:00
broader: forbrydelse

tyveri
type: Concept
definition: Ulovlig erhvervelse af en andens ejendom.
in scheme: mediatopic
created: 2009-10-22T02:00:00+00:00
modified: 2021-05-05T12:00:00+00:00
broader: forbrydelse

krigskriminalitet
type: Concept
definition: Alvorlige krænkelser af krigslovene, ofte overgreb på civile eller krigsfanger, herunder retsforfølgelse af disse forbrydelser.
in scheme: mediatopic
created: 2009-10-22T02:00:00+00:00
modified: 2024-03-28T12:00:00+00:00
broader: forbrydelse

færdselsovertrædelser
type: Concept
definition: Ulovlige handlinger i trafikken.
in scheme: mediatopic
created: 2019-04-06T12:00:00+00:00
modified: 2021-07-12T12:00:00+00:00
broader: forbrydelse

menneskesmugling og trafficking
type: Concept
definition: Ulovlig transport af mennesker over landegrænser. Hvis det sker ufrivilligt, regnes det for trafficking.
in scheme: mediatopic
created: 2019-11-20T12:00:00+00:00
modified: 2021-07-12T12:00:00+00:00
broader: forbrydelse

hærværk
type: Concept
definition: Beskadige eller ødelægge offentlig eller privat ejendom med vilje.
in scheme: mediatopic
created: 2019-11-20T12:00:00+00:00
modified: 2021-07-12T12:00:00+00:00
broader: forbrydelse

skyderi
type: Concept
definition: Voldelige handlinger, der begås ved hjælp af skydevåben.
in scheme: mediatopic
created: 2021-02-18T12:00:00+00:00
modified: 2021-07-12T12:00:00+00:00
broader: forbrydelse

dyremishandling
type: Concept
definition: Mishandling eller misrøgt af dyr.
in scheme: mediatopic
created: 2021-02-18T12:00:00+00:00
modified: 2021-07-12T12:00:00+00:00
broader: forbrydelse

http://cv.iptc.org/newscodes/mediatopic/20001320
type: Concept
in scheme: mediatopic
created: 2021-05-05T12:00:00+00:00
modified: 2021-12-21T12:00:00+00:00
broader: forbrydelse

seksualforbrydelse
type: Concept
definition: Seksuel relateret vold, herunder voldtægt, overgreb, chikane eller befamling.
in scheme: mediatopic
created: 2009-10-22T02:00:00+00:00
modified: 2021-02-18T12:00:00+00:00
broader: overfald

konkurrencekriminalitet
type: Concept
definition: Overtrædelse af love, der er rettet mod virksomheder for at fremme fair konkurrence til fordel for forbrugerne.
in scheme: mediatopic
created: 2009-10-22T02:00:00+00:00
modified: 2021-05-05T12:00:00+00:00
broader: økonomisk kriminalitet

kontraktbrud
type: Concept
definition: Overtrædelse af aftaler indgået i en kontrakt mellem to eller flere parter.
in scheme: mediatopic
created: 2009-10-22T02:00:00+00:00
modified: 2021-02-18T12:00:00+00:00
broader: økonomisk kriminalitet

underslæb
type: Concept
definition: Bevidst tyveri eller forkert anvendelse af penge, som forvaltes for enhver klient, eller som tilhører en arbejdsgiver.
in scheme: mediatopic
created: 2009-10-22T02:00:00+00:00
modified: 2021-02-18T12:00:00+00:00
broader: økonomisk kriminalitet

insiderhandel
type: Concept
definition: Handel med aktier eller andre værdipapirer af personer, som har adgang til fortolige oplysninger.
in scheme: mediatopic
created: 2009-10-22T02:00:00+00:00
modified: 2021-02-18T12:00:00+00:00
broader: økonomisk kriminalitet

konkurrencebegrænsning
type: Concept
definition: Aftaler eller partnerskaber mellem virksomheder eller personer, der sigter mod at begrænse konkurrencen.
in scheme: mediatopic
created: 2009-10-22T02:00:00+00:00
modified: 2021-02-18T12:00:00+00:00
broader: økonomisk kriminalitet

regnskabskriminalitet
type: Concept
definition: Kriminalitet, der involverer vildledende oplysninger om en virksomheds eller organisations økonomi.
in scheme: mediatopic
created: 2019-04-06T12:00:00+00:00
modified: 2021-07-12T12:00:00+00:00
broader: økonomisk kriminalitet

bestikkelse
type: Concept
definition: Tilbud om penge eller tjenester til en person i en afgørende position for at påvirke vedkommendes handlinger
in scheme: mediatopic
created: 2009-10-22T02:00:00+00:00
modified: 2021-02-18T12:00:00+00:00
broader: korruption

narkosmugling
type: Concept
definition: Ulovlig smugle narkotika mellem forskellige lande.
in scheme: mediatopic
created: 2009-10-22T02:00:00+00:00
modified: 2021-02-18T12:00:00+00:00
broader: narkokriminalitet

skatteunddragelse
type: Concept
definition: Når nogen forsøger at undgå at betale skat.
in scheme: mediatopic
created: 2019-04-06T12:00:00+00:00
modified: 2021-07-12T12:00:00+00:00
broader: bedrageri

bandekriminalitet
type: Concept
definition: Kriminalitet udført af grupper, der har en samhørighed gennem for eksempel områder, sprog, etnicitet eller baggrund.
in scheme: mediatopic
created: 2009-10-22T02:00:00+00:00
modified: 2021-05-05T12:00:00+00:00
broader: organiseret kriminalitet

domstol
type: Concept
definition: En institution, hvor en retssag føres, og hvor parterne får lov til at fremlægge deres respektive synspunkter, før der fældes en dom.
in scheme: mediatopic
created: 2009-10-22T02:00:00+00:00
modified: 2021-02-18T12:00:00+00:00
broader: retsvæsen
narrower: appel (domstol)
narrower: domstolsadministration
narrower: dommer
narrower: straffesag
narrower: højesteret
broad match: http://cv.iptc.org/newscodes/subjectcode/02007000

udenretslig procedure
type: Concept
definition: To parters tvistbilæggelse med neutral mægler uden om retten.
in scheme: mediatopic
created: 2009-10-22T02:00:00+00:00
modified: 2021-05-05T12:00:00+00:00
broader: retsvæsen
narrower: voldgift
broad match: http://cv.iptc.org/newscodes/subjectcode/02000000

retsforfølgelse
type: Concept
definition: Processen med afholdelse af en retssag mod en person der er anklaget for at begå en forbrydelse.
in scheme: mediatopic
created: 2009-10-22T02:00:00+00:00
modified: 2021-03-31T12:00:00+00:00
broader: retsvæsen

appel (domstol)
type: Concept
definition: Handlinger truffet, når dommen ikke accepteres.
in scheme: mediatopic
created: 2009-10-22T02:00:00+00:00
modified: 2021-02-18T12:00:00+00:00
broader: domstol
broad match: http://cv.iptc.org/newscodes/subjectcode/02000000

domstolsadministration
type: Concept
definition: Personer, som er ansat og arbejder ved domstolene.
in scheme: mediatopic
created: 2009-10-22T02:00:00+00:00
retired: 2019-10-07T12:00:00+00:00
modified: 2021-05-05T12:00:00+00:00
broader: domstol

dommer
type: Concept
definition: Den eller de personer, der træffer juridiske afgørelser.
in scheme: mediatopic
created: 2009-10-22T02:00:00+00:00
modified: 2024-03-28T12:00:00+00:00
broader: domstol

straffesag
type: Concept
definition: Den retslige procedure, der afgør skyldsspørgsmål og udmåler en evt. straf.
in scheme: mediatopic
created: 2009-10-22T02:00:00+00:00
modified: 2021-02-18T12:00:00+00:00
broader: domstol
narrower: Forberedende retsmøde
narrower: tiltalt
narrower: civilretssag
narrower: vidne
narrower: straf (kriminel)

højesteret
type: Concept
definition: Den øverste retsinstans i et land.
in scheme: mediatopic
created: 2019-11-25T12:00:00+00:00
modified: 2021-07-12T12:00:00+00:00
broader: domstol

Forberedende retsmøde
type: Concept
definition: Forberedende retsbehandling, før de egentlige retsmøder
in scheme: mediatopic
created: 2009-10-22T02:00:00+00:00
modified: 2021-05-05T12:00:00+00:00
broader: straffesag

tiltalt
type: Concept
definition: Enhver, der er tiltalt i en retssag, og som skal svare på anklagerne.
in scheme: mediatopic
created: 2009-10-22T02:00:00+00:00
retired: 2019-10-07T12:00:00+00:00
modified: 2021-02-18T12:00:00+00:00
broader: straffesag

civilretssag
type: Concept
definition: Tvistafgørelse imellem to parter ved en domstol.
in scheme: mediatopic
created: 2009-10-22T02:00:00+00:00
modified: 2021-05-05T12:00:00+00:00
broader: straffesag

vidne
type: Concept
definition: En person, der optræder i retten og fortæller om sine oplevelser af sagen.
in scheme: mediatopic
created: 2009-10-22T02:00:00+00:00
retired: 2019-10-07T12:00:00+00:00
modified: 2021-02-18T12:00:00+00:00
broader: straffesag

straf (kriminel)
type: Concept
definition: Straf af personer eller organisationer, der er dømt for kriminalitet.
in scheme: mediatopic
created: 2009-10-22T02:00:00+00:00
modified: 2021-02-18T12:00:00+00:00
broader: straffesag
narrower: dødsstraf
narrower: bøde
narrower: fængsel
narrower: psykiatrisk behandlingsdom
narrower: betinget dom

voldgift
type: Concept
definition: En afgørelse af et retstvist, hvor parterne benytter en neutral mægler i stedet for en domstol.
in scheme: mediatopic
created: 2009-10-22T02:00:00+00:00
modified: 2021-12-21T12:00:00+00:00
broader: udenretslig procedure

borgerrettighed
type: Concept
definition: De rettigheder som borgerne i en stat har, ofte indskrevet i landets grundlov.
in scheme: mediatopic
created: 2009-10-22T02:00:00+00:00
modified: 2021-02-18T12:00:00+00:00
broader: grundlæggende rettighed

civilret
type: Concept
definition: Den del af et lands love, der handler om forhold mellem private.
in scheme: mediatopic
created: 2009-10-22T02:00:00+00:00
modified: 2021-03-31T12:00:00+00:00
broader: lov
narrower: regulering

straffelov
type: Concept
definition: Den del af et lands love, der beskæftiger sig med kriminalitet.
in scheme: mediatopic
created: 2009-10-22T02:00:00+00:00
modified: 2021-02-18T12:00:00+00:00
broader: lov

international lov
type: Concept
definition: Love, der gælder over hele verden, eller i flere lande.
in scheme: mediatopic
created: 2009-10-22T02:00:00+00:00
modified: 2021-02-18T12:00:00+00:00
broader: lov
narrower: udlevering
narrower: international domstol

Forvaltningsret
type: Concept
definition: Det retsområde, der regulerer forholdet mellem offentlige myndigheder og borgere.
in scheme: mediatopic
created: 2019-04-06T12:00:00+00:00
modified: 2021-07-12T12:00:00+00:00
broader: lov

regulering
type: Concept
definition: Regler, der udspringer af selskabs- og erhvervsret.
in scheme: mediatopic
created: 2009-10-22T02:00:00+00:00
modified: 2021-03-31T12:00:00+00:00
broader: civilret
narrower: konkurrenceregel
broad match: http://cv.iptc.org/newscodes/subjectcode/02006002

konkurrenceregel
type: Concept
definition: Regler, der vedrører konkurrence mellem virksomheder, såsom regler mod monopoler og lignede.
in scheme: mediatopic
created: 2009-10-22T02:00:00+00:00
modified: 2021-02-18T12:00:00+00:00
broader: regulering

udlevering
type: Concept
definition: At overføre en mistænkt eller dømt kriminel fra et land til et andet.
in scheme: mediatopic
created: 2009-10-22T02:00:00+00:00
modified: 2021-02-18T12:00:00+00:00
broader: international lov

international domstol
type: Concept
definition: En international domstol, der dømmer i tilfælde af krænkelse af folkeretten.
in scheme: mediatopic
created: 2009-10-22T02:00:00+00:00
modified: 2021-12-17T12:00:00+00:00
broader: international lov

anholdelse
type: Concept
definition: Når en person, der mistænkes for en forbrydelse, bliver fanget eller forhindret i at flygte.
in scheme: mediatopic
created: 2009-10-22T02:00:00+00:00
modified: 2021-02-18T12:00:00+00:00
broader: retshåndhævelse

efterforskning (kriminel)
type: Concept
definition: Undersøgelse af en mulig forbrydelse frem mod opklaringen.
in scheme: mediatopic
created: 2009-10-22T02:00:00+00:00
modified: 2021-02-18T12:00:00+00:00
broader: retshåndhævelse
narrower: savnet person
narrower: henlæggelse af straffesag

politi
type: Concept
definition: En institution i samfundet, der sikrer, at orden opretholdes, og at kriminalitet forhindres og efterforskes.
in scheme: mediatopic
created: 2009-10-22T02:00:00+00:00
modified: 2021-03-31T12:00:00+00:00
broader: retshåndhævelse

overvågning
type: Concept
definition: At holde øje med et individ og dets handlinger ved brug af data og kameraer for at forhindre eller afsløre kriminelle handlinger.
in scheme: mediatopic
created: 2020-08-05T12:00:00+00:00
modified: 2021-07-12T12:00:00+00:00
broader: retshåndhævelse

savnet person
type: Concept
definition: En person, der har været savnet i nogen tid og bliver søgt, mere eller mindre aktivt.
in scheme: mediatopic
created: 2009-10-22T02:00:00+00:00
modified: 2021-02-18T12:00:00+00:00
broader: efterforskning (kriminel)

henlæggelse af straffesag
type: Concept
definition: Når politi og forundersøgere vurderer, at der ikke er noget tilstrækkelig grundlag for at komme videre med en efterforskning.
in scheme: mediatopic
created: 2019-04-06T12:00:00+00:00
modified: 2021-07-12T12:00:00+00:00
broader: efterforskning (kriminel)

dødsstraf
type: Concept
definition: Straf af en person, der er dømt til døden for en forbrydelse.
in scheme: mediatopic
created: 2009-10-22T02:00:00+00:00
modified: 2021-02-18T12:00:00+00:00
broader: straf (kriminel)
broad match: http://cv.iptc.org/newscodes/subjectcode/14025005

bøde
type: Concept
definition: En straf, hvor den dømte skal betale et beløb.
in scheme: mediatopic
created: 2009-10-22T02:00:00+00:00
modified: 2021-02-18T12:00:00+00:00
broader: straf (kriminel)

fængsel
type: Concept
definition: En institution, hvor kriminelle efter dom er frihedsberøvet.
in scheme: mediatopic
created: 2009-10-22T02:00:00+00:00
modified: 2021-03-31T12:00:00+00:00
broader: straf (kriminel)

psykiatrisk behandlingsdom
type: Concept
definition: Dom, hvor retten i stedet for almindelig straf dømmer en psykisk syg kriminel til psykiatrisk behandling.
in scheme: mediatopic
created: 2019-04-06T12:00:00+00:00
modified: 2021-07-12T12:00:00+00:00
broader: straf (kriminel)

betinget dom
type: Concept
definition: En dom, hvor den dømte kendes skyldig, men hvor vedkommende på bestemte vilkår ikke skal afsone straffen.
in scheme: mediatopic
created: 2019-04-06T12:00:00+00:00
modified: 2021-07-12T12:00:00+00:00
broader: straf (kriminel)

eksplosionsulykke og -hændelse
type: Concept
definition: En pludselig detonering af sprængstof
in scheme: mediatopic
created: 2009-10-22T02:00:00+00:00
modified: 2021-05-05T12:00:00+00:00
broader: ulykke og nødsituation

arbejdsulykke
type: Concept
definition: Uventet hændelser på en arbejdsplads, der forårsager personskader og/eller ejendomsskader.
in scheme: mediatopic
created: 2009-10-22T02:00:00+00:00
modified: 2021-05-05T12:00:00+00:00
broader: ulykke og nødsituation
narrower: atomulykke

transportulykke
type: Concept
definition: Uventet begivenhed med transportkøretøjer.
in scheme: mediatopic
created: 2009-10-22T02:00:00+00:00
modified: 2021-05-05T12:00:00+00:00
broader: ulykke og nødsituation
narrower: luft- og rumfartsulykke
narrower: søfartsulykke
narrower: jernbaneulykke
narrower: trafikulykke

konstruktionsulykke
type: Concept
definition: Uventet begivenhed hvor en bygning, bro eller en anden konstruktion kollapser helt eller delvist.
in scheme: mediatopic
created: 2009-10-22T02:00:00+00:00
modified: 2021-02-18T12:00:00+00:00
broader: ulykke og nødsituation

http://cv.iptc.org/newscodes/mediatopic/20001321
type: Concept
in scheme: mediatopic
created: 2021-05-05T12:00:00+00:00
modified: 2021-12-21T12:00:00+00:00
broader: ulykke og nødsituation

atomulykke
type: Concept
definition: Uventet begivenhed på steder, der involvere produktion af atomkraft.
in scheme: mediatopic
created: 2009-10-22T02:00:00+00:00
modified: 2021-02-18T12:00:00+00:00
broader: arbejdsulykke

luft- og rumfartsulykke
type: Concept
definition: En ulykke eller hændelse, der involverer fartøjer i luft eller rum.
in scheme: mediatopic
created: 2009-10-22T02:00:00+00:00
modified: 2021-02-18T12:00:00+00:00
broader: transportulykke

søfartsulykke
type: Concept
definition: Ulykke eller hændelse, der involverer maritime fartøjer.
in scheme: mediatopic
created: 2009-10-22T02:00:00+00:00
modified: 2021-02-18T12:00:00+00:00
broader: transportulykke

jernbaneulykke
type: Concept
definition: Ulykke eller hændelse, der involverer jernbanekøretøjer.
in scheme: mediatopic
created: 2009-10-22T02:00:00+00:00
modified: 2021-02-18T12:00:00+00:00
broader: transportulykke

trafikulykke
type: Concept
definition: Ulykke eller hændelse, der involverer køretøjer på veje.
in scheme: mediatopic
created: 2009-10-22T02:00:00+00:00
modified: 2021-02-18T12:00:00+00:00
broader: transportulykke
narrower: påkørt dyr

påkørt dyr
type: Concept
definition: Trafikulykke med vilde dyr.
in scheme: mediatopic
created: 2019-04-06T12:00:00+00:00
modified: 2021-07-12T12:00:00+00:00
broader: trafikulykke

hungersnød
type: Concept
definition: Alvorlig og livstruende mangel på mad til en større gruppe mennesker i et område.
in scheme: mediatopic
created: 2009-10-22T02:00:00+00:00
modified: 2021-02-18T12:00:00+00:00
broader: katastrofe

ild
type: Concept
definition: Stor brand, der ikke er under kontrol, og som er opstået ved en ulykke eller er ulovligt antændt.
in scheme: mediatopic
created: 2009-10-22T02:00:00+00:00
modified: 2021-02-18T12:00:00+00:00
broader: katastrofe
narrower: skovbrand

naturkatastrofe
type: Concept
definition: Ødelæggende hændelse der er forudsaget af begivenheder i naturen, som orkan, jordskælv og oversvømmelse.
in scheme: mediatopic
created: 2009-10-22T02:00:00+00:00
modified: 2021-02-18T12:00:00+00:00
broader: katastrofe
narrower: tørke
narrower: jordskælv
narrower: oversvømmelse
narrower: jordskred
narrower: meteorologisk katastrofe
narrower: vulkanudbrud
narrower: http://cv.iptc.org/newscodes/mediatopic/20001353

skovbrand
type: Concept
definition: Brand, der hovedsageligt rammer vegetation (skov).
in scheme: mediatopic
created: 2019-04-06T12:00:00+00:00
modified: 2021-07-12T12:00:00+00:00
broader: ild

tørke
type: Concept
definition: Alvorlig mangel på vand over en periode.
in scheme: mediatopic
created: 2009-10-22T02:00:00+00:00
modified: 2021-02-18T12:00:00+00:00
broader: naturkatastrofe

jordskælv
type: Concept
definition: Bevægelser i jordens kontinentale plader, der forårsager skade på overfladen.
in scheme: mediatopic
created: 2009-10-22T02:00:00+00:00
modified: 2021-02-18T12:00:00+00:00
broader: naturkatastrofe

oversvømmelse
type: Concept
definition: Overflod af vand forårsaget af kraftig regn eller smeltende sne, normalt på steder, hvor det ikke er ønsket.
in scheme: mediatopic
created: 2009-10-22T02:00:00+00:00
modified: 2021-02-18T12:00:00+00:00
broader: naturkatastrofe

jordskred
type: Concept
definition: Store mængder jord og/eller grus, der falder sammen.
in scheme: mediatopic
created: 2009-10-22T02:00:00+00:00
modified: 2021-02-18T12:00:00+00:00
broader: naturkatastrofe
narrower: lavine
broad match: http://cv.iptc.org/newscodes/subjectcode/03015002

meteorologisk katastrofe
type: Concept
definition: Forskellige katestrofer forårsaget af vejret.
in scheme: mediatopic
created: 2009-10-22T02:00:00+00:00
modified: 2021-02-18T12:00:00+00:00
broader: naturkatastrofe
narrower: storm
narrower: orkan

vulkanudbrud
type: Concept
definition: Udbrud af magmatisk materiale fra jordens indre.
in scheme: mediatopic
created: 2009-10-22T02:00:00+00:00
modified: 2021-07-12T12:00:00+00:00
broader: naturkatastrofe

http://cv.iptc.org/newscodes/mediatopic/20001353
type: Concept
in scheme: mediatopic
created: 2022-02-03T12:00:00+00:00
modified: 2022-02-03T12:00:00+00:00
broader: naturkatastrofe

lavine
type: Concept
definition: Ophobet sne, der pludselig skrider ned af en bjerg side eller skråning.
in scheme: mediatopic
created: 2009-10-22T02:00:00+00:00
modified: 2021-02-18T12:00:00+00:00
broader: jordskred
broad match: http://cv.iptc.org/newscodes/subjectcode/03015002

storm
type: Concept
definition: Vejr med meget stærk vind, ofte med ødelæggelse som et resultat.
in scheme: mediatopic
created: 2009-10-22T02:00:00+00:00
modified: 2021-05-05T12:00:00+00:00
broader: meteorologisk katastrofe

orkan
type: Concept
definition: En voldsom og potentielt ødelæggende storm, som dannes over tropiske eller subtropiske havområder.
in scheme: mediatopic
created: 2019-10-07T12:00:00+00:00
modified: 2021-07-12T12:00:00+00:00
broader: meteorologisk katastrofe

transporthændelse
type: Concept
definition: En hændelse, der involverer et eller flere køretøjer.
in scheme: mediatopic
created: 2009-10-22T02:00:00+00:00
retired: 2015-08-27T12:00:00+00:00
modified: 2021-12-21T12:00:00+00:00
broader: nødsituation
narrower: luft- og rumfartshændelse
narrower: maritim hændelse
narrower: jernbanehændelse
narrower: vejnetshændelse
broad match: http://cv.iptc.org/newscodes/subjectcode/03010000

luft- og rumfartshændelse
type: Concept
definition: En hændelse, der involverer fartøjer i luft eller rum.
in scheme: mediatopic
created: 2009-10-22T02:00:00+00:00
retired: 2015-08-27T12:00:00+00:00
modified: 2021-12-21T12:00:00+00:00
broader: transporthændelse
broad match: http://cv.iptc.org/newscodes/subjectcode/03010003

maritim hændelse
type: Concept
definition: En hændelse, der involverer maritime fartøjer.
in scheme: mediatopic
created: 2009-10-22T02:00:00+00:00
retired: 2015-08-27T12:00:00+00:00
modified: 2021-12-21T12:00:00+00:00
broader: transporthændelse
broad match: http://cv.iptc.org/newscodes/subjectcode/03010004

jernbanehændelse
type: Concept
definition: En hændelser, der involverer jernbanekøretøjer.
in scheme: mediatopic
created: 2009-10-22T02:00:00+00:00
retired: 2015-08-27T12:00:00+00:00
modified: 2021-12-21T12:00:00+00:00
broader: transporthændelse
broad match: http://cv.iptc.org/newscodes/subjectcode/03010002

vejnetshændelse
type: Concept
definition: En hændelse, der involvere køretøjer på veje.
in scheme: mediatopic
created: 2009-10-22T02:00:00+00:00
retired: 2015-08-27T12:00:00+00:00
modified: 2021-12-21T12:00:00+00:00
broader: transporthændelse
broad match: http://cv.iptc.org/newscodes/subjectcode/03010001

virksomhedsfinansiering
type: Concept
definition: Virksomhedens økonomiske situation.
in scheme: mediatopic
created: 2009-10-22T02:00:00+00:00
retired: 2023-03-31T12:00:00+00:00
modified: 2023-03-31T12:00:00+00:00
broader: virksomhedsinformation
narrower: aktieanalyse
broad match: http://cv.iptc.org/newscodes/subjectcode/04000000

emission
type: Concept
definition: Tilbud til eksisterende eller nye aktionærer om at købe nyudstedte aktier.
in scheme: mediatopic
created: 2009-10-22T02:00:00+00:00
modified: 2023-03-31T12:00:00+00:00
broader: virksomhedsinformation
narrower: konkurs
narrower: økonomisk nødstedt virksomhed
narrower: restrukturering og rekapitalisering
narrower: værdipapir
narrower: aktie
narrower: crowdfunding
narrower: http://cv.iptc.org/newscodes/mediatopic/20001376

HR (menneskelige ressourcer)
type: Concept
definition: Personer, der arbejder for et firma, og hvordan de styres.
in scheme: mediatopic
created: 2009-10-22T02:00:00+00:00
modified: 2021-02-18T12:00:00+00:00
broader: virksomhedsinformation
narrower: nedskæringer
narrower: ledelse
broad match: http://cv.iptc.org/newscodes/subjectcode/09000000

strategi og markedsføring
type: Concept
definition: Planlægning af en virksomheds mål og salg af sine varer og tjenester for at nå disse mål.
in scheme: mediatopic
created: 2009-10-22T02:00:00+00:00
modified: 2023-03-31T12:00:00+00:00
broader: virksomhedsinformation
narrower: forretningsaftale
narrower: økonomisk globalisering
narrower: licensaftale
narrower: nyt produkt eller service
narrower: patent, ophavsret og varemærke
narrower: produkttilbagekaldelse
narrower: forskning og udvikling
narrower: markedsundersøgelse
narrower: markedsudvikling
narrower: offentlig kontrakt
narrower: kunderelation
narrower: outsourcing
broad match: http://cv.iptc.org/newscodes/subjectcode/04016029

virksomhedsledelse
type: Concept
definition: Tanker og regler om, hvordan virksomheder skal ejes og styres.
in scheme: mediatopic
created: 2009-10-22T02:00:00+00:00
modified: 2023-03-31T12:00:00+00:00
broader: virksomhedsinformation
narrower: generalforsamlingsdokumenter
narrower: aktionær
narrower: ordinær og ekstraordinær generalforsamling
narrower: årsrapport
narrower: bestyrelse
narrower: CSR (virksomheds sociale ansvar)
broad match: http://cv.iptc.org/newscodes/subjectcode/04016027

http://cv.iptc.org/newscodes/mediatopic/20001365
type: Concept
in scheme: mediatopic
created: 2023-03-31T12:00:00+00:00
modified: 2023-03-31T12:00:00+00:00
broader: virksomhedsinformation
narrower: virksomhedsrevision
narrower: kreditvurdering
narrower: finansielle resultater
narrower: indtjeningsforventninger
narrower: virksomhedsregnskab

http://cv.iptc.org/newscodes/mediatopic/20001366
type: Concept
in scheme: mediatopic
created: 2023-03-31T12:00:00+00:00
modified: 2023-03-31T12:00:00+00:00
broader: virksomhedsinformation
narrower: spin-off virksomhed
narrower: joint venture
narrower: finansielt gearet opkøb
narrower: ledelsesopkøb
narrower: fusion eller opkøb

aktieanalyse
type: Concept
definition: Aktieanalytikeres kommentarer og anbefalinger.
in scheme: mediatopic
created: 2009-10-22T02:00:00+00:00
retired: 2023-03-31T12:00:00+00:00
modified: 2023-03-31T12:00:00+00:00
broader: virksomhedsfinansiering

virksomhedsrevision
type: Concept
definition: Registrering af en virksomheds eller organisations indtægter, udgifter, forpligtelser og aktiver og kontrol heraf.
in scheme: mediatopic
created: 2009-10-22T02:00:00+00:00
retired: 2023-03-31T12:00:00+00:00
modified: 2023-03-31T12:00:00+00:00
broader: http://cv.iptc.org/newscodes/mediatopic/20001365

konkurs
type: Concept
definition: Vurdering af en virksomheds økonomiske status og evne til at afvikle lån.
in scheme: mediatopic
created: 2009-10-22T02:00:00+00:00
modified: 2023-03-31T12:00:00+00:00
broader: emission

tilbagekøb
type: Concept
definition: Program, hvor et selskab genkøber aktier i sit eget selskab fra aktionærerne.
in scheme: mediatopic
created: 2009-10-22T02:00:00+00:00
modified: 2023-03-31T12:00:00+00:00
broader: aktie

aktie
type: Concept
definition: Virksomhedspapir, der giver den enkelte en ejendomsret til en del af en virksomheds indtjening.
in scheme: mediatopic
created: 2009-10-22T02:00:00+00:00
modified: 2024-07-01T12:00:00+00:00
broader: emission
narrower: tilbagekøb
narrower: udbyttebekendtgørelse
narrower: aktiebegivenhed
narrower: børsnotering
narrower: derivater
narrower: aktieanbefaling
narrower: populære aktier

kreditvurdering
type: Concept
definition: Gennemgang af en juridisk enhed for at vurdere dens økonomiske status og evne til at afvikle lån.
in scheme: mediatopic
created: 2009-10-22T02:00:00+00:00
modified: 2023-03-31T12:00:00+00:00
broader: http://cv.iptc.org/newscodes/mediatopic/20001365

udbyttebekendtgørelse
type: Concept
definition: Meddelelse om udbetaling af udbytte.
in scheme: mediatopic
created: 2009-10-22T02:00:00+00:00
modified: 2023-03-31T12:00:00+00:00
broader: aktie

finansielle resultater
type: Concept
definition: Alle offentliggørelser af finansielle resultater. Der er ikke tale om regnskabsaflægning, men blot om indtjening eller salgstal.
in scheme: mediatopic
created: 2009-10-22T02:00:00+00:00
modified: 2023-03-31T12:00:00+00:00
broader: http://cv.iptc.org/newscodes/mediatopic/20001365

indtjeningsforventninger
type: Concept
definition: Analytikeres eller virksomhedens egne forventninger til økonomiske resultater.
in scheme: mediatopic
created: 2009-10-22T02:00:00+00:00
retired: 2023-03-31T12:00:00+00:00
modified: 2023-03-31T12:00:00+00:00
broader: http://cv.iptc.org/newscodes/mediatopic/20001365

virksomhedsregnskab
type: Concept
definition: Regnskab fra en virksomhed. Offentliggøres kvartalsvis, halvårligt eller helårligt.
in scheme: mediatopic
created: 2009-10-22T02:00:00+00:00
modified: 2023-03-31T12:00:00+00:00
broader: http://cv.iptc.org/newscodes/mediatopic/20001365

generalforsamlingsdokumenter
type: Concept
definition: Oversigt over selskabsoplysninger og stemmerettigheder inden en generalforsamling.
in scheme: mediatopic
created: 2009-10-22T02:00:00+00:00
modified: 2023-03-31T12:00:00+00:00
broader: virksomhedsledelse

økonomisk nødstedt virksomhed
type: Concept
definition: Indikationer om, at et selskab har økonomiske vanskeligheder, men endnu ikke har indgivet konkurs.
in scheme: mediatopic
created: 2009-10-22T02:00:00+00:00
modified: 2023-03-31T12:00:00+00:00
broader: emission

restrukturering og rekapitalisering
type: Concept
definition: Ændring i en virksomheds struktur, for eksempel gennem salg eller lukning af dele af virksomheden.
in scheme: mediatopic
created: 2009-10-22T02:00:00+00:00
retired: 2023-10-02T12:00:00+00:00
modified: 2023-10-02T12:00:00+00:00
broader: emission

værdipapir
type: Concept
definition: Marked for aktier og obligationer.
in scheme: mediatopic
created: 2009-10-22T02:00:00+00:00
retired: 2023-03-31T12:00:00+00:00
modified: 2023-03-31T12:00:00+00:00
broader: emission
narrower: aktieoption

crowdfunding
type: Concept
definition: Et projekt, eller virksomhed, der er finansieret igennem små donationer fra en stor mængde mennesker, typisk igennem internettet.
in scheme: mediatopic
created: 2020-08-05T12:00:00+00:00
modified: 2023-03-31T12:00:00+00:00
broader: emission

http://cv.iptc.org/newscodes/mediatopic/20001376
type: Concept
in scheme: mediatopic
created: 2024-03-28T12:00:00+00:00
modified: 2024-03-28T12:00:00+00:00
broader: emission

aktionær
type: Concept
definition: Indehaver af en eller flere aktier i et selskab.
in scheme: mediatopic
created: 2009-10-22T02:00:00+00:00
modified: 2023-03-31T12:00:00+00:00
broader: virksomhedsledelse

aktiebegivenhed
type: Concept
definition: Meddelelser om større aktiebegivenheder, såsom opsplitning, ophørte handler, nye top- og bundnoteringer og mere.
in scheme: mediatopic
created: 2009-10-22T02:00:00+00:00
modified: 2023-03-31T12:00:00+00:00
broader: aktie

børsnotering
type: Concept
definition: Et firma udsteder aktier til offentligheden for første gang.
in scheme: mediatopic
created: 2009-10-22T02:00:00+00:00
modified: 2021-02-18T12:00:00+00:00
broader: aktie
broad match: http://cv.iptc.org/newscodes/subjectcode/04016019

nedskæringer
type: Concept
definition: Planlagt eller faktisk reduktion af personale.
in scheme: mediatopic
created: 2009-10-22T02:00:00+00:00
modified: 2021-05-05T12:00:00+00:00
broader: HR (menneskelige ressourcer)

ledelse
type: Concept
definition: Nyheder om administrerende direktør og andre ledende stillinger i en virksomhed, herunder nye ansættelser og ændringer.
in scheme: mediatopic
created: 2009-10-22T02:00:00+00:00
modified: 2023-03-31T12:00:00+00:00
broader: HR (menneskelige ressourcer)
broad match: http://cv.iptc.org/newscodes/subjectcode/04016028

aktieoption
type: Concept
definition: Retten for en medarbejder i en virksomhed til at købe eller sælge aktier til en bestemt pris på eller inden et bestemt tidspunkt.
in scheme: mediatopic
created: 2009-10-22T02:00:00+00:00
retired: 2023-03-31T12:00:00+00:00
modified: 2023-03-31T12:00:00+00:00
broader: værdipapir

forretningsaftale
type: Concept
definition: Aftale om køb eller salg, af varer, rettigheder eller fast ejendom.
in scheme: mediatopic
created: 2009-10-22T02:00:00+00:00
modified: 2021-02-18T12:00:00+00:00
broader: strategi og markedsføring

økonomisk globalisering
type: Concept
definition: Handel mellem parter i forskellige lande.
in scheme: mediatopic
created: 2009-10-22T02:00:00+00:00
modified: 2021-02-18T12:00:00+00:00
broader: strategi og markedsføring

licensaftale
type: Concept
definition: En kontrakt, der definerer betingelserne for brug af andres ejendom.
in scheme: mediatopic
created: 2009-10-22T02:00:00+00:00
retired: 2023-03-31T12:00:00+00:00
modified: 2023-03-31T12:00:00+00:00
broader: strategi og markedsføring

nyt produkt eller service
type: Concept
definition: Et produkt eller en tjeneste, der ikke tidligere er blevet tilbudt markedet.
in scheme: mediatopic
created: 2009-10-22T02:00:00+00:00
modified: 2023-03-31T12:00:00+00:00
broader: strategi og markedsføring
broad match: http://cv.iptc.org/newscodes/subjectcode/04016030

patent, ophavsret og varemærke
type: Concept
definition: Eksklusiv ret til at udnytte en opfindelse, juridisk ret for forfatteren til kun at beslutte brugen af sit arbejde og lovligt beskyttede navn eller karakteristika for varer og tjenester for en bestemt erhvervsdrivende.
in scheme: mediatopic
created: 2009-10-22T02:00:00+00:00
modified: 2023-03-31T12:00:00+00:00
broader: strategi og markedsføring

produkttilbagekaldelse
type: Concept
definition: En virksomheds beslutning om at tage et produkt tilbage eller reparere det.
in scheme: mediatopic
created: 2009-10-22T02:00:00+00:00
modified: 2021-02-18T12:00:00+00:00
broader: strategi og markedsføring

forskning og udvikling
type: Concept
definition: Udvikling af nye produkter og tjenester eller forbedring af eksisterende.
in scheme: mediatopic
created: 2009-10-22T02:00:00+00:00
modified: 2021-02-18T12:00:00+00:00
broader: strategi og markedsføring

markedsundersøgelse
type: Concept
definition: Undersøgelse af mulighederne for at sælge et bestemt produkt eller tjeneste.
in scheme: mediatopic
created: 2009-10-22T02:00:00+00:00
modified: 2023-03-31T12:00:00+00:00
broader: strategi og markedsføring

markedsudvikling
type: Concept
definition: Udviklingsretning styret af forbrugeradfærd.
in scheme: mediatopic
created: 2009-10-22T02:00:00+00:00
modified: 2023-03-31T12:00:00+00:00
broader: strategi og markedsføring

offentlig kontrakt
type: Concept
definition: En aftale, der blev indgået efter en formaliseret procedure, om erhvervelse af varer eller varer, hvor offentligheden (stat, regionsråd, kommune eller anden offentlig myndighed) står som klient.
in scheme: mediatopic
created: 2016-04-04T12:00:00+00:00
modified: 2021-07-12T12:00:00+00:00
broader: strategi og markedsføring

kunderelation
type: Concept
definition: Oprettelse og vedligeholdelse af forhold til kunder for at øge salget.
in scheme: mediatopic
created: 2016-04-04T12:00:00+00:00
modified: 2023-03-31T12:00:00+00:00
broader: strategi og markedsføring

outsourcing
type: Concept
definition: En forretningsstrategi hvor tjenester eller arbejdspladser flyttes ud til en tredjepart
in scheme: mediatopic
created: 2020-08-05T12:00:00+00:00
modified: 2021-07-12T12:00:00+00:00
broader: strategi og markedsføring

ordinær og ekstraordinær generalforsamling
type: Concept
definition: Møde med selskabets aktionærer, et aktieselskabs højeste beslutningsorgan.
in scheme: mediatopic
created: 2009-10-22T02:00:00+00:00
modified: 2023-03-31T12:00:00+00:00
broader: virksomhedsledelse

årsrapport
type: Concept
definition: Udarbejdelse af et selskabs årsregnskab og information om dets ledelse i løbet af et regnskabsår.
in scheme: mediatopic
created: 2009-10-22T02:00:00+00:00
modified: 2023-03-31T12:00:00+00:00
broader: virksomhedsledelse

bestyrelse
type: Concept
definition: Valg af eller ændringer i bestyrelsen for et selskab.
in scheme: mediatopic
created: 2009-10-22T02:00:00+00:00
modified: 2023-03-31T12:00:00+00:00
broader: virksomhedsledelse

spin-off virksomhed
type: Concept
definition: Oprettelse af nye virksomheder gennem spinoffs fra eksisterende virksomheder.
in scheme: mediatopic
created: 2009-10-22T02:00:00+00:00
modified: 2023-03-31T12:00:00+00:00
broader: http://cv.iptc.org/newscodes/mediatopic/20001366

CSR (virksomheds sociale ansvar)
type: Concept
definition: En virksomheds forretningspraksis, der afspejler ansvarlige sociale, etiske og miljømæssige politikker.
in scheme: mediatopic
created: 2019-04-06T12:00:00+00:00
modified: 2023-03-31T12:00:00+00:00
broader: virksomhedsledelse

joint venture
type: Concept
definition: Et selskab ejet af to eller flere virksomheder.
in scheme: mediatopic
created: 2009-10-22T02:00:00+00:00
modified: 2023-03-31T12:00:00+00:00
broader: http://cv.iptc.org/newscodes/mediatopic/20001366

finansielt gearet opkøb
type: Concept
definition: At tage kontrol over et selskab ved at købe dets aktier for lånte penge.
in scheme: mediatopic
created: 2009-10-22T02:00:00+00:00
modified: 2023-03-31T12:00:00+00:00
broader: http://cv.iptc.org/newscodes/mediatopic/20001366

ledelsesopkøb
type: Concept
definition: At ledelsen tager kontrol over et selskab ved at købe aktierne i virksomheden.
in scheme: mediatopic
created: 2009-10-22T02:00:00+00:00
modified: 2023-03-31T12:00:00+00:00
broader: http://cv.iptc.org/newscodes/mediatopic/20001366
broad match: http://cv.iptc.org/newscodes/subjectcode/04000000

fusion eller opkøb
type: Concept
definition: En virksomhed slår sig sammen med en anden, enten i form af en fusion eller ved opkøb.
in scheme: mediatopic
created: 2009-10-22T02:00:00+00:00
modified: 2023-03-31T12:00:00+00:00
broader: http://cv.iptc.org/newscodes/mediatopic/20001366

landbrug
type: Concept
definition: Processer til produktion af naturlige materialer til forbrug.
in scheme: mediatopic
created: 2009-10-22T02:00:00+00:00
modified: 2023-03-31T12:00:00+00:00
broader: økonomisk sektor
narrower: akvakultur
narrower: agerlandbrug
narrower: husdyrbrug
narrower: vinavl

fiskeindustri
type: Concept
definition: Opdræt eller fangst af fisk.
in scheme: mediatopic
created: 2009-10-22T02:00:00+00:00
modified: 2023-03-31T12:00:00+00:00
broader: økonomisk sektor

skovbrug og træ
type: Concept
definition: Skovbrugsvirksomheder, der anvendes til produktion af træ til efterfølgende forarbejdning og brug.
in scheme: mediatopic
created: 2009-10-22T02:00:00+00:00
modified: 2023-03-31T12:00:00+00:00
broader: økonomisk sektor

kemikalie
type: Concept
definition: Naturlige eller kunstige stoffer, der bruges til at fremstille andre materialer.
in scheme: mediatopic
created: 2009-10-22T02:00:00+00:00
modified: 2021-02-18T12:00:00+00:00
broader: økonomisk sektor
narrower: gødning
narrower: sundhed og skønhedsprodukter
narrower: uorganisk kemi
narrower: organisk kemi
narrower: http://cv.iptc.org/newscodes/mediatopic/20001395

plast og syntetisk kemikalie
type: Concept
definition: Naturlige eller fremstillede stoffer, der bruges til fremstilling af plast og andre kunstige stoffer, der bruges i fremstillingsindustrien.
in scheme: mediatopic
created: 2009-10-22T02:00:00+00:00
modified: 2023-03-31T12:00:00+00:00
broader: økonomisk sektor

informationsteknologi
type: Concept
definition: Databehandling eller overførsel af information mellem computere.
in scheme: mediatopic
created: 2009-10-22T02:00:00+00:00
modified: 2023-03-31T12:00:00+00:00
broader: økonomisk sektor
narrower: hardware
narrower: datanetværk
narrower: satellitteknologi
narrower: datasikkerhed
narrower: halvleder og aktiv komponent
narrower: software og apps
narrower: telekommunikationsudstyr
narrower: telekommunikationstjeneste
narrower: trådløs teknologi
narrower: tingenes internet

byggeri og ejendom
type: Concept
definition: Alt om bygninger og opførelse, vedligeholdelse, styring, leje og salg af dem.
in scheme: mediatopic
created: 2009-10-22T02:00:00+00:00
modified: 2021-02-18T12:00:00+00:00
broader: økonomisk sektor
narrower: bygningskonstruktion
narrower: landbrugsejendom
narrower: anlægsbyggeri
narrower: boligbyggeri
narrower: jordpris
narrower: fast ejendom
narrower: byggematerialer
narrower: infrastrukturprojekter
narrower: erhvervsbyggeri
narrower: http://cv.iptc.org/newscodes/mediatopic/20001367
narrower: http://cv.iptc.org/newscodes/mediatopic/20001368

forbrugsvare
type: Concept
definition: Varer, der er produceret til og solgt til enkeltpersoner.
in scheme: mediatopic
created: 2009-10-22T02:00:00+00:00
modified: 2021-02-18T12:00:00+00:00
broader: økonomisk sektor
narrower: drikkevare
narrower: tøj
narrower: mad
narrower: luksusvare
narrower: Ikke-varigt forbrugsgode
narrower: legetøj
narrower: fødevareindustri
narrower: møbler og indretning
narrower: tobak
narrower: kunsthåndværk
narrower: kæledyrsprodukter og pleje
narrower: forbrugerelektronik

energi og ressourcer
type: Concept
definition: Brug af naturlige ressourcer til plandt andet produktion og energiudvinding.
in scheme: mediatopic
created: 2009-10-22T02:00:00+00:00
modified: 2023-03-31T12:00:00+00:00
broader: økonomisk sektor
narrower: alternativ energi
narrower: kul
narrower: energiindustri
narrower: atomkraft
narrower: olie og gas - nedstrømsaktivitet
narrower: olie og gas - opstrømsaktivitet
narrower: biobrændstof
narrower: olie- og gasindustrien

finans- og servicesektor
type: Concept
definition: Tjenester, der overfører, beskytter eller holder styr på penge og andre finansielle instrumenter eller leverer backup til kommercielle virksomheder.
in scheme: mediatopic
created: 2009-10-22T02:00:00+00:00
retired: 2023-03-31T12:00:00+00:00
modified: 2023-03-31T12:00:00+00:00
broader: økonomisk sektor
narrower: bedemandsforretning og krematorium
narrower: privatøkonomi
narrower: personlig indkomst
narrower: trykning og salgsfremstød

fremstilling og teknik
type: Concept
definition: Producent af elektronisk og mekanisk udstyr.
in scheme: mediatopic
created: 2009-10-22T02:00:00+00:00
modified: 2021-02-18T12:00:00+00:00
broader: økonomisk sektor
narrower: fly- og rumfartsindustri
narrower: bilindustri
narrower: forsvarsudstyr
narrower: elektrisk udstyr
narrower: sværindustri
narrower: industriel komponent
narrower: instrumentteknik
narrower: maskinfremstilling
narrower: skibsbyggeri
narrower: kapitalgode
narrower: jernbanefremstilling

medie
type: Concept
definition: Forskellige måder at distribuere og præsentere nyheder til offentligheden.
in scheme: mediatopic
created: 2009-10-22T02:00:00+00:00
modified: 2023-03-31T12:00:00+00:00
broader: økonomisk sektor
narrower: reklame
narrower: bogbranche
narrower: filmbranche
narrower: musikbranche
narrower: nyhedsbureau
narrower: avis og magasin
narrower: online-mediebranche
narrower: PR
narrower: radiobranche
narrower: satellit- og kabeltjeneste
narrower: tv-branche
narrower: streaming tjeneste
narrower: http://cv.iptc.org/newscodes/mediatopic/20001369
narrower: http://cv.iptc.org/newscodes/mediatopic/20001372

metal og mineral
type: Concept
definition: Berigelse af malm til produktion af metaller.
in scheme: mediatopic
created: 2009-10-22T02:00:00+00:00
modified: 2023-03-31T12:00:00+00:00
broader: økonomisk sektor
narrower: guld og dyrebart materiale
narrower: jern og stål
narrower: minedrift
narrower: ikke-jernholdigt metal

procesindustri
type: Concept
definition: Kommercielle virksomheder, der omdanner råvarer til nyttige produkter. Det drejer sig blandt andet om kemisk industri og medicinalbranchen.
in scheme: mediatopic
created: 2009-10-22T02:00:00+00:00
retired: 2023-03-31T12:00:00+00:00
modified: 2023-03-31T12:00:00+00:00
broader: økonomisk sektor
narrower: destilleri og bryggeri
narrower: papir og emballage
narrower: gummiprodukt
narrower: læskedrik
narrower: tekstil og tøj
narrower: e-cigaret

turisme og fritid
type: Concept
definition: Industrien for turisme og fritid.
in scheme: mediatopic
created: 2009-10-22T02:00:00+00:00
modified: 2023-03-31T12:00:00+00:00
broader: økonomisk sektor
narrower: gambling og spil
narrower: hotel og indkvartering
narrower: sports- og fritidsprodukt
narrower: restaurant og catering
narrower: rejsearrangør

transport
type: Concept
definition: Forskellige måder at flytte mennesker og varer på fra et sted til et andet.
in scheme: mediatopic
created: 2009-10-22T02:00:00+00:00
modified: 2023-03-31T12:00:00+00:00
broader: økonomisk sektor
narrower: lufttransport
narrower: jernbanetransport
narrower: vejtransport
narrower: trafik
narrower: vandvej og søtransport
narrower: logistik
narrower: http://cv.iptc.org/newscodes/mediatopic/20001362
narrower: http://cv.iptc.org/newscodes/mediatopic/20001363
narrower: http://cv.iptc.org/newscodes/mediatopic/20001364

forsyningsvirksomheder
type: Concept
definition: Virksomhed, der leverer offentlig forsyning i form af el, vand og varme eller som sørger for renovation og kloak.
in scheme: mediatopic
created: 2019-07-25T12:00:00+00:00
modified: 2023-03-31T12:00:00+00:00
broader: økonomisk sektor
narrower: elproduktion og distribution
narrower: affaldshåndtering og forureningskontrol
narrower: vandforsyning
narrower: fjernvarme og fjernkøling

salgskanaler
type: Concept
definition: Måder, hvormed man sikrer, at ens varer kan købes af interesserede kunder.
in scheme: mediatopic
created: 2019-11-25T12:00:00+00:00
modified: 2023-03-31T12:00:00+00:00
broader: økonomisk sektor
narrower: detailhandel
narrower: engrossalg
narrower: auktion

http://cv.iptc.org/newscodes/mediatopic/20001354
type: Concept
in scheme: mediatopic
created: 2022-06-14T12:00:00+00:00
modified: 2022-06-14T12:00:00+00:00
broader: økonomisk sektor
narrower: bioteknologisk virksomhed
narrower: medicinalvirksomhed
narrower: privat sundhedsforsikring
narrower: medicinsk udstyr

http://cv.iptc.org/newscodes/mediatopic/20001370
type: Concept
in scheme: mediatopic
created: 2023-03-31T12:00:00+00:00
modified: 2023-03-31T12:00:00+00:00
broader: økonomisk sektor
narrower: bogføring og revision
narrower: bank
narrower: forsikring
narrower: investeringsrådgivning
narrower: personlig investering
narrower: børsmægling
narrower: lån
narrower: kapitalforvaltning

http://cv.iptc.org/newscodes/mediatopic/20001371
type: Concept
in scheme: mediatopic
created: 2023-03-31T12:00:00+00:00
modified: 2023-03-31T12:00:00+00:00
broader: økonomisk sektor
narrower: konsulenttjeneste
narrower: arbejdsformidling
narrower: rengøring
narrower: juridisk tjeneste
narrower: skønhedspleje
narrower: udlejningsfirma
narrower: kurer- og transporttjeneste
narrower: bryllupsservice
narrower: messe
narrower: betalingstjeneste

akvakultur
type: Concept
definition: Dyrkning i vand af fisk, skaldyr og alger.
in scheme: mediatopic
created: 2009-10-22T02:00:00+00:00
retired: 2023-03-31T12:00:00+00:00
modified: 2023-03-31T12:00:00+00:00
broader: landbrug

agerlandbrug
type: Concept
definition: Udnyttelse af jord til agerbrug eller græsning til produktion af fødevarer, foder og råvarer til energiformål eller til videre industriel forarbejdning eller forarbejdning.
in scheme: mediatopic
created: 2009-10-22T02:00:00+00:00
retired: 2023-03-31T12:00:00+00:00
modified: 2023-03-31T12:00:00+00:00
broader: landbrug

husdyrbrug
type: Concept
definition: Avl af dyr til produktion af mad eller pels.
in scheme: mediatopic
created: 2009-10-22T02:00:00+00:00
retired: 2023-03-31T12:00:00+00:00
modified: 2023-03-31T12:00:00+00:00
broader: landbrug

vinavl
type: Concept
definition: Produktionen af vin, fra druer til det færdige produkt.
in scheme: mediatopic
created: 2009-10-22T02:00:00+00:00
retired: 2023-03-31T12:00:00+00:00
modified: 2023-03-31T12:00:00+00:00
broader: landbrug

gødning
type: Concept
definition: Naturligt eller fremstillet materiale, der tilføres jorden for at øge udbyttet.
in scheme: mediatopic
created: 2009-10-22T02:00:00+00:00
retired: 2023-03-31T12:00:00+00:00
modified: 2023-03-31T12:00:00+00:00
broader: kemikalie

sundhed og skønhedsprodukter
type: Concept
definition: Produkter, der bruges til at fremhæve en persons udseende eller duft.
in scheme: mediatopic
created: 2009-10-22T02:00:00+00:00
retired: 2023-03-31T12:00:00+00:00
modified: 2023-03-31T12:00:00+00:00
broader: kemikalie

uorganisk kemi
type: Concept
definition: Den del af kemi, der beskæftiger sig med mineraler og metaller.
in scheme: mediatopic
created: 2009-10-22T02:00:00+00:00
retired: 2023-03-31T12:00:00+00:00
modified: 2023-03-31T12:00:00+00:00
broader: kemikalie

organisk kemi
type: Concept
definition: Den del af kemi, der beskæftiger sig med mennesker, dyr og kulstofbaserede stoffer.
in scheme: mediatopic
created: 2009-10-22T02:00:00+00:00
retired: 2023-03-31T12:00:00+00:00
modified: 2023-03-31T12:00:00+00:00
broader: kemikalie

http://cv.iptc.org/newscodes/mediatopic/20001395
type: Concept
in scheme: mediatopic
created: 2025-10-09T12:00:00+00:00
modified: 2025-10-09T12:00:00+00:00
broader: kemikalie

bioteknologisk virksomhed
type: Concept
definition: Den tekniske udnyttelse af celler og cellulære komponenter til at producere eller ændre produkter, der bruges i blandt andet sundhedspleje, fødevarestyring og landbrug.
in scheme: mediatopic
created: 2009-10-22T02:00:00+00:00
modified: 2022-06-14T12:00:00+00:00
broader: http://cv.iptc.org/newscodes/mediatopic/20001354

medicinalvirksomhed
type: Concept
definition: Fremstilling af medicin fra forskellige kemikalier og naturlige stoffer.
in scheme: mediatopic
created: 2009-10-22T02:00:00+00:00
modified: 2023-03-31T12:00:00+00:00
broader: http://cv.iptc.org/newscodes/mediatopic/20001354

hardware
type: Concept
definition: Computerudstyr.
in scheme: mediatopic
created: 2009-10-22T02:00:00+00:00
modified: 2023-03-31T12:00:00+00:00
broader: informationsteknologi

datanetværk
type: Concept
definition: Kommunikationsnetværk specielt designet til datatransmission.
in scheme: mediatopic
created: 2009-10-22T02:00:00+00:00
retired: 2023-03-31T12:00:00+00:00
modified: 2023-03-31T12:00:00+00:00
broader: informationsteknologi

satellitteknologi
type: Concept
definition: Hardware og software, der muliggør kommunikation mellem enheder placeret på Jorden og satellitter i kredsløb omkring Jorden.
in scheme: mediatopic
created: 2009-10-22T02:00:00+00:00
modified: 2021-05-05T12:00:00+00:00
broader: informationsteknologi

datasikkerhed
type: Concept
definition: Alt om sikkerhed for datasystemer.
in scheme: mediatopic
created: 2009-10-22T02:00:00+00:00
retired: 2023-03-31T12:00:00+00:00
modified: 2023-03-31T12:00:00+00:00
broader: informationsteknologi

halvleder og aktiv komponent
type: Concept
definition: Grundlæggende komponenter, der sammen bliver fungerende elektriske apparater, såsom computere.
in scheme: mediatopic
created: 2009-10-22T02:00:00+00:00
modified: 2023-03-31T12:00:00+00:00
broader: informationsteknologi

software og apps
type: Concept
definition: Elektroniske programmer , der installeres på blandt andet computere eller mobiltelefoner.
in scheme: mediatopic
created: 2009-10-22T02:00:00+00:00
modified: 2023-03-31T12:00:00+00:00
broader: informationsteknologi

telekommunikationsudstyr
type: Concept
definition: Varer, der letter transmissionen af data eller stemmemeddelelser, såsom telefoner, switches og modemmer.
in scheme: mediatopic
created: 2009-10-22T02:00:00+00:00
retired: 2023-03-31T12:00:00+00:00
modified: 2023-03-31T12:00:00+00:00
broader: informationsteknologi

telekommunikationstjeneste
type: Concept
definition: Tjeneste leveret af kommercielle virksomheder for at lette kommunikationen mellem telefoner eller computere.
in scheme: mediatopic
created: 2009-10-22T02:00:00+00:00
modified: 2023-03-31T12:00:00+00:00
broader: informationsteknologi

trådløs teknologi
type: Concept
definition: Overførsel af information på andre måder end via kabler.
in scheme: mediatopic
created: 2009-10-22T02:00:00+00:00
modified: 2024-07-01T12:00:00+00:00
broader: informationsteknologi

tingenes internet
type: Concept
definition: Produkter med indbygget elektronik og internetforbindelse, der gør det muligt for dem at kontrollere eller udveksle data over netværket.
in scheme: mediatopic
created: 2016-04-04T12:00:00+00:00
retired: 2023-03-31T12:00:00+00:00
modified: 2023-03-31T12:00:00+00:00
broader: informationsteknologi

bygningskonstruktion
type: Concept
definition: Undersøgelse foretaget af ingeniører og arkitekter, der beskriver, hvor og hvordan noget skal bygges.
in scheme: mediatopic
created: 2009-10-22T02:00:00+00:00
retired: 2023-03-31T12:00:00+00:00
modified: 2023-03-31T12:00:00+00:00
broader: byggeri og ejendom

landbrugsejendom
type: Concept
definition: Landbrugsområder til fødevareproduktion, herunder mejeriprodukter, frugt, husdyr og fisk.
in scheme: mediatopic
created: 2009-10-22T02:00:00+00:00
retired: 2019-10-07T12:00:00+00:00
modified: 2023-03-31T12:00:00+00:00
broader: byggeri og ejendom

anlægsbyggeri
type: Concept
definition: Store byggeprojekter som veje, dæmninger, kontor- og fabriksbygninger og arenaer.
in scheme: mediatopic
created: 2009-10-22T02:00:00+00:00
retired: 2019-07-25T12:00:00+00:00
modified: 2023-03-31T12:00:00+00:00
broader: byggeri og ejendom

boligbyggeri
type: Concept
definition: Opførelse af boliger til privat brug.
in scheme: mediatopic
created: 2009-10-22T02:00:00+00:00
retired: 2023-03-31T12:00:00+00:00
modified: 2023-03-31T12:00:00+00:00
broader: byggeri og ejendom

jordpris
type: Concept
definition: Prisen på jord til specifik brug (kommerciel, bolig, landbrug).
in scheme: mediatopic
created: 2009-10-22T02:00:00+00:00
retired: 2023-03-31T12:00:00+00:00
modified: 2023-03-31T12:00:00+00:00
broader: byggeri og ejendom

fast ejendom
type: Concept
definition: Køb, salg og udlejning af ejendomme.
in scheme: mediatopic
created: 2009-10-22T02:00:00+00:00
retired: 2023-03-31T12:00:00+00:00
modified: 2023-03-31T12:00:00+00:00
broader: byggeri og ejendom

byggematerialer
type: Concept
definition: Fremstilling af materialer, der bruges i byggebranchen.
in scheme: mediatopic
created: 2009-10-22T02:00:00+00:00
modified: 2023-03-31T12:00:00+00:00
broader: byggeri og ejendom

infrastrukturprojekter
type: Concept
definition: Byggeri af grundlæggende faciliteter som veje, broer, tunneller, telekommunikation og el-net.
in scheme: mediatopic
created: 2019-07-25T12:00:00+00:00
modified: 2021-07-12T12:00:00+00:00
broader: byggeri og ejendom

erhvervsbyggeri
type: Concept
definition: Bygninger, der er beregnet til erhvervsbrug. Det kan være kontorbyggeri, butikker, restauranter og hoteller.
in scheme: mediatopic
created: 2019-07-25T12:00:00+00:00
retired: 2023-03-31T12:00:00+00:00
modified: 2023-03-31T12:00:00+00:00
broader: byggeri og ejendom

http://cv.iptc.org/newscodes/mediatopic/20001367
type: Concept
in scheme: mediatopic
created: 2023-03-31T12:00:00+00:00
modified: 2023-03-31T12:00:00+00:00
broader: byggeri og ejendom

http://cv.iptc.org/newscodes/mediatopic/20001368
type: Concept
in scheme: mediatopic
created: 2023-03-31T12:00:00+00:00
modified: 2023-03-31T12:00:00+00:00
broader: byggeri og ejendom

drikkevare
type: Concept
definition: Drikkelig væske, med eller uden alkohol.
in scheme: mediatopic
created: 2009-10-22T02:00:00+00:00
retired: 2023-03-31T12:00:00+00:00
modified: 2023-03-31T12:00:00+00:00
broader: forbrugsvare

tøj
type: Concept
definition: Tøj, som folk bruger på kroppen, såsom sweatere, skjorter, nederdele, kjoler og bukser.
in scheme: mediatopic
created: 2009-10-22T02:00:00+00:00
modified: 2023-03-31T12:00:00+00:00
broader: forbrugsvare

mad
type: Concept
definition: Salg af madvarer.
in scheme: mediatopic
created: 2009-10-22T02:00:00+00:00
retired: 2023-03-31T12:00:00+00:00
modified: 2023-03-31T12:00:00+00:00
broader: forbrugsvare

luksusvare
type: Concept
definition: Varer, der sælges til en høj pris, såsom lædertasker og smykker.
in scheme: mediatopic
created: 2009-10-22T02:00:00+00:00
modified: 2023-03-31T12:00:00+00:00
broader: forbrugsvare

Ikke-varigt forbrugsgode
type: Concept
definition: Produkter, der kun er beregnet til at blive brugt i en kort periode.
in scheme: mediatopic
created: 2009-10-22T02:00:00+00:00
retired: 2023-03-31T12:00:00+00:00
modified: 2023-03-31T12:00:00+00:00
broader: forbrugsvare

legetøj
type: Concept
definition: Salg af legetøj.
in scheme: mediatopic
created: 2009-10-22T02:00:00+00:00
modified: 2023-03-31T12:00:00+00:00
broader: forbrugsvare

fødevareindustri
type: Concept
definition: Produktion, distribution og salg af fødevarer.
in scheme: mediatopic
created: 2009-10-22T02:00:00+00:00
modified: 2023-03-31T12:00:00+00:00
broader: forbrugsvare

møbler og indretning
type: Concept
definition: Fremstilling af møbler, tapet, maling og andre materialer til indretning.
in scheme: mediatopic
created: 2009-10-22T02:00:00+00:00
modified: 2023-03-31T12:00:00+00:00
broader: forbrugsvare

tobak
type: Concept
definition: Dyrkning, produktion og salg af tobak.
in scheme: mediatopic
created: 2009-10-22T02:00:00+00:00
modified: 2023-03-31T12:00:00+00:00
broader: forbrugsvare

kunsthåndværk
type: Concept
definition: Salg af produkter eller tjenester produceret ved hjælp af enkle metoder og værktøjer i modsætning til industriel masseproduktion.
in scheme: mediatopic
created: 2016-04-04T12:00:00+00:00
modified: 2023-03-31T12:00:00+00:00
broader: forbrugsvare

kæledyrsprodukter og pleje
type: Concept
definition: Hygiejneprodukter samt pleje og ernæring til dyr, der lever under menneskelig pleje og kontrol.
in scheme: mediatopic
created: 2016-04-04T12:00:00+00:00
modified: 2023-03-31T12:00:00+00:00
broader: forbrugsvare

forbrugerelektronik
type: Concept
definition: Elektroniske apparater som computere, mobiltelefoner og fjernsyn, som bliver solgt til privat brug.
in scheme: mediatopic
created: 2019-08-02T12:00:00+00:00
modified: 2021-07-12T12:00:00+00:00
broader: forbrugsvare

stormagasin
type: Concept
definition: Forretning opdelt i flere mindre butikker under samme tag.
in scheme: mediatopic
created: 2009-10-22T02:00:00+00:00
modified: 2021-02-18T12:00:00+00:00
broader: detailhandel

detailhandel
type: Concept
definition: Virksomheder, der sælger til private husholdninger.
in scheme: mediatopic
created: 2009-10-22T02:00:00+00:00
modified: 2023-03-31T12:00:00+00:00
broader: salgskanaler
narrower: stormagasin
narrower: e-handel
narrower: postordre
narrower: specialbutik
narrower: storcenter
narrower: butiksstrøg

e-handel
type: Concept
definition: Varer købt eller solgt ved hjælp af internettjenester.
in scheme: mediatopic
created: 2009-10-22T02:00:00+00:00
modified: 2023-03-31T12:00:00+00:00
broader: detailhandel

postordre
type: Concept
definition: Varer solgt gennem og leveret pr. post.
in scheme: mediatopic
created: 2009-10-22T02:00:00+00:00
retired: 2023-03-31T12:00:00+00:00
modified: 2023-03-31T12:00:00+00:00
broader: detailhandel

specialbutik
type: Concept
definition: Forhandlere, der specialiserer sig i en bestemt kategori, såsom sko eller værktøj.
in scheme: mediatopic
created: 2009-10-22T02:00:00+00:00
modified: 2021-05-05T12:00:00+00:00
broader: detailhandel

storcenter
type: Concept
definition: En stor bygning eller flere forbundne bygninger, der indeholder en blanding af detailbutikker og spisesteder.
in scheme: mediatopic
created: 2020-08-05T12:00:00+00:00
modified: 2021-07-12T12:00:00+00:00
broader: detailhandel

butiksstrøg
type: Concept
definition: En bygade, der indeholder flere butikker og restauranter
in scheme: mediatopic
created: 2020-08-05T12:00:00+00:00
modified: 2021-07-12T12:00:00+00:00
broader: detailhandel

engrossalg
type: Concept
definition: Det første led i salgskæden efter produktion.
in scheme: mediatopic
created: 2009-10-22T02:00:00+00:00
modified: 2023-03-31T12:00:00+00:00
broader: salgskanaler

alternativ energi
type: Concept
definition: Den kommercielle virksomhed, der producerer energi uden at ødelægge miljøet.
in scheme: mediatopic
created: 2009-10-22T02:00:00+00:00
modified: 2023-03-31T12:00:00+00:00
broader: energi og ressourcer
narrower: geotermisk energi
narrower: solenergi
narrower: vandkraft
narrower: vindkraft

kul
type: Concept
definition: Produktion og minedrift af antracit og bituminøse produkter til anvendelse i kraftproduktion.
in scheme: mediatopic
created: 2009-10-22T02:00:00+00:00
modified: 2021-02-18T12:00:00+00:00
broader: energi og ressourcer

energiindustri
type: Concept
definition: Produktion af energi uden fokus på nogen bestemt sektor.
in scheme: mediatopic
created: 2009-10-22T02:00:00+00:00
retired: 2019-07-25T12:00:00+00:00
modified: 2021-07-12T12:00:00+00:00
broader: energi og ressourcer

atomkraft
type: Concept
definition: Brug af radioaktivt materiale til produktion af elektricitet eller varme.
in scheme: mediatopic
created: 2009-10-22T02:00:00+00:00
modified: 2021-07-12T12:00:00+00:00
broader: energi og ressourcer

olie og gas - nedstrømsaktivitet
type: Concept
definition: Alt relateret til olie og gas fra raffinaderiet til distribution.
in scheme: mediatopic
created: 2009-10-22T02:00:00+00:00
retired: 2019-07-25T12:00:00+00:00
modified: 2021-05-05T12:00:00+00:00
broader: energi og ressourcer

olie og gas - opstrømsaktivitet
type: Concept
definition: Alt relateret til olie og gas fra indsamlingen til raffinaderiet.
in scheme: mediatopic
created: 2009-10-22T02:00:00+00:00
retired: 2019-07-25T12:00:00+00:00
modified: 2021-05-05T12:00:00+00:00
broader: energi og ressourcer

biobrændstof
type: Concept
definition: Brændstof produceret af produkter fra biologiske processer i stedet for brændstof produceret baseret på geologiske processer som fossile brændstoffer, kul osv.
in scheme: mediatopic
created: 2019-04-06T12:00:00+00:00
modified: 2023-03-31T12:00:00+00:00
broader: energi og ressourcer

olie- og gasindustrien
type: Concept
definition: Virksomhed, der opsporer, udvinder, raffinerer, transporterer og sælger petrokemiske produkter.
in scheme: mediatopic
created: 2019-07-25T12:00:00+00:00
modified: 2023-03-31T12:00:00+00:00
broader: energi og ressourcer
narrower: dieselbrændstof
narrower: petroleum og paraffin
narrower: naturgas
narrower: benzin

geotermisk energi
type: Concept
definition: Energi opnået fra geotermiske processer, hvor varme opbevares i jordskorpen.
in scheme: mediatopic
created: 2019-04-06T12:00:00+00:00
modified: 2023-03-31T12:00:00+00:00
broader: alternativ energi

solenergi
type: Concept
definition: Elektricitet produceret og genereret fra solens stråler.
in scheme: mediatopic
created: 2019-04-06T12:00:00+00:00
modified: 2023-03-31T12:00:00+00:00
broader: alternativ energi

vandkraft
type: Concept
definition: Energi genereret ved at føre vand gennem turbiner. Vandet opsamles ofte i damme, så strømmen kan reguleres efter behov.
in scheme: mediatopic
created: 2019-04-06T12:00:00+00:00
modified: 2023-03-31T12:00:00+00:00
broader: alternativ energi

vindkraft
type: Concept
definition: Energi, der genereres i turbiner, der sættes i gang af vind, der driver en eller anden form for propel.
in scheme: mediatopic
created: 2019-04-06T12:00:00+00:00
modified: 2023-03-31T12:00:00+00:00
broader: alternativ energi

dieselbrændstof
type: Concept
definition: Brændstof til dieselmotorer og opvarmningsanlæg, der består af relativt flygtige fyringsolier, såsom tung olie.
in scheme: mediatopic
created: 2009-10-22T02:00:00+00:00
modified: 2023-03-31T12:00:00+00:00
broader: olie- og gasindustrien

elproduktion og distribution
type: Concept
definition: Elnettet og salg af elektricitet på engros- og detailniveau.
in scheme: mediatopic
created: 2009-10-22T02:00:00+00:00
modified: 2023-03-31T12:00:00+00:00
broader: forsyningsvirksomheder

petroleum og paraffin
type: Concept
definition: Et olieprodukt, der ofte bruges som motorbrændstof i alt fra både til jetfly, men også som brændstof i lamper.
in scheme: mediatopic
created: 2009-10-22T02:00:00+00:00
retired: 2023-03-31T12:00:00+00:00
modified: 2023-03-31T12:00:00+00:00
broader: olie- og gasindustrien

naturgas
type: Concept
definition: Brændbar gas opnået fra jorden og dannet ved nedbrydning af organiske stoffer bruges som brændstof og industrielt råmateriale.
in scheme: mediatopic
created: 2009-10-22T02:00:00+00:00
modified: 2023-03-31T12:00:00+00:00
broader: olie- og gasindustrien

benzin
type: Concept
definition: Destilleret olieprodukt, der bruges til bilbrændstof, med eller uden tilsætningsstoffer.
in scheme: mediatopic
created: 2009-10-22T02:00:00+00:00
modified: 2021-02-18T12:00:00+00:00
broader: olie- og gasindustrien

affaldshåndtering og forureningskontrol
type: Concept
definition: De kommercielle aktiviteter, der håndterer affald og overvåger emissioner.
in scheme: mediatopic
created: 2009-10-22T02:00:00+00:00
modified: 2023-03-31T12:00:00+00:00
broader: forsyningsvirksomheder

vandforsyning
type: Concept
definition: Den kommercielle aktivitet, der forsyner folk med rent vand.
in scheme: mediatopic
created: 2009-10-22T02:00:00+00:00
modified: 2023-03-31T12:00:00+00:00
broader: forsyningsvirksomheder

bedemandsforretning og krematorium
type: Concept
definition: Virksomheder, der leverer tjenester til håndtering af afdøde personer.
in scheme: mediatopic
created: 2009-10-22T02:00:00+00:00
retired: 2023-03-31T12:00:00+00:00
modified: 2023-03-31T12:00:00+00:00
broader: finans- og servicesektor

privatøkonomi
type: Concept
definition: Den enkeltes indkomst, udgifter, aktiver og forpligtelser.
in scheme: mediatopic
created: 2009-10-22T02:00:00+00:00
retired: 2023-03-31T12:00:00+00:00
modified: 2023-03-31T12:00:00+00:00
broader: finans- og servicesektor

personlig indkomst
type: Concept
definition: Penge, som en person tjener, og som han er fri til at bruge.
in scheme: mediatopic
created: 2009-10-22T02:00:00+00:00
retired: 2023-03-31T12:00:00+00:00
modified: 2023-03-31T12:00:00+00:00
broader: finans- og servicesektor

trykning og salgsfremstød
type: Concept
definition: Produktion af trykte materialer såsom skilte, flyers og reklamer.
in scheme: mediatopic
created: 2009-10-22T02:00:00+00:00
retired: 2023-03-31T12:00:00+00:00
modified: 2023-03-31T12:00:00+00:00
broader: finans- og servicesektor

bogføring og revision
type: Concept
definition: Tjenester, der hjælper med systematisk at rapportere økonomiske forhold og gennemgå, at regnskaberne er pålidelige.
in scheme: mediatopic
created: 2009-10-22T02:00:00+00:00
modified: 2023-03-31T12:00:00+00:00
broader: http://cv.iptc.org/newscodes/mediatopic/20001370

auktion
type: Concept
definition: Tjenester, hvor varer sælges, og hvor køberne gradvis byder højere, og varerne sælges til den højeste byder.
in scheme: mediatopic
created: 2009-10-22T02:00:00+00:00
modified: 2023-03-31T12:00:00+00:00
broader: salgskanaler

bank
type: Concept
definition: Tjenester til opbevaring, transmission, modtagelse og levering af kontanter.
in scheme: mediatopic
created: 2009-10-22T02:00:00+00:00
modified: 2023-03-31T12:00:00+00:00
broader: http://cv.iptc.org/newscodes/mediatopic/20001370

konsulenttjeneste
type: Concept
definition: Udbydere af ekspertviden inden for et specifikt område, normalt i en aftalt periode.
in scheme: mediatopic
created: 2009-10-22T02:00:00+00:00
modified: 2023-03-31T12:00:00+00:00
broader: http://cv.iptc.org/newscodes/mediatopic/20001371

arbejdsformidling
type: Concept
definition: Tjenester, der hjælper folk med at finde et job og hjælpe virksomheder med at finde arbejde.
in scheme: mediatopic
created: 2009-10-22T02:00:00+00:00
modified: 2023-03-31T12:00:00+00:00
broader: http://cv.iptc.org/newscodes/mediatopic/20001371

privat sundhedsforsikring
type: Concept
definition: Virksomheder, der leverer sundhedsydelser.
in scheme: mediatopic
created: 2009-10-22T02:00:00+00:00
modified: 2022-06-14T12:00:00+00:00
broader: http://cv.iptc.org/newscodes/mediatopic/20001354

forsikring
type: Concept
definition: Tjenester, der tillader enkeltpersoner at betale små beløb regelmæssigt for at beskytte sig økonomisk mod større uventede begivenheder.
in scheme: mediatopic
created: 2009-10-22T02:00:00+00:00
modified: 2023-03-31T12:00:00+00:00
broader: http://cv.iptc.org/newscodes/mediatopic/20001370

investeringsrådgivning
type: Concept
definition: Virksomheder, der rådgiver om, hvordan en enkeltperson eller virksomhed skal investere.
in scheme: mediatopic
created: 2009-10-22T02:00:00+00:00
modified: 2023-03-31T12:00:00+00:00
broader: http://cv.iptc.org/newscodes/mediatopic/20001370

rengøring
type: Concept
definition: Virksomheder, der udfører rengøring af boliger eller forretningslokaler.
in scheme: mediatopic
created: 2009-10-22T02:00:00+00:00
retired: 2023-03-31T12:00:00+00:00
modified: 2023-03-31T12:00:00+00:00
broader: http://cv.iptc.org/newscodes/mediatopic/20001371

juridisk tjeneste
type: Concept
definition: Tjenester, der hjælper enkeltpersoner eller virksomheder med at fortolke og forholde sig til nationale, regionale eller lokale love.
in scheme: mediatopic
created: 2009-10-22T02:00:00+00:00
modified: 2023-03-31T12:00:00+00:00
broader: http://cv.iptc.org/newscodes/mediatopic/20001371

personlig investering
type: Concept
definition: Den enkeltes finansielle investeringer.
in scheme: mediatopic
created: 2009-10-22T02:00:00+00:00
modified: 2023-03-31T12:00:00+00:00
broader: http://cv.iptc.org/newscodes/mediatopic/20001370

skønhedspleje
type: Concept
definition: Tjenester til at tage sig af den enkeltes krop, såsom frisør, massage og neglepleje.
in scheme: mediatopic
created: 2009-10-22T02:00:00+00:00
retired: 2023-03-31T12:00:00+00:00
modified: 2023-03-31T12:00:00+00:00
broader: http://cv.iptc.org/newscodes/mediatopic/20001371

udlejningsfirma
type: Concept
definition: Virksomheder, der udlejer eksempelvis biler, boliger, tøj og værktøj.
in scheme: mediatopic
created: 2009-10-22T02:00:00+00:00
modified: 2023-03-31T12:00:00+00:00
broader: http://cv.iptc.org/newscodes/mediatopic/20001371

kurer- og transporttjeneste
type: Concept
definition: Virksomheder, der forbereder og sender pakker og dokumenter til enkeltpersoner eller virksomheder.
in scheme: mediatopic
created: 2009-10-22T02:00:00+00:00
modified: 2023-03-31T12:00:00+00:00
broader: http://cv.iptc.org/newscodes/mediatopic/20001371

børsmægling
type: Concept
definition: Tjenester til at købe og sælge aktier til enkeltpersoner eller andre enheder.
in scheme: mediatopic
created: 2009-10-22T02:00:00+00:00
modified: 2023-03-31T12:00:00+00:00
broader: http://cv.iptc.org/newscodes/mediatopic/20001370

bryllupsservice
type: Concept
definition: Varer og tjenester til at gennemføre en vielse med tilhørende festligheder.
in scheme: mediatopic
created: 2009-10-22T02:00:00+00:00
retired: 2023-03-31T12:00:00+00:00
modified: 2023-03-31T12:00:00+00:00
broader: http://cv.iptc.org/newscodes/mediatopic/20001371

fly- og rumfartsindustri
type: Concept
definition: Produktion af fly og rumfartøjer og komponenter, der er nødvendige for at fremstille dem.
in scheme: mediatopic
created: 2009-10-22T02:00:00+00:00
modified: 2021-02-18T12:00:00+00:00
broader: fremstilling og teknik

bilindustri
type: Concept
definition: Produktion af biler og komponenter, der er nødvendige for at fremstille biler.
in scheme: mediatopic
created: 2009-10-22T02:00:00+00:00
modified: 2021-02-18T12:00:00+00:00
broader: fremstilling og teknik

forsvarsudstyr
type: Concept
definition: Produktion af våben, tanks, kanoner, skibe og mere til brug af militære og ikke-militære forsvarsstyrker.
in scheme: mediatopic
created: 2009-10-22T02:00:00+00:00
modified: 2023-03-31T12:00:00+00:00
broader: fremstilling og teknik

elektrisk udstyr
type: Concept
definition: Produktion af store og små elektroniske varer til brug i hjemmet eller virksomheden.
in scheme: mediatopic
created: 2009-10-22T02:00:00+00:00
modified: 2021-02-18T12:00:00+00:00
broader: fremstilling og teknik

sværindustri
type: Concept
definition: Produktion af kraner, bulldozere og lignende til anvendelse i store byggeprojekter.
in scheme: mediatopic
created: 2009-10-22T02:00:00+00:00
modified: 2023-03-31T12:00:00+00:00
broader: fremstilling og teknik

industriel komponent
type: Concept
definition: Produktion af mekaniske, elektroniske eller elektriske produkter, der er nødvendige for at fremstille andre produkter.
in scheme: mediatopic
created: 2009-10-22T02:00:00+00:00
retired: 2023-03-31T12:00:00+00:00
modified: 2023-03-31T12:00:00+00:00
broader: fremstilling og teknik

instrumentteknik
type: Concept
definition: Produktion af instrumenter til kalibrering og måling af fx hastighed, tryk og afstand.
in scheme: mediatopic
created: 2009-10-22T02:00:00+00:00
retired: 2023-03-31T12:00:00+00:00
modified: 2023-03-31T12:00:00+00:00
broader: fremstilling og teknik

maskinfremstilling
type: Concept
definition: Produktion af turbiner, motorer, ventilatorer, pumper og andre komponenter til motordrevet udstyr.
in scheme: mediatopic
created: 2009-10-22T02:00:00+00:00
modified: 2023-03-31T12:00:00+00:00
broader: fremstilling og teknik

skibsbyggeri
type: Concept
definition: Produktion af skibe, ubåde og pramme.
in scheme: mediatopic
created: 2009-10-22T02:00:00+00:00
modified: 2023-03-31T12:00:00+00:00
broader: fremstilling og teknik

kapitalgode
type: Concept
definition: Holdbare produkter, der bruges til produktion af andre varer eller tjenester.
in scheme: mediatopic
created: 2016-04-04T12:00:00+00:00
retired: 2023-03-31T12:00:00+00:00
modified: 2023-03-31T12:00:00+00:00
broader: fremstilling og teknik

jernbanefremstilling
type: Concept
definition: Produktion af tog, jernbaner, signalanlæg og drift og vedligeholdelse heraf.
in scheme: mediatopic
created: 2016-04-04T12:00:00+00:00
modified: 2023-03-31T12:00:00+00:00
broader: fremstilling og teknik

reklame
type: Concept
definition: Metoder til markedsføring af varer og tjenester ved hjælp af video, grafik eller tekst.
in scheme: mediatopic
created: 2009-10-22T02:00:00+00:00
modified: 2023-03-31T12:00:00+00:00
broader: medie

bogbranche
type: Concept
definition: Kommercielle virksomheder, der producerer og sælger bøger, både fiktion og ikke-fiktion.
in scheme: mediatopic
created: 2009-10-22T02:00:00+00:00
modified: 2023-03-31T12:00:00+00:00
broader: medie

filmbranche
type: Concept
definition: Kommercielle virksomheder, der er afsat til optagelse, forarbejdning, erhvervelse, distribution, visning, salg og leje af film.
in scheme: mediatopic
created: 2009-10-22T02:00:00+00:00
modified: 2023-03-31T12:00:00+00:00
broader: medie

musikbranche
type: Concept
definition: Optagelse, produktion og markedsføring af musik.
in scheme: mediatopic
created: 2009-10-22T02:00:00+00:00
modified: 2023-03-31T12:00:00+00:00
broader: medie

nyhedsbureau
type: Concept
definition: Kommercielle virksomheder, der producerer og distribuerer nyheder i tekst, billede og film.
in scheme: mediatopic
created: 2009-10-22T02:00:00+00:00
retired: 2023-03-31T12:00:00+00:00
modified: 2023-03-31T12:00:00+00:00
broader: medie

avis og magasin
type: Concept
definition: Kommercielle virksomheder, der producerer papirprodukter, der indeholder nyheder og information.
in scheme: mediatopic
created: 2009-10-22T02:00:00+00:00
retired: 2023-03-31T12:00:00+00:00
modified: 2023-03-31T12:00:00+00:00
broader: medie

online-mediebranche
type: Concept
definition: Kommercielle virksomheder, der distribuerer nyheder og information gennem computernetværk til almindeligt forbrug.
in scheme: mediatopic
created: 2009-10-22T02:00:00+00:00
retired: 2023-03-31T12:00:00+00:00
modified: 2023-03-31T12:00:00+00:00
broader: medie

PR
type: Concept
definition: Kommercielle virksomheder, der markedsfører produkter eller tjenester gennem reklame, direkte kontakt eller annoncer.
in scheme: mediatopic
created: 2009-10-22T02:00:00+00:00
modified: 2023-03-31T12:00:00+00:00
broader: medie

radiobranche
type: Concept
definition: Kommercielle virksomheder, der producerer, distribuerer og sender radioprogrammer.
in scheme: mediatopic
created: 2009-10-22T02:00:00+00:00
modified: 2023-03-31T12:00:00+00:00
broader: medie

satellit- og kabeltjeneste
type: Concept
definition: Kommercielle virksomheder, der leverer tv ved hjælp af satellit eller kabel transmission.
in scheme: mediatopic
created: 2009-10-22T02:00:00+00:00
modified: 2021-05-05T12:00:00+00:00
broader: medie

tv-branche
type: Concept
definition: Kommercielle virksomheder, der producerer, distribuerer og sender tv.
in scheme: mediatopic
created: 2009-10-22T02:00:00+00:00
modified: 2023-03-31T12:00:00+00:00
broader: medie

streaming tjeneste
type: Concept
definition: Udbydere af underholdning (film, musik, serier og mere) som bliver leveret igennem en internet tjeneste, der er tilgængelig igennem brugerens computer, mobiltelefon eller TV.
in scheme: mediatopic
created: 2020-08-05T12:00:00+00:00
modified: 2023-03-31T12:00:00+00:00
broader: medie

http://cv.iptc.org/newscodes/mediatopic/20001369
type: Concept
in scheme: mediatopic
created: 2023-03-31T12:00:00+00:00
modified: 2023-03-31T12:00:00+00:00
broader: medie

http://cv.iptc.org/newscodes/mediatopic/20001372
type: Concept
in scheme: mediatopic
created: 2023-03-31T12:00:00+00:00
modified: 2023-03-31T12:00:00+00:00
broader: medie

guld og dyrebart materiale
type: Concept
definition: Minedrift, berigelse og salg af guld og andre ædelmetaller.
in scheme: mediatopic
created: 2009-10-22T02:00:00+00:00
modified: 2023-03-31T12:00:00+00:00
broader: metal og mineral

jern og stål
type: Concept
definition: Minedrift, berigelse og salg af jernholdige metaller.
in scheme: mediatopic
created: 2009-10-22T02:00:00+00:00
retired: 2023-03-31T12:00:00+00:00
modified: 2023-03-31T12:00:00+00:00
broader: metal og mineral

minedrift
type: Concept
definition: Industri som beskæftiger sig med at grave efter metaller, råmaterialer og kul eller ædelstene som diamanter.
in scheme: mediatopic
created: 2009-10-22T02:00:00+00:00
retired: 2023-03-31T12:00:00+00:00
modified: 2023-03-31T12:00:00+00:00
broader: metal og mineral

ikke-jernholdigt metal
type: Concept
definition: Minedrift, berigelse og salg af kobber, zink, aluminium og andre ikke-jernholdige metaller.
in scheme: mediatopic
created: 2009-10-22T02:00:00+00:00
retired: 2023-03-31T12:00:00+00:00
modified: 2023-03-31T12:00:00+00:00
broader: metal og mineral

destilleri og bryggeri
type: Concept
definition: Fremstilling af alkoholholdige drikkevarer.
in scheme: mediatopic
created: 2009-10-22T02:00:00+00:00
retired: 2023-03-31T12:00:00+00:00
modified: 2023-03-31T12:00:00+00:00
broader: procesindustri

papir og emballage
type: Concept
definition: Fremstilling af papir til skrivning, indpakning, trykning eller emballering.
in scheme: mediatopic
created: 2009-10-22T02:00:00+00:00
retired: 2023-03-31T12:00:00+00:00
modified: 2023-03-31T12:00:00+00:00
broader: procesindustri

gummiprodukt
type: Concept
definition: Fremstilling af produkter (f.eks. Handsker, slanger, beskyttelsesbeklædning), hvor naturgummi og syntetisk gummi i vid udstrækning indgår som basisråmateriale.
in scheme: mediatopic
created: 2009-10-22T02:00:00+00:00
retired: 2023-03-31T12:00:00+00:00
modified: 2023-03-31T12:00:00+00:00
broader: procesindustri

læskedrik
type: Concept
definition: Fremstilling af ikke-alkoholholdige drikkevarer.
in scheme: mediatopic
created: 2009-10-22T02:00:00+00:00
retired: 2023-03-31T12:00:00+00:00
modified: 2023-03-31T12:00:00+00:00
broader: procesindustri

tekstil og tøj
type: Concept
definition: Fremstilling af materialer til påklædning af mennesker, møbler og andre genstande.
in scheme: mediatopic
created: 2009-10-22T02:00:00+00:00
retired: 2023-03-31T12:00:00+00:00
modified: 2023-03-31T12:00:00+00:00
broader: procesindustri

e-cigaret
type: Concept
definition: Genopladelig patron fyldt med væske, som fordamper, når den trækkes ind i lungerne, beregnet til at blive erstatning for tobaksrygning.
in scheme: mediatopic
created: 2016-04-04T12:00:00+00:00
retired: 2023-03-31T12:00:00+00:00
modified: 2023-03-31T12:00:00+00:00
broader: procesindustri

gambling og spil
type: Concept
definition: Virksomheden, der tilbyder hasardspil, enten online eller fysisk som i et casino.
in scheme: mediatopic
created: 2009-10-22T02:00:00+00:00
modified: 2023-03-31T12:00:00+00:00
broader: turisme og fritid

hotel og indkvartering
type: Concept
definition: Virksomheden med at levere mad og husly til rejsende.
in scheme: mediatopic
created: 2009-10-22T02:00:00+00:00
modified: 2023-03-31T12:00:00+00:00
broader: turisme og fritid

sports- og fritidsprodukt
type: Concept
definition: Fremstilling af varer, der bruges til fritidsaktiviteter.
in scheme: mediatopic
created: 2009-10-22T02:00:00+00:00
modified: 2021-02-18T12:00:00+00:00
broader: turisme og fritid

restaurant og catering
type: Concept
definition: Virksomhed, der sælger mad til store eller små grupper af kunder.
in scheme: mediatopic
created: 2009-10-22T02:00:00+00:00
modified: 2023-03-31T12:00:00+00:00
broader: turisme og fritid

rejsearrangør
type: Concept
definition: Virksomheder, der sælger rejser i form af transport, indkvartering og aktiviteter.
in scheme: mediatopic
created: 2009-10-22T02:00:00+00:00
modified: 2023-03-31T12:00:00+00:00
broader: turisme og fritid

lufttransport
type: Concept
definition: Kommerciel bevægelse af mennesker eller varer med fly.
in scheme: mediatopic
created: 2009-10-22T02:00:00+00:00
modified: 2023-03-31T12:00:00+00:00
broader: transport

jernbanetransport
type: Concept
definition: Bevægelse af mennesker eller varer med tog og jernbaner.
in scheme: mediatopic
created: 2009-10-22T02:00:00+00:00
modified: 2023-03-31T12:00:00+00:00
broader: transport

vejtransport
type: Concept
definition: Bevægelse af mennesker eller varer ved hjælp af lastbiler eller busser på vejnettet.
in scheme: mediatopic
created: 2009-10-22T02:00:00+00:00
modified: 2023-03-31T12:00:00+00:00
broader: transport

trafik
type: Concept
definition: Trafikmeldinger.
in scheme: mediatopic
created: 2009-10-22T02:00:00+00:00
retired: 2023-03-31T12:00:00+00:00
modified: 2023-03-31T12:00:00+00:00
broader: transport

vandvej og søtransport
type: Concept
definition: Kommerciel bevægelse af mennesker eller varer med båd, skib og vand.
in scheme: mediatopic
created: 2009-10-22T02:00:00+00:00
modified: 2021-02-18T12:00:00+00:00
broader: transport

logistik
type: Concept
definition: Forsyningskæde, lagerstyring og transport af produkter.
in scheme: mediatopic
created: 2016-04-04T12:00:00+00:00
modified: 2023-03-31T12:00:00+00:00
broader: transport

http://cv.iptc.org/newscodes/mediatopic/20001362
type: Concept
in scheme: mediatopic
created: 2022-09-23T12:00:00+00:00
modified: 2022-09-23T12:00:00+00:00
broader: transport

http://cv.iptc.org/newscodes/mediatopic/20001363
type: Concept
in scheme: mediatopic
created: 2022-09-23T12:00:00+00:00
modified: 2022-09-23T12:00:00+00:00
broader: transport

http://cv.iptc.org/newscodes/mediatopic/20001364
type: Concept
in scheme: mediatopic
created: 2022-09-23T12:00:00+00:00
modified: 2022-09-23T12:00:00+00:00
broader: transport

pendling
type: Concept
definition: Regelmæssige ture mellem hjem og arbejdsplads, normalt dagligt.
in scheme: mediatopic
created: 2009-10-22T02:00:00+00:00
modified: 2021-02-18T12:00:00+00:00
broader: ansættelse
broad match: http://cv.iptc.org/newscodes/subjectcode/10007000

makroøkonomi
type: Concept
definition: Større økonomiske spørgsmål på nationalt eller højere niveau.
in scheme: mediatopic
created: 2009-10-22T02:00:00+00:00
modified: 2024-03-28T12:00:00+00:00
broader: økonomi
narrower: obligation
narrower: budget og budgettering
narrower: forbruger
narrower: forbrugertillid
narrower: kredit og gæld
narrower: deflation
narrower: økonomisk vækst
narrower: økonomisk indikator
narrower: bruttonationalprodukt (bnp)
narrower: industriproduktion
narrower: lagerbeholdning
narrower: produktivitet
narrower: beskæftigelsesstatistik
narrower: eksport
narrower: udviklingsbistand
narrower: statsgæld
narrower: import
narrower: inflation
narrower: investering
narrower: boliglån og realkredit
narrower: markedspris
narrower: recession

centralbank
type: Concept
definition: En bank, der er centrum for banker i et land og er ansvarlig for at udstede pengesedler, udlån til staten og andre banker med mere.
in scheme: mediatopic
created: 2009-10-22T02:00:00+00:00
modified: 2024-03-28T12:00:00+00:00
broader: økonomi

valutakurs
type: Concept
definition: Værdiforhold mellem to valutaer.
in scheme: mediatopic
created: 2009-10-22T02:00:00+00:00
modified: 2024-03-28T12:00:00+00:00
broader: økonomi
narrower: kryptovaluta

økonomisk interesseorganisation
type: Concept
definition: En sammenslutning af interesser for virksomheder i en bestemt branche.
in scheme: mediatopic
created: 2009-10-22T02:00:00+00:00
modified: 2024-03-28T12:00:00+00:00
broader: økonomi

vækstøkonomier
type: Concept
definition: De markeder, der kæmper for at komme ind i verdensøkonomierne, og dem, der kræver økonomisk hjælp fra internationale långivere.
in scheme: mediatopic
created: 2009-10-22T02:00:00+00:00
modified: 2024-03-28T12:00:00+00:00
broader: økonomi

international økonomisk organisation
type: Concept
definition: Enheder som Verdensbanken, WTO og Unido, der opererer på globalt plan.
in scheme: mediatopic
created: 2009-10-22T02:00:00+00:00
modified: 2024-07-01T12:00:00+00:00
broader: økonomi

international handel
type: Concept
definition: Handel med varer og tjenester mellem lande.
in scheme: mediatopic
created: 2009-10-22T02:00:00+00:00
modified: 2024-03-28T12:00:00+00:00
broader: økonomi
narrower: handelsaftale
narrower: handelsbalance
narrower: handelstvist
narrower: handelspolitik
narrower: toldafgift

pengepolitik
type: Concept
definition: Statslige foranstaltninger til regulering af det monetære system og kreditmarkedet i et land, især gennem centralbanken.
in scheme: mediatopic
created: 2009-10-22T02:00:00+00:00
modified: 2024-03-28T12:00:00+00:00
broader: økonomi
narrower: rentesats

fond
type: Concept
definition: En samling af værdipapirer, ofte benævnt en portefølje, der ejes af mange mennesker sammen, der er medejere, og som kan bestå af forskellige typer aktie- eller rente-baserede værdipapirer.
in scheme: mediatopic
created: 2009-10-22T02:00:00+00:00
modified: 2024-03-28T12:00:00+00:00
broader: økonomi

deleøkonomi
type: Concept
definition: Aktiviteter, der sigter mod at reducere ressourceforbruget gennem en mere effektiv kapacitetsudnyttelse, såsom deling af adgangen til varer og tjenester.
in scheme: mediatopic
created: 2016-04-04T12:00:00+00:00
modified: 2024-03-28T12:00:00+00:00
broader: økonomi

økonomisk politik
type: Concept
definition: Foranstaltninger, en offentlig myndighed benytter til at regulere den økonomiske adfærd i et samfund.
in scheme: mediatopic
created: 2009-10-22T02:00:00+00:00
modified: 2025-03-31T12:00:00+00:00
broader: regeringspolitik
narrower: nationalisering
narrower: privatisering
narrower: statsejet virksomhed
narrower: statsstøtte

nationalisering
type: Concept
definition: Statslig overtagelse af private virksomheder eller ejendomme.
in scheme: mediatopic
created: 2009-10-22T02:00:00+00:00
modified: 2025-03-31T12:00:00+00:00
broader: økonomisk politik

privatisering
type: Concept
definition: Overførsel af statsejede virksomheder, ejendomme eller aktiviteter til private ejere.
in scheme: mediatopic
created: 2009-10-22T02:00:00+00:00
modified: 2025-03-31T12:00:00+00:00
broader: økonomisk politik

statsejet virksomhed
type: Concept
definition: Virksomheder som ejes af staten og agerer på et marked på markedsvilkår.
in scheme: mediatopic
created: 2009-10-22T02:00:00+00:00
modified: 2025-03-31T12:00:00+00:00
broader: økonomisk politik
broad match: http://cv.iptc.org/newscodes/subjectcode/04017001

statsstøtte
type: Concept
definition: Statslige finansielle programmer der skal stimulere erhvervsliv og andre dele af økonomien
in scheme: mediatopic
created: 2020-08-05T12:00:00+00:00
modified: 2025-03-31T12:00:00+00:00
broader: økonomisk politik

obligation
type: Concept
definition: Virksomheds- eller statsdokument, der repræsenterer lånet af penge til en fast rente og i en fast tid til det pågældende firma eller stat.
in scheme: mediatopic
created: 2009-10-22T02:00:00+00:00
retired: 2024-03-28T12:00:00+00:00
modified: 2024-03-28T12:00:00+00:00
broader: makroøkonomi

budget og budgettering
type: Concept
definition: En beregning på forhånd af alle indtægter og udgifter.
in scheme: mediatopic
created: 2009-10-22T02:00:00+00:00
retired: 2024-03-28T12:00:00+00:00
modified: 2024-03-28T12:00:00+00:00
broader: makroøkonomi

forbruger
type: Concept
definition: Købere af varer og tjenester.
in scheme: mediatopic
created: 2009-10-22T02:00:00+00:00
retired: 2024-03-28T12:00:00+00:00
modified: 2024-03-28T12:00:00+00:00
broader: makroøkonomi
narrower: forbrugerrettigheder

forbrugertillid
type: Concept
definition: Kundernes tillid til den aktuelle økonomiske situation.
in scheme: mediatopic
created: 2009-10-22T02:00:00+00:00
modified: 2024-03-28T12:00:00+00:00
broader: makroøkonomi

kredit og gæld
type: Concept
definition: Kredit, det beløb du har til rådighed, ofte ved lån. Gæld, det beløb, du skylder.
in scheme: mediatopic
created: 2009-10-22T02:00:00+00:00
retired: 2024-03-28T12:00:00+00:00
modified: 2024-03-28T12:00:00+00:00
broader: makroøkonomi

deflation
type: Concept
definition: Priserne på varer og tjenester falder eller handelen falder.
in scheme: mediatopic
created: 2009-10-22T02:00:00+00:00
modified: 2024-03-28T12:00:00+00:00
broader: makroøkonomi
broad match: http://cv.iptc.org/newscodes/subjectcode/04008016

økonomisk vækst
type: Concept
definition: Stigning over tid i produktionen af varer og tjenester i et land, bruttonationalproduktet (BNP).
in scheme: mediatopic
created: 2009-10-22T02:00:00+00:00
modified: 2024-03-28T12:00:00+00:00
broader: makroøkonomi
broad match: http://cv.iptc.org/newscodes/subjectcode/04000000

økonomisk indikator
type: Concept
definition: Specifikke indekser, såsom aktiebalancer og prisindeks, der viser, om økonomien forbedres eller forværres.
in scheme: mediatopic
created: 2009-10-22T02:00:00+00:00
retired: 2024-03-28T12:00:00+00:00
modified: 2024-03-28T12:00:00+00:00
broader: makroøkonomi

bruttonationalprodukt (bnp)
type: Concept
definition: Værdien af alle varer og tjenester, der er produceret i et land i et år.
in scheme: mediatopic
created: 2009-10-22T02:00:00+00:00
modified: 2024-03-28T12:00:00+00:00
broader: makroøkonomi
broad match: http://cv.iptc.org/newscodes/subjectcode/04000000

industriproduktion
type: Concept
definition: Industriel fremstilling af genstande.
in scheme: mediatopic
created: 2009-10-22T02:00:00+00:00
modified: 2024-03-28T12:00:00+00:00
broader: makroøkonomi

lagerbeholdning
type: Concept
definition: Varer, der ikke er solgt, men opbevares af producenten, grossisten eller forhandleren.
in scheme: mediatopic
created: 2009-10-22T02:00:00+00:00
modified: 2024-03-28T12:00:00+00:00
broader: makroøkonomi

produktivitet
type: Concept
definition: Forholdet mellem det opnåede resultat og de ressourcer, der er investeret i industriel produktion.
in scheme: mediatopic
created: 2009-10-22T02:00:00+00:00
modified: 2024-03-28T12:00:00+00:00
broader: makroøkonomi

beskæftigelsesstatistik
type: Concept
definition: Statistik om beskæftigelse.
in scheme: mediatopic
created: 2009-10-22T02:00:00+00:00
modified: 2024-03-28T12:00:00+00:00
broader: makroøkonomi
broad match: http://cv.iptc.org/newscodes/subjectcode/04008000

eksport
type: Concept
definition: Hvad der er produceret eller fremstillet i eet land og sendt og solgt i et andet land.
in scheme: mediatopic
created: 2009-10-22T02:00:00+00:00
modified: 2024-03-28T12:00:00+00:00
broader: makroøkonomi

udviklingsbistand
type: Concept
definition: Overførsel af ressourcer til fattige lande på gunstige vilkår med det formål at bidrage til udvikling.
in scheme: mediatopic
created: 2009-10-22T02:00:00+00:00
retired: 2024-03-28T12:00:00+00:00
modified: 2024-03-28T12:00:00+00:00
broader: makroøkonomi

statsgæld
type: Concept
definition: De penge, som staten skylder, for eksempel til andre lande.
in scheme: mediatopic
created: 2009-10-22T02:00:00+00:00
modified: 2024-03-28T12:00:00+00:00
broader: makroøkonomi

import
type: Concept
definition: Organiseret import af varer fra udlandet til eget land.
in scheme: mediatopic
created: 2009-10-22T02:00:00+00:00
modified: 2024-03-28T12:00:00+00:00
broader: makroøkonomi

inflation
type: Concept
definition: Økonomisk udvikling, der manifesterer sig i den kontinuerlige generelle stigning i prisniveauet og dermed forringelsen af den monetære værdi.
in scheme: mediatopic
created: 2009-10-22T02:00:00+00:00
modified: 2024-03-28T12:00:00+00:00
broader: makroøkonomi
broad match: http://cv.iptc.org/newscodes/subjectcode/04008016

investering
type: Concept
definition: Investering i økonomisk værdi med håb om fremtidig afkast, normalt i produktiv brug, og således at pengene er bundet sammen i en længere periode.
in scheme: mediatopic
created: 2009-10-22T02:00:00+00:00
retired: 2024-03-28T12:00:00+00:00
modified: 2024-03-28T12:00:00+00:00
broader: makroøkonomi

boliglån og realkredit
type: Concept
definition: Låne penge til køb af jord eller ejendom eller til reparation, renovering af ejendom, for sikkerhed, normalt i en ejendom.
in scheme: mediatopic
created: 2009-10-22T02:00:00+00:00
modified: 2024-03-28T12:00:00+00:00
broader: makroøkonomi

markedspris
type: Concept
definition: Den monetære værdi af varer, tjenester, aktier eller obligationer.
in scheme: mediatopic
created: 2009-10-22T02:00:00+00:00
retired: 2024-03-28T12:00:00+00:00
modified: 2024-03-28T12:00:00+00:00
broader: makroøkonomi

recession
type: Concept
definition: Defineres som en nedgang i et lands brutonationalprodukt over to på hinanden følgende kvartaler. Bruges også om økonomisk tilbagegang generelt.
in scheme: mediatopic
created: 2009-10-22T02:00:00+00:00
modified: 2024-03-28T12:00:00+00:00
broader: makroøkonomi
broad match: http://cv.iptc.org/newscodes/subjectcode/04000000

iværksætteri
type: Concept
definition: Processen med at oprette, lancere og drive et nyt firma.
in scheme: mediatopic
created: 2016-04-04T12:00:00+00:00
modified: 2024-03-28T12:00:00+00:00
broader: erhvervsliv

små og mellemstore virksomheder (SMV)
type: Concept
definition: En lille eller mellemstor virksomhed (SMV) er en virksomhed, hvis antal ansatte, balance og omsætning ikke kan overstige visse grænser, der er fastsat af det land, hvor det er beliggende.
in scheme: mediatopic
created: 2016-04-04T12:00:00+00:00
modified: 2024-03-28T12:00:00+00:00
broader: erhvervsliv

andelsselskab
type: Concept
definition: En virksomhed, der ejes og drives af sine medlemmer. Produktionen eller overskuddet deles mellem medlemmerne.
in scheme: mediatopic
created: 2019-10-07T12:00:00+00:00
modified: 2021-07-12T12:00:00+00:00
broader: erhvervsliv

forbrugerrettigheder
type: Concept
definition: Spørgsmål om forbrugeres rettigheder.
in scheme: mediatopic
created: 2009-10-22T02:00:00+00:00
retired: 2024-03-28T12:00:00+00:00
modified: 2024-03-28T12:00:00+00:00
broader: forbruger

kryptovaluta
type: Concept
definition: En internet-baseret valuta, som benytter krypteringsteknologi til at facilitere finansielle transaktioner.
in scheme: mediatopic
created: 2019-10-07T12:00:00+00:00
modified: 2021-07-12T12:00:00+00:00
broader: valutakurs

rentesats
type: Concept
definition: Den aftalte pris på kredit optaget af långiveren, udtrykt i procent af lånebeløbet.
in scheme: mediatopic
created: 2009-10-22T02:00:00+00:00
modified: 2024-03-28T12:00:00+00:00
broader: pengepolitik

handelsaftale
type: Concept
definition: Aftale mellem to eller flere lande om handelsbetingelserne mellem landene.
in scheme: mediatopic
created: 2009-10-22T02:00:00+00:00
modified: 2024-03-28T12:00:00+00:00
broader: international handel

handelsbalance
type: Concept
definition: Forskellen mellem værdien af et lands eksport og værdien af dets import af varer.
in scheme: mediatopic
created: 2009-10-22T02:00:00+00:00
modified: 2024-03-28T12:00:00+00:00
broader: international handel

handelstvist
type: Concept
definition: International konflikt om handelshindringer, karteloperationer, prisdumping og mere.
in scheme: mediatopic
created: 2009-10-22T02:00:00+00:00
modified: 2024-03-28T12:00:00+00:00
broader: international handel

handelspolitik
type: Concept
definition: Beskrivelse af alle økonomiske og politiske foranstaltninger med det formål at påvirke udenrigshandel.
in scheme: mediatopic
created: 2009-10-22T02:00:00+00:00
modified: 2024-03-28T12:00:00+00:00
broader: international handel

toldafgift
type: Concept
definition: En told, der betales ved import eller eksport af varer over en landegrænse, normalt for at udligne prisforskelle.
in scheme: mediatopic
created: 2009-10-22T02:00:00+00:00
modified: 2024-03-28T12:00:00+00:00
broader: international handel

råvarebørs
type: Concept
definition: Handelssted for standardiseret handel med råvarer og/eller råvarer eller afledte instrumenter baseret på disse varer, for eksempel bomuld, olie, kul, metaller og mere.
in scheme: mediatopic
created: 2009-10-22T02:00:00+00:00
modified: 2024-03-28T12:00:00+00:00
broader: marked og børsvæsen
narrower: energibørs
narrower: metalbørs
narrower: børs for bløde råvarer

gældsmarked
type: Concept
definition: Den del af kreditmarkedet, der vedrører lån, der har en løbetid på mindst et år på udstedelsestidspunktet.
in scheme: mediatopic
created: 2009-10-22T02:00:00+00:00
modified: 2024-03-28T12:00:00+00:00
broader: marked og børsvæsen

valutamarked
type: Concept
definition: Handel med valutaer, hvori valutakurser bestemmes.
in scheme: mediatopic
created: 2009-10-22T02:00:00+00:00
modified: 2024-03-28T12:00:00+00:00
broader: marked og børsvæsen

lånemarked
type: Concept
definition: Marked, hvor penge kan lånes til fast rente.
in scheme: mediatopic
created: 2009-10-22T02:00:00+00:00
modified: 2024-03-28T12:00:00+00:00
broader: marked og børsvæsen

energibørs
type: Concept
definition: Handelssted for elektricitet, gas, kul, olie og kuldioxid.
in scheme: mediatopic
created: 2009-10-22T02:00:00+00:00
modified: 2024-03-28T12:00:00+00:00
broader: råvarebørs

metalbørs
type: Concept
definition: Handelssted for metaller som kobber, stål, aluminium, zink og mere.
in scheme: mediatopic
created: 2009-10-22T02:00:00+00:00
modified: 2021-02-18T12:00:00+00:00
broader: råvarebørs

børs for bløde råvarer
type: Concept
definition: Handelssted for dyrkede råvarer, såsom bomuld, sukker, sojabønner og mere.
in scheme: mediatopic
created: 2009-10-22T02:00:00+00:00
retired: 2023-10-02T12:00:00+00:00
modified: 2024-03-28T12:00:00+00:00
broader: råvarebørs

lån
type: Concept
definition: En aftale fra en enkeltperson eller institution om midlertidigt at sprede penge til en anden med en aftalt sats og tidspunkt for tilbagebetaling.
in scheme: mediatopic
created: 2009-10-22T02:00:00+00:00
modified: 2024-03-28T12:00:00+00:00
broader: http://cv.iptc.org/newscodes/mediatopic/20001370

derivater
type: Concept
definition: Værdipapirer, fx optioner, hvis værdi påvirkes af værdien af en anden værdi, såsom aktier.
in scheme: mediatopic
created: 2009-10-22T02:00:00+00:00
modified: 2023-03-31T12:00:00+00:00
broader: aktie

aktieanbefaling
type: Concept
definition: En analytikers anbefalinger for bestemte aktier. Kan inkludere analytikerens prismål for aktien.
in scheme: mediatopic
created: 2012-10-04T12:00:00+00:00
retired: 2023-03-31T12:00:00+00:00
modified: 2023-03-31T12:00:00+00:00
broader: aktie
narrower: købsanbefaling
narrower: holdanbefaling
narrower: salgsanbefaling

populære aktier
type: Concept
definition: Bemærkelsesværdige kursbevægelser på en bestemt aktie.
in scheme: mediatopic
created: 2012-10-04T12:00:00+00:00
retired: 2023-03-31T12:00:00+00:00
modified: 2023-03-31T12:00:00+00:00
broader: aktie

grundskole
type: Concept
definition: Grundskolen på 10 år (børnehaveklasse efterfulgt af 1.-9. klasse), med 10. klasse som et frivilligt år.
in scheme: mediatopic
created: 2009-10-22T02:00:00+00:00
modified: 2021-09-30T12:00:00+00:00
broader: skole

videreuddannelse
type: Concept
definition: Alle former for uddannelse ud over grunduddannelse på forskellige uddannelsesniveauer.
in scheme: mediatopic
created: 2009-10-22T02:00:00+00:00
retired: 2021-09-30T12:00:00+00:00
modified: 2021-09-30T12:00:00+00:00
broader: skole

voksenuddannelse
type: Concept
definition: Samlingsnavn for en række voksenuddannelsesprogrammer.
in scheme: mediatopic
created: 2009-10-22T02:00:00+00:00
modified: 2024-07-01T12:00:00+00:00
broader: skole

gymnasium
type: Concept
definition: En skoleform til teoretisk uddannelse mellem grundskole og universitet.
in scheme: mediatopic
created: 2009-10-22T02:00:00+00:00
modified: 2021-09-30T12:00:00+00:00
broader: skole

videregående uddannelse
type: Concept
definition: Uddannelse på universiteter, akademier, gymnasier, seminarer, konservatorier og lignende institutioner, som normalt resulterer i en grad.
in scheme: mediatopic
created: 2009-10-22T02:00:00+00:00
modified: 2021-09-30T12:00:00+00:00
broader: skole
narrower: college
narrower: universitet
broad match: http://cv.iptc.org/newscodes/subjectcode/05000000

mellemskole
type: Concept
definition: Grundskolens sidste treårige trin bestående af klasse 7-9.
in scheme: mediatopic
created: 2009-10-22T02:00:00+00:00
modified: 2021-09-30T12:00:00+00:00
broader: skole

børnehaveklasse/0. klasse
type: Concept
definition: Uddannelsesaktiviteter for tilmeldte børn i alderen 1-5 år.
in scheme: mediatopic
created: 2009-10-22T02:00:00+00:00
modified: 2021-09-30T12:00:00+00:00
broader: skole

religiøs skole
type: Concept
definition: Skoler, der tilbyder undervisning om religion eller ledes af principperne i en bestemt religiøs tro.
in scheme: mediatopic
created: 2019-04-06T12:00:00+00:00
modified: 2021-09-30T12:00:00+00:00
broader: skole

folkeskole
type: Concept
definition: En kommunal skole som er åben for alle og er en del af det offentlige skolesystem i Danmark.
in scheme: mediatopic
created: 2019-04-06T12:00:00+00:00
modified: 2021-09-30T12:00:00+00:00
broader: skole

privatskole
type: Concept
definition: En type skole, der ikke administreres af lokale, regionale eller nationale myndigheder. Den private skole forbeholder sig retten til at vælge de studerende, der er optaget på skolen og finansieres af gebyrer snarere end offentlig finansiering.
in scheme: mediatopic
created: 2019-04-06T12:00:00+00:00
modified: 2021-09-30T12:00:00+00:00
broader: skole

uafhængig skole/friskole
type: Concept
definition: En skole, der ikke drives af den offentlige sektor, men som hovedsageligt finansieres af skattemidler.
in scheme: mediatopic
created: 2019-04-06T12:00:00+00:00
modified: 2021-09-30T12:00:00+00:00
broader: skole

college
type: Concept
definition: Uddannelsesinstitution for videregående uddannelse og forskning, som i princippet kræver afsluttede gymnasiestudier for at komme ind.
in scheme: mediatopic
created: 2009-10-22T02:00:00+00:00
retired: 2021-09-30T12:00:00+00:00
modified: 2021-09-30T12:00:00+00:00
broader: videregående uddannelse
broad match: http://cv.iptc.org/newscodes/subjectcode/05000000

universitet
type: Concept
definition: Forskning og videregående uddannelse inden for de vigtigste traditionelle vidensområder.
in scheme: mediatopic
created: 2009-10-22T02:00:00+00:00
retired: 2021-09-30T12:00:00+00:00
modified: 2021-09-30T12:00:00+00:00
broader: videregående uddannelse

global opvarmning
type: Concept
definition: Det bemærkede stigning i gennemsnitstemperaturen på jordoverfladen siden slutningen af det 19. århundrede.
in scheme: mediatopic
created: 2009-10-22T02:00:00+00:00
retired: 2025-06-30T12:00:00+00:00
modified: 2025-06-30T12:00:00+00:00
broader: klimaforandring

energibesparelse
type: Concept
definition: Reduktion af energiforbruget ved at afstå fra tjenester og værktøjer, f.eks. Ved at sænke indetemperaturen.
in scheme: mediatopic
created: 2009-10-22T02:00:00+00:00
retired: 2025-06-30T12:00:00+00:00
modified: 2025-06-30T12:00:00+00:00
broader: naturbevaring

naturpark og reservat
type: Concept
definition: Områder med værdifulde naturlige miljøer, der er beskyttet af love mod udnyttelse.
in scheme: mediatopic
created: 2009-10-22T02:00:00+00:00
modified: 2025-06-30T12:00:00+00:00
broader: naturbevaring

miljøpolitik
type: Concept
definition: Politiske foranstaltninger, der sigter mod at forhindre overudnyttelse og ødelæggelse af miljøet.
in scheme: mediatopic
created: 2009-10-22T02:00:00+00:00
modified: 2025-03-31T12:00:00+00:00
broader: regeringspolitik

luftforurening
type: Concept
definition: Stoffer, der er til stede i atmosfæren i en så stor mængde, at det kan skade mennesker, dyr, planter eller genstande.
in scheme: mediatopic
created: 2009-10-22T02:00:00+00:00
modified: 2025-10-09T12:00:00+00:00
broader: forurening

miljøoprensning
type: Concept
definition: Foranstaltninger, der sigter mod at befri et sted fra noget skadeligt og gøre det beboeligt igen, enten for mennesker eller dyr.
in scheme: mediatopic
created: 2009-10-22T02:00:00+00:00
modified: 2025-10-09T12:00:00+00:00
broader: forurening

farligt affald
type: Concept
definition: Materialer, der er skadelige for mennesker og dyr, hvis de udsættes for dem. Omfatter stråling, giftgasser, kemikalier, tungmetaller, PCB og visse planteprodukter.
in scheme: mediatopic
created: 2009-10-22T02:00:00+00:00
modified: 2025-10-09T12:00:00+00:00
broader: forurening

affald og genanvendelse
type: Concept
definition: Miljøpåvirkning af affald, herunder genanvendelsesindsats.
in scheme: mediatopic
created: 2009-10-22T02:00:00+00:00
modified: 2025-10-09T12:00:00+00:00
broader: forurening

vandforurening
type: Concept
definition: Stoffer, der er til stede i vand i en så stor mængde, at det kan skade mennesker, dyr og planter.
in scheme: mediatopic
created: 2009-10-22T02:00:00+00:00
modified: 2025-10-09T12:00:00+00:00
broader: forurening

energiressource
type: Concept
definition: Ressourcer som kul, gas, vind, sollys osv., Der bruges til at generere varme, elektricitet og strøm.
in scheme: mediatopic
created: 2009-10-22T02:00:00+00:00
retired: 2025-06-30T12:00:00+00:00
modified: 2025-06-30T12:00:00+00:00
broader: naturressource

jordressource
type: Concept
definition: Den del af et land, der er over vandoverfladen og tilgængelig til udvikling, enten med fortjeneste for øje eller til gavn for almenheden.
in scheme: mediatopic
created: 2009-10-22T02:00:00+00:00
retired: 2025-06-30T12:00:00+00:00
modified: 2025-06-30T12:00:00+00:00
broader: naturressource

befolkningstilvækst
type: Concept
definition: Stigning i befolkningen i et givet område.
in scheme: mediatopic
created: 2009-10-22T02:00:00+00:00
retired: 2025-06-30T12:00:00+00:00
modified: 2025-06-30T12:00:00+00:00
broader: naturressource

vedvarende energi
type: Concept
definition: Energikilder, der direkte eller indirekte er baseret på solstråling og derved kontinuerligt fornyes i samme hastighed som de bruges, f.eks. Solenergi, vindkraft, vandkraft og geotermisk energi.
in scheme: mediatopic
created: 2009-10-22T02:00:00+00:00
retired: 2023-03-31T12:00:00+00:00
modified: 2023-03-31T12:00:00+00:00
broader: naturressource

vand
type: Concept
definition: Miljøspørgsmål vedrørende vand, herunder hav, søer, floder, gletsjere og is.
in scheme: mediatopic
created: 2009-10-22T02:00:00+00:00
retired: 2025-10-09T12:00:00+00:00
modified: 2021-02-18T12:00:00+00:00
broader: naturressource

skov
type: Concept
definition: Åbne områder med træer, der enten er tilgængelige til offentlig fornøjelse eller til kommercielle formål.
in scheme: mediatopic
created: 2009-10-22T02:00:00+00:00
modified: 2025-06-30T12:00:00+00:00
broader: natur

bjerg
type: Concept
definition: Forhøjede landmasser dannet gennem tiderne enten ved erosion, vulkanudbrud eller bevægelse af massive geografiske formationer kaldet plader.
in scheme: mediatopic
created: 2009-10-22T02:00:00+00:00
modified: 2025-06-30T12:00:00+00:00
broader: natur

have
type: Concept
definition: Det sammenhængende vandområde, der omgiver jordens kontinenter, normalt synonymt med verdenshavet eller verdenshavene.
in scheme: mediatopic
created: 2009-10-22T02:00:00+00:00
modified: 2025-06-30T12:00:00+00:00
broader: natur

flod og å
type: Concept
definition: Bevægelse af vandområder afgrænset af jord, der strækker sig fra jordkilder og bugter gennem landområder for at samle sig med andre vandområder. I mindre former er de bæk, klinker, vandløb osv..
in scheme: mediatopic
created: 2009-10-22T02:00:00+00:00
modified: 2025-06-30T12:00:00+00:00
broader: natur

vådområde
type: Concept
definition: Et område i naturen, som konstant eller undertiden, er nedsænket i vand.
in scheme: mediatopic
created: 2009-10-22T02:00:00+00:00
modified: 2025-06-30T12:00:00+00:00
broader: natur

økosystem
type: Concept
definition: Enhed, der inkluderer alle organismer og deres miljø i et område såsom en sø eller en skov.
in scheme: mediatopic
created: 2009-10-22T02:00:00+00:00
modified: 2025-10-09T12:00:00+00:00
broader: natur

truet art
type: Concept
definition: Arter, der sandsynligvis forsvinder fuldstændigt i en nær fremtid fra et bestemt område eller fra hele jorden, dels på grund af aktiv forfølgelse fra mennesker eller ændringer i miljø og vejr.
in scheme: mediatopic
created: 2009-10-22T02:00:00+00:00
modified: 2025-10-09T12:00:00+00:00
broader: natur

invasiv art
type: Concept
definition: Ikke-oprindelige arter, der påvirker økosystemet, ved at skade de oprindelige arter.
in scheme: mediatopic
created: 2009-10-22T02:00:00+00:00
modified: 2025-10-09T12:00:00+00:00
broader: natur

dyr
type: Concept
definition: Nyheder om dyr.
in scheme: mediatopic
created: 2009-10-22T02:00:00+00:00
modified: 2025-10-09T12:00:00+00:00
broader: natur
narrower: dyresygdom
narrower: skadedyr

plante
type: Concept
definition: Nyheder om planter.
in scheme: mediatopic
created: 2009-10-22T02:00:00+00:00
modified: 2025-10-09T12:00:00+00:00
broader: natur
narrower: plantesygdom

kræft
type: Concept
definition: En alvorlig tumorsygdom med ukontrolleret cellevækst, hvorved de nye celler ødelægger det omgivende væv, ofte dødeligt.
in scheme: mediatopic
created: 2009-10-22T02:00:00+00:00
modified: 2021-02-18T12:00:00+00:00
broader: sygdom og sygdomstilstand

smitsom sygdom
type: Concept
definition: Sygdomme, der kan overføres fra en person eller et dyr til en anden.
in scheme: mediatopic
created: 2009-10-22T02:00:00+00:00
modified: 2021-02-18T12:00:00+00:00
broader: sygdom og sygdomstilstand
narrower: epidemi
narrower: virussygdom

hjertekarsygdomme
type: Concept
definition: En samlet betegnelse for sygdomme, der påvirker hjertet, blodkarrene eller begge dele.
in scheme: mediatopic
created: 2009-10-22T02:00:00+00:00
modified: 2022-06-14T12:00:00+00:00
broader: sygdom og sygdomstilstand

øvrig sygdom
type: Concept
definition: Ikke-specifikke sygdomme såsom mavepine, hovedpine, flade fødder og lumbago.
in scheme: mediatopic
created: 2009-10-22T02:00:00+00:00
retired: 2022-06-14T12:00:00+00:00
modified: 2022-06-14T12:00:00+00:00
broader: sygdom og sygdomstilstand

fysisk skade
type: Concept
definition: Fysiske skader på kroppen.
in scheme: mediatopic
created: 2009-10-22T02:00:00+00:00
modified: 2022-06-14T12:00:00+00:00
broader: sygdom og sygdomstilstand

medicinsk tilstand
type: Concept
definition: Forskellige niveauer af sygdomme eller skader.
in scheme: mediatopic
created: 2009-10-22T02:00:00+00:00
modified: 2024-07-01T12:00:00+00:00
broader: sygdom og sygdomstilstand
narrower: fedme

psykisk og adfærdsmæssig lidelse
type: Concept
definition: Sygdomme og lidelser, der påvirker sindet og adfærden.
in scheme: mediatopic
created: 2009-10-22T02:00:00+00:00
modified: 2022-06-14T12:00:00+00:00
broader: sygdom og sygdomstilstand
narrower: spiseforstyrrelse
narrower: http://cv.iptc.org/newscodes/mediatopic/20001356
narrower: http://cv.iptc.org/newscodes/mediatopic/20001357
broad match: http://cv.iptc.org/newscodes/subjectcode/07000000

http://cv.iptc.org/newscodes/mediatopic/20001322
type: Concept
in scheme: mediatopic
created: 2021-05-05T12:00:00+00:00
modified: 2021-12-21T12:00:00+00:00
broader: sygdom og sygdomstilstand

http://cv.iptc.org/newscodes/mediatopic/20001355
type: Concept
in scheme: mediatopic
created: 2022-06-14T12:00:00+00:00
modified: 2022-06-14T12:00:00+00:00
broader: sygdom og sygdomstilstand

epidemi
type: Concept
definition: Fremkomsten af et stort antal infektionssygdomme i en bestemt befolkning.
in scheme: mediatopic
created: 2009-10-22T02:00:00+00:00
modified: 2022-06-14T12:00:00+00:00
broader: smitsom sygdom
narrower: pest (sygdom)
narrower: pandemi
broad match: http://cv.iptc.org/newscodes/subjectcode/07002000

virussygdom
type: Concept
definition: Sygdomme forårsaget af infektion i celler af vira.
in scheme: mediatopic
created: 2009-10-22T02:00:00+00:00
modified: 2022-06-14T12:00:00+00:00
broader: smitsom sygdom
narrower: aids
narrower: retrovirus

pest (sygdom)
type: Concept
definition: En stærkt infektiøs epidemisk sygdom forårsaget af bakterierne Yersinia pestis.
in scheme: mediatopic
created: 2009-10-22T02:00:00+00:00
retired: 2022-06-14T12:00:00+00:00
modified: 2022-06-14T12:00:00+00:00
broader: epidemi
broad match: http://cv.iptc.org/newscodes/subjectcode/07002000

pandemi
type: Concept
definition: En epidemi af smitsom sygdom, der har spredt sig over en stor region eller endda over hele verden.
in scheme: mediatopic
created: 2019-04-06T12:00:00+00:00
retired: 2022-06-14T12:00:00+00:00
modified: 2022-06-14T12:00:00+00:00
broader: epidemi

aids
type: Concept
definition: En dødbringende sygdom, der er kendetegnet ved alvorlig skade på immunsystemet, der får den berørte person til at blive ekstremt modtagelig for infektioner. AIDS er forårsaget af human immundefektvirus, HIV, og er slutstadiet af en HIV-infektion.
in scheme: mediatopic
created: 2009-10-22T02:00:00+00:00
modified: 2022-06-14T12:00:00+00:00
broader: virussygdom

retrovirus
type: Concept
definition: En familie af RNA-vira, såsom dem, der forårsager leukæmi og AIDS.
in scheme: mediatopic
created: 2009-10-22T02:00:00+00:00
retired: 2022-06-14T12:00:00+00:00
modified: 2022-06-14T12:00:00+00:00
broader: virussygdom

fedme
type: Concept
definition: Kropsvægt, der overstiger det, der anses for at være den øvre grænse for normal vægt.
in scheme: mediatopic
created: 2009-10-22T02:00:00+00:00
modified: 2022-06-14T12:00:00+00:00
broader: medicinsk tilstand

spiseforstyrrelse
type: Concept
definition: Anoreksi, bulimi, overspisning og lignende sygdomme.
in scheme: mediatopic
created: 2009-10-22T02:00:00+00:00
modified: 2021-02-18T12:00:00+00:00
broader: psykisk og adfærdsmæssig lidelse

http://cv.iptc.org/newscodes/mediatopic/20001356
type: Concept
in scheme: mediatopic
created: 2022-06-14T12:00:00+00:00
modified: 2022-06-14T12:00:00+00:00
broader: psykisk og adfærdsmæssig lidelse

http://cv.iptc.org/newscodes/mediatopic/20001357
type: Concept
in scheme: mediatopic
created: 2022-06-14T12:00:00+00:00
modified: 2022-06-14T12:00:00+00:00
broader: psykisk og adfærdsmæssig lidelse

hospital
type: Concept
definition: Medicinske faciliteter til behandling af sygdomme og skader.
in scheme: mediatopic
created: 2009-10-22T02:00:00+00:00
modified: 2021-05-05T12:00:00+00:00
broader: sundhedsfacilitet

sundhedsklinik og lægehus
type: Concept
definition: Sundhedsklinik eller lægehus, hvor mennesker med medicinske problemer kan søge indledende kontakt med sundhedsvæsenet. Enten til direkte handling eller henvisning til videre behandling.
in scheme: mediatopic
created: 2019-04-06T12:00:00+00:00
modified: 2021-07-12T12:00:00+00:00
broader: sundhedsfacilitet

diæt
type: Concept
definition: Sammensætning af kost over en længere periode, især dem, der er fastlagt af medicinske grunde.
in scheme: mediatopic
created: 2009-10-22T02:00:00+00:00
modified: 2022-06-14T12:00:00+00:00
broader: sundhedsbehandling
narrower: kosttilskud

medicinsk lægemiddel
type: Concept
definition: Lægemiddel mod fysiske eller mentale lidelser, godkendt af lægevidenskaben.
in scheme: mediatopic
created: 2009-10-22T02:00:00+00:00
modified: 2022-06-14T12:00:00+00:00
broader: sundhedsbehandling
broad match: http://cv.iptc.org/newscodes/subjectcode/07000000

receptpligtig medicin
type: Concept
definition: Lægemiddel, der kun kan købes med tilladelse fra lægen.
in scheme: mediatopic
created: 2009-10-22T02:00:00+00:00
modified: 2022-06-14T12:00:00+00:00
broader: sundhedsbehandling

medicinsk kontrol og prøve
type: Concept
definition: Medicinske analyseprocedurer såsom blodprøver, stresstest, røntgenstråler, MR-scanning og mere.
in scheme: mediatopic
created: 2009-10-22T02:00:00+00:00
modified: 2022-06-14T12:00:00+00:00
broader: sundhedsbehandling

medicin
type: Concept
definition: Et stof, der bruges til at eliminere en sygdom.
in scheme: mediatopic
created: 2009-10-22T02:00:00+00:00
modified: 2022-06-14T12:00:00+00:00
broader: sundhedsbehandling
narrower: urtemedicin
narrower: holistisk medicin
narrower: traditionel kinesisk medicin
narrower: vestlig medicin

fysisk kondition
type: Concept
definition: En persons kropslige kondition og vedligeholdelsen af den.
in scheme: mediatopic
created: 2009-10-22T02:00:00+00:00
retired: 2022-06-14T12:00:00+00:00
modified: 2022-06-14T12:00:00+00:00
broader: sundhedsbehandling

forebyggende medicin
type: Concept
definition: Foranstaltninger, der sigter mod at opretholde et godt helbred og forebygge eller forværre kvæstelser og sygdomme.
in scheme: mediatopic
created: 2009-10-22T02:00:00+00:00
retired: 2022-06-14T12:00:00+00:00
modified: 2022-06-14T12:00:00+00:00
broader: sundhedsbehandling

vaccine
type: Concept
definition: Medicin designet til at skabe immunitet mod sygdomme.
in scheme: mediatopic
created: 2009-10-22T02:00:00+00:00
modified: 2022-06-14T12:00:00+00:00
broader: sundhedsbehandling

terapi
type: Concept
definition: Behandling af fysiske, mentale eller medicinske tilstande på ikke-kirurgiske måder.
in scheme: mediatopic
created: 2009-10-22T02:00:00+00:00
modified: 2021-02-18T12:00:00+00:00
broader: sundhedsbehandling

afvænning
type: Concept
definition: Pleje af personer, der er misbruger alkohol eller stoffer.
in scheme: mediatopic
created: 2019-04-06T12:00:00+00:00
modified: 2022-06-14T12:00:00+00:00
broader: sundhedsbehandling

akut behandling
type: Concept
definition: Akut pleje af patienter, der ankommer til en medicinsk nødsituation, enten med egne midler eller med ambulance.
in scheme: mediatopic
created: 2019-04-06T12:00:00+00:00
modified: 2022-06-14T12:00:00+00:00
broader: sundhedsbehandling

kirurgi
type: Concept
definition: Brug af snit lavet af medicinske instrumenter til at undersøge eller behandle en medicinsk tilstand eller skade.
in scheme: mediatopic
created: 2019-04-06T12:00:00+00:00
modified: 2021-07-12T12:00:00+00:00
broader: sundhedsbehandling

kosttilskud
type: Concept
definition: Fødevarer, der er beregnet til at supplere en normal diæt.
in scheme: mediatopic
created: 2009-10-22T02:00:00+00:00
modified: 2022-06-14T12:00:00+00:00
broader: diæt

urtemedicin
type: Concept
definition: Behandling baseret på brugen af urter og andre planter til at kurere eller lindre sygdomssymptomer.
in scheme: mediatopic
created: 2009-10-22T02:00:00+00:00
modified: 2022-06-14T12:00:00+00:00
broader: medicin

holistisk medicin
type: Concept
definition: Behandling af hele personen, inklusive mentale og sociale faktorer, i stedet for bare sygdommens symptomer.
in scheme: mediatopic
created: 2009-10-22T02:00:00+00:00
modified: 2022-06-14T12:00:00+00:00
broader: medicin

traditionel kinesisk medicin
type: Concept
definition: Praksis med at diagnosticere, behandle og forebygge sygdomme baseret på traditionelle metoder udviklet i Østasien.
in scheme: mediatopic
created: 2009-10-22T02:00:00+00:00
modified: 2022-06-14T12:00:00+00:00
broader: medicin

vestlig medicin
type: Concept
definition: Praksis med diagnose, behandling og forebyggelse af sygdom baseret på moderne videnskabelig forskning på den vestlige halvkugle.
in scheme: mediatopic
created: 2009-10-22T02:00:00+00:00
modified: 2022-06-14T12:00:00+00:00
broader: medicin

sundhedspolitik
type: Concept
definition: Politikker, der inkluderer civil sundhedspleje, tandpleje, militær sundhedspleje og folkesundhed generelt.
in scheme: mediatopic
created: 2009-10-22T02:00:00+00:00
modified: 2025-03-31T12:00:00+00:00
broader: regeringspolitik

sygehjælp
type: Concept
definition: Et offentligt finansieret sundhedsforsikringssystem i USA for lavindkomstindtægter og deres familier.
in scheme: mediatopic
created: 2009-10-22T02:00:00+00:00
retired: 2014-06-02T12:00:00+00:00
modified: 2021-02-18T12:00:00+00:00
broader: offentlig sygesikring

sundhedsforsikring
type: Concept
definition: Et offentligt finansieret sundhedsforsikringssystem i USA for personer, der er mindst 65 år eller handicappede.
in scheme: mediatopic
created: 2009-10-22T02:00:00+00:00
retired: 2014-06-02T12:00:00+00:00
modified: 2021-02-18T12:00:00+00:00
broader: offentlig sygesikring

medicinske støttefunktioner
type: Concept
definition: Medicinsk støtte til læger, herunder blodprøver og andre medicinske tests på individer, røntgenstråler CAT-scanninger MR-scanninger osv.
in scheme: mediatopic
created: 2009-10-22T02:00:00+00:00
modified: 2022-06-14T12:00:00+00:00
broader: sundhedspersonale

medicinsk specialisering
type: Concept
definition: De forskellige medicinske specialiserede områder.
in scheme: mediatopic
created: 2009-10-22T02:00:00+00:00
modified: 2022-06-14T12:00:00+00:00
broader: sundhedspersonale
narrower: geriatrisk medicin
narrower: obstetrik/gynækologi
narrower: pædiatri
narrower: reproduktiv medicin
narrower: tandpleje
narrower: farmakologi
narrower: veterinærmedicin
narrower: almen praksis
narrower: ortopædi
narrower: onkologi
narrower: radiologi
narrower: oftalmologi
narrower: kirurgisk medicin
narrower: psykiatri

medicinsk personale
type: Concept
definition: Læger, sygeplejersker, praktikanter og andre i en medicinsk facilitet.
in scheme: mediatopic
created: 2009-10-22T02:00:00+00:00
modified: 2021-05-05T12:00:00+00:00
broader: sundhedspersonale

geriatrisk medicin
type: Concept
definition: Specialitet i aldring og aldersrelaterede problemer, inklusive aldersrelaterede sygdomme, medicinsk forskning og tendenser.
in scheme: mediatopic
created: 2009-10-22T02:00:00+00:00
retired: 2022-06-14T12:00:00+00:00
modified: 2022-06-14T12:00:00+00:00
broader: medicinsk specialisering

obstetrik/gynækologi
type: Concept
definition: Specialitet i kvindelige reproduktionsorganer.
in scheme: mediatopic
created: 2009-10-22T02:00:00+00:00
retired: 2022-06-14T12:00:00+00:00
modified: 2022-06-14T12:00:00+00:00
broader: medicinsk specialisering

pædiatri
type: Concept
definition: Medicinsk vidensområde, der inkluderer sygdomme og sundhedsmæssige forhold hos børn og unge, og i nogle henseender også hos fostre i perioden umiddelbart før fødslen.
in scheme: mediatopic
created: 2009-10-22T02:00:00+00:00
modified: 2022-06-14T12:00:00+00:00
broader: medicinsk specialisering

reproduktiv medicin
type: Concept
definition: Forskellige metoder til behandling af par, der ikke kan få børn naturligt, såsom befrugtning af reagensglas.
in scheme: mediatopic
created: 2009-10-22T02:00:00+00:00
retired: 2022-06-14T12:00:00+00:00
modified: 2022-06-14T12:00:00+00:00
broader: medicinsk specialisering
broad match: http://cv.iptc.org/newscodes/subjectcode/07014003

tandpleje
type: Concept
definition: Det medicinske erhverv og forskningsområdet relateret til diagnose, forebyggelse og behandling af tænder.
in scheme: mediatopic
created: 2009-10-22T02:00:00+00:00
modified: 2021-02-18T12:00:00+00:00
broader: medicinsk specialisering
broad match: http://cv.iptc.org/newscodes/subjectcode/13019000

farmakologi
type: Concept
definition: Lægefaget og forskningsområdet relateret til lægemidler.
in scheme: mediatopic
created: 2009-10-22T02:00:00+00:00
retired: 2022-06-14T12:00:00+00:00
modified: 2022-06-14T12:00:00+00:00
broader: medicinsk specialisering
broad match: http://cv.iptc.org/newscodes/subjectcode/13019000

veterinærmedicin
type: Concept
definition: Det medicinske erhverv og forskningsfelt relateret til diagnose, forebyggelse og behandling af dyresygdomme.
in scheme: mediatopic
created: 2009-10-22T02:00:00+00:00
modified: 2021-02-18T12:00:00+00:00
broader: medicinsk specialisering
broad match: http://cv.iptc.org/newscodes/subjectcode/13019000

almen praksis
type: Concept
definition: Behandling af en lang række akutte og langvarige medicinske tilstande og symptomer.
in scheme: mediatopic
created: 2019-04-06T12:00:00+00:00
retired: 2022-06-14T12:00:00+00:00
modified: 2022-06-14T12:00:00+00:00
broader: medicinsk specialisering

ortopædi
type: Concept
definition: Sundhedspleje, der tager sig af ting, der vedrører kroppens led og mobilitet.
in scheme: mediatopic
created: 2019-04-06T12:00:00+00:00
retired: 2022-06-14T12:00:00+00:00
modified: 2022-06-14T12:00:00+00:00
broader: medicinsk specialisering

onkologi
type: Concept
definition: En medicinsk specialisering, der fokuserer på forebyggelse, diagnose og behandling af kræft.
in scheme: mediatopic
created: 2019-04-06T12:00:00+00:00
retired: 2022-06-14T12:00:00+00:00
modified: 2022-06-14T12:00:00+00:00
broader: medicinsk specialisering

radiologi
type: Concept
definition: En medicinsk specialisering, der fokuserer på brugen af medicinsk billeddannelse (såsom røntgenstråler) og stråling til diagnosticering og undertiden også behandling af sygdomme i kroppen.
in scheme: mediatopic
created: 2019-04-06T12:00:00+00:00
retired: 2022-06-14T12:00:00+00:00
modified: 2022-06-14T12:00:00+00:00
broader: medicinsk specialisering

oftalmologi
type: Concept
definition: En medicinsk specialisering, der fokuserer på sygdomme og lidelser i øjet.
in scheme: mediatopic
created: 2019-04-06T12:00:00+00:00
modified: 2022-06-14T12:00:00+00:00
broader: medicinsk specialisering

kirurgisk medicin
type: Concept
definition: Medicinsk pleje, hvor enhver form for intervention i kroppen udføres for at fjerne beskadigede dele eller reparere beskadigede ting.
in scheme: mediatopic
created: 2019-04-06T12:00:00+00:00
retired: 2022-06-14T12:00:00+00:00
modified: 2022-06-14T12:00:00+00:00
broader: medicinsk specialisering

psykiatri
type: Concept
definition: En medicinsk specialisering, der fokuserer på diagnose, forebyggelse og behandling af psykiske lidelser.
in scheme: mediatopic
created: 2019-04-06T12:00:00+00:00
retired: 2022-06-14T12:00:00+00:00
modified: 2022-06-14T12:00:00+00:00
broader: medicinsk specialisering

dyresygdom
type: Concept
definition: Sygdomme, der rammer dyr.
in scheme: mediatopic
created: 2009-10-22T02:00:00+00:00
modified: 2025-10-09T12:00:00+00:00
broader: dyr

plantesygdom
type: Concept
definition: Sygdomme, der påvirker planter, forårsaget af parasitter eller miljøproblemer.
in scheme: mediatopic
created: 2009-10-22T02:00:00+00:00
modified: 2025-10-09T12:00:00+00:00
broader: plante

skadedyr
type: Concept
definition: Dyr eller insekter, der trænger ind i menneskers ejendom og forårsager skade.
in scheme: mediatopic
created: 2021-02-18T12:00:00+00:00
modified: 2025-10-09T12:00:00+00:00
broader: dyr

navngivningsceremoni
type: Concept
definition: Ceremoni, hvor et barn eller en voksen får tildelt et navn.
in scheme: mediatopic
created: 2019-06-26T12:00:00+00:00
modified: 2021-07-12T12:00:00+00:00
broader: ceremoni

dimission
type: Concept
definition: En ceremoni, hvor en person modtager bevis for at have bestået en uddannelse.
in scheme: mediatopic
created: 2019-06-26T12:00:00+00:00
modified: 2021-07-12T12:00:00+00:00
broader: ceremoni

begravelse og bisættelse
type: Concept
definition: En ceremoni, hvor man mindes en afdød og begraver eller tager afsked med vedkommendes jordiske rester.
in scheme: mediatopic
created: 2019-06-26T12:00:00+00:00
modified: 2021-07-12T12:00:00+00:00
broader: ceremoni

bryllup
type: Concept
definition: Alt, hvad der foregår omkring et bryllup. Foruden selve ceremonien kan det være en reception, en bryllupsfest eller en polterabend.
in scheme: mediatopic
created: 2019-06-26T12:00:00+00:00
modified: 2021-07-12T12:00:00+00:00
broader: ceremoni

kongelige og kejserlige
type: Concept
definition: Nyheder om kongelige mennesker og især deres sociale liv, i modsætning til mere officielle opgaver.
in scheme: mediatopic
created: 2009-10-22T02:00:00+00:00
modified: 2021-05-05T12:00:00+00:00
broader: overklasse

lærling
type: Concept
definition: Enhver, der undervises i et erhverv, normalt et håndværk, ved at arbejde med nogen, der tidligere er blevet uddannet.
in scheme: mediatopic
created: 2009-10-22T02:00:00+00:00
modified: 2021-02-18T12:00:00+00:00
broader: ansættelse

børne- og ungearbejde
type: Concept
definition: Arbejde udført af børn under 18 år.
in scheme: mediatopic
created: 2009-10-22T02:00:00+00:00
modified: 2021-02-18T12:00:00+00:00
broader: ansættelse

medarbejder
type: Concept
definition: En person, der i en ansættelseskontrakt for vederlag, udfører arbejde for modparten, arbejdsgiveren.
in scheme: mediatopic
created: 2009-10-22T02:00:00+00:00
modified: 2021-02-18T12:00:00+00:00
broader: ansættelse

arbejdsgiver
type: Concept
definition: Den person, der beskæftiger arbejdstagere og betaler lønninger og andre fordele til arbejdstagerne.
in scheme: mediatopic
created: 2009-10-22T02:00:00+00:00
modified: 2021-02-18T12:00:00+00:00
broader: ansættelse

jobtræning
type: Concept
definition: At lære den viden og de færdigheder, der kræves til et bestemt erhverv.
in scheme: mediatopic
created: 2009-10-22T02:00:00+00:00
modified: 2021-02-18T12:00:00+00:00
broader: ansættelse
narrower: efteruddannelse
narrower: omskoling
broad match: http://cv.iptc.org/newscodes/subjectcode/09003000

profession og faglighed
type: Concept
definition: Den type arbejde, en person primært beskæftiger sig med.
in scheme: mediatopic
created: 2009-10-22T02:00:00+00:00
retired: 2019-10-07T12:00:00+00:00
modified: 2021-02-18T12:00:00+00:00
broader: ansættelse

løn og goder
type: Concept
definition: Vederlag, som en medarbejder modtager, når arbejdet er afsluttet.
in scheme: mediatopic
created: 2009-10-22T02:00:00+00:00
modified: 2021-02-18T12:00:00+00:00
broader: ansættelse
narrower: medarbejderfordel
narrower: social sikring
narrower: http://cv.iptc.org/newscodes/mediatopic/20001375
broad match: http://cv.iptc.org/newscodes/subjectcode/09011001

selvstændig beskæftigelse
type: Concept
definition: Når en person arbejder, men gør det i form af sit eget firma, som derefter har en kontrakt med et eller flere ordrerfirmaer eller personer.
in scheme: mediatopic
created: 2019-04-06T12:00:00+00:00
modified: 2021-07-12T12:00:00+00:00
broader: ansættelse

barsels- og forældreorlov
type: Concept
definition: Arbejdsorlov, som tildeles med det formål af føde eller passe et barn.
in scheme: mediatopic
created: 2019-10-07T12:00:00+00:00
modified: 2021-07-12T12:00:00+00:00
broader: ansættelse

frivilligt arbejde
type: Concept
definition: Ulønnet arbejde, som udføres af lyst med det formål at glæde eller gavne andre.
in scheme: mediatopic
created: 2019-10-07T12:00:00+00:00
modified: 2021-07-12T12:00:00+00:00
broader: ansættelse

efteruddannelse
type: Concept
definition: Studier og kurser for fagfolk og ledere med henblik på at give viden og færdigheder ud over, hvad en tidligere grunduddannelse har givet.
in scheme: mediatopic
created: 2009-10-22T02:00:00+00:00
retired: 2019-10-07T12:00:00+00:00
modified: 2021-05-05T12:00:00+00:00
broader: jobtræning

omskoling
type: Concept
definition: Uddannelse fra et erhverv til et andet, helst for voksne.
in scheme: mediatopic
created: 2009-10-22T02:00:00+00:00
retired: 2019-10-07T12:00:00+00:00
modified: 2021-02-18T12:00:00+00:00
broader: jobtræning

medarbejderfordel
type: Concept
definition: Fordele, som en virksomhed leverer til en medarbejder, såsom pensionsbidrag, sundhedsforsikring.
in scheme: mediatopic
created: 2009-10-22T02:00:00+00:00
retired: 2019-10-07T12:00:00+00:00
modified: 2021-02-18T12:00:00+00:00
broader: løn og goder

social sikring
type: Concept
definition: Penge, der indbetales af enkeltpersoner og virksomheder på en statskonto, der skal udbetales, når denne person når en bestemt alder.
in scheme: mediatopic
created: 2009-10-22T02:00:00+00:00
modified: 2021-02-18T12:00:00+00:00
broader: løn og goder

http://cv.iptc.org/newscodes/mediatopic/20001375
type: Concept
in scheme: mediatopic
created: 2023-10-02T12:00:00+00:00
modified: 2023-10-02T12:00:00+00:00
broader: løn og goder

sundhed og sikkerhed på arbejdspladsen
type: Concept
definition: Regler og procedurer for sikring af arbejdstagernes sundhed.
in scheme: mediatopic
created: 2009-10-22T02:00:00+00:00
modified: 2021-02-18T12:00:00+00:00
broader: ansættelseslovgivning

tidsbegrænset ansættelse
type: Concept
definition: En tendens på arbejdsmarkedet, hvor man ansættes fra dag til dag eller fra opgave til opgave i modsætning til fast arbejde samme sted.
in scheme: mediatopic
created: 2019-10-07T12:00:00+00:00
modified: 2021-07-12T12:00:00+00:00
broader: arbejdsmarked

kollektiv aftale
type: Concept
definition: Aftale mellem fagforeningsorganisation og arbejdsgiver om ansættelsesvilkår, herunder uenighed om dens fortolkning.
in scheme: mediatopic
created: 2009-10-22T02:00:00+00:00
modified: 2021-02-18T12:00:00+00:00
broader: overenskomst
narrower: kontraktligt problem - sundhedspleje
narrower: aftalebrud - løn
narrower: kontraktligt problem - arbejdsregel

arbejdskonflikt
type: Concept
definition: Konflikter mellem arbejdstagere og arbejdsgivere, der kommer til udtryk i eller fører til bekæmpelse, normalt strejke eller lockout.
in scheme: mediatopic
created: 2009-10-22T02:00:00+00:00
modified: 2021-02-18T12:00:00+00:00
broader: overenskomst
narrower: strejke og lockout

kontraktligt problem - sundhedspleje
type: Concept
definition: Aftale om foranstaltninger til forebyggelse af sygdom.
in scheme: mediatopic
created: 2009-10-22T02:00:00+00:00
retired: 2019-10-07T12:00:00+00:00
modified: 2021-05-05T12:00:00+00:00
broader: kollektiv aftale

aftalebrud - løn
type: Concept
definition: Aftale om kompensation for udført arbejde.
in scheme: mediatopic
created: 2009-10-22T02:00:00+00:00
retired: 2019-10-07T12:00:00+00:00
modified: 2021-05-05T12:00:00+00:00
broader: kollektiv aftale

kontraktligt problem - arbejdsregel
type: Concept
definition: Aftaler om arbejdstid, f.eks. længde, placering eller afbrydelse af arbejdet for hvile.
in scheme: mediatopic
created: 2009-10-22T02:00:00+00:00
retired: 2019-10-07T12:00:00+00:00
modified: 2021-02-18T12:00:00+00:00
broader: kollektiv aftale

strejke og lockout
type: Concept
definition: Organiseret lukning af arbejdet for at udøve pres på arbejdsgiveren i en længere eller kortere periode.
in scheme: mediatopic
created: 2009-10-22T02:00:00+00:00
modified: 2021-02-18T12:00:00+00:00
broader: arbejdskonflikt

pension
type: Concept
definition: Faste månedlige betalinger til en pensioneret person.
in scheme: mediatopic
created: 2009-10-22T02:00:00+00:00
modified: 2021-02-18T12:00:00+00:00
broader: pensionering
broad match: http://cv.iptc.org/newscodes/subjectcode/09006000

afskedigelse
type: Concept
definition: Reduktion af en virksomheds arbejdsstyrke set fra arbejdstagers synspunkt.
in scheme: mediatopic
created: 2009-10-22T02:00:00+00:00
retired: 2019-10-07T12:00:00+00:00
modified: 2021-02-18T12:00:00+00:00
broader: arbejdsløshed

arbejdsløshedsunderstøttelse
type: Concept
definition: Statsstøttet forsikring, der yder kompensation for uforsikret arbejdsløshed.
in scheme: mediatopic
created: 2009-10-22T02:00:00+00:00
modified: 2021-02-18T12:00:00+00:00
broader: arbejdsløshed
broad match: http://cv.iptc.org/newscodes/subjectcode/09009000

klub og forening
type: Concept
definition: Organisation med medlemmer, der deler en interesse.
in scheme: mediatopic
created: 2009-10-22T02:00:00+00:00
modified: 2021-02-18T12:00:00+00:00
broader: fritid

spil
type: Concept
definition: spil generelt for ens underholdning, og ofte med et konkurrencemoment.
in scheme: mediatopic
created: 2009-10-22T02:00:00+00:00
modified: 2021-02-18T12:00:00+00:00
broader: fritid
narrower: brætspil
narrower: kortspil
narrower: børnespil
narrower: terningspil
narrower: undendørsspil
narrower: kryds og gåder
narrower: brikspil
narrower: video- og computerspil

spil og lotteri
type: Concept
definition: Spil, hvor deltagernes chancer for at vinde, helt eller delvist beror på tilfældet.
in scheme: mediatopic
created: 2009-10-22T02:00:00+00:00
modified: 2021-02-18T12:00:00+00:00
broader: fritid

hobby
type: Concept
definition: Aktiviteter, som man i fritiden engagerer sig i, ofte med elementer af kreativitet.
in scheme: mediatopic
created: 2009-10-22T02:00:00+00:00
modified: 2021-02-18T12:00:00+00:00
broader: fritid
narrower: bilentusiasme
narrower: cykelentusiasme
narrower: interesse for mad
narrower: motorcykelentusiasme
narrower: samler

ferie
type: Concept
definition: Periode hvor man afholder fri fra skole eller arbejde, ofte betalt af arbejdsgiveren ifølge overenskomst.
in scheme: mediatopic
created: 2009-10-22T02:00:00+00:00
modified: 2021-02-18T12:00:00+00:00
broader: fritid
narrower: helligdag
narrower: halloween/allehelgensaften
broad match: http://cv.iptc.org/newscodes/subjectcode/10005000

underholdningssted
type: Concept
definition: Et sted, hvor folk går hen for at underholde sig eller blive underholdt.
in scheme: mediatopic
created: 2009-10-22T02:00:00+00:00
modified: 2021-05-05T12:00:00+00:00
broader: fritid
narrower: forlystelsespark
narrower: bar
narrower: cafe
narrower: natklub
narrower: restaurant
narrower: sportsfacilitet
narrower: zoologisk have
narrower: http://cv.iptc.org/newscodes/mediatopic/20001392
broad match: http://cv.iptc.org/newscodes/subjectcode/10000000

fritidsaktivitet
type: Concept
definition: Aktiviteter, der udføres i fritiden til glæde eller afslapning.
in scheme: mediatopic
created: 2009-10-22T02:00:00+00:00
modified: 2021-02-18T12:00:00+00:00
broader: fritid
narrower: lystfiskeri
narrower: jagt
narrower: flaskedykning
narrower: bjergklatring og -vandring
narrower: hesteridning
broad match: http://cv.iptc.org/newscodes/subjectcode/10000000

rejse
type: Concept
definition: Rejse i forbindelse med fornøjelse.
in scheme: mediatopic
created: 2009-10-22T02:00:00+00:00
modified: 2021-02-18T12:00:00+00:00
broader: fritid
narrower: turisme
broad match: http://cv.iptc.org/newscodes/subjectcode/10000000

brætspil
type: Concept
definition: Et spil spillet på et bræt.
in scheme: mediatopic
created: 2009-10-22T02:00:00+00:00
modified: 2021-02-18T12:00:00+00:00
broader: spil
broad match: http://cv.iptc.org/newscodes/subjectcode/10001000

kortspil
type: Concept
definition: Spil, hvor man bruger spillekort.
in scheme: mediatopic
created: 2009-10-22T02:00:00+00:00
modified: 2021-02-18T12:00:00+00:00
broader: spil
broad match: http://cv.iptc.org/newscodes/subjectcode/10001000

børnespil
type: Concept
definition: Et spil designet til og oftest spillet af børn.
in scheme: mediatopic
created: 2009-10-22T02:00:00+00:00
modified: 2021-04-09T12:00:00+00:00
broader: spil
broad match: http://cv.iptc.org/newscodes/subjectcode/10001000

terningspil
type: Concept
definition: Et spil, der kun spilles med terninger.
in scheme: mediatopic
created: 2009-10-22T02:00:00+00:00
modified: 2021-02-18T12:00:00+00:00
broader: spil
broad match: http://cv.iptc.org/newscodes/subjectcode/10001000

undendørsspil
type: Concept
definition: Spil, der udøves udendørs.
in scheme: mediatopic
created: 2009-10-22T02:00:00+00:00
modified: 2021-02-18T12:00:00+00:00
broader: spil
broad match: http://cv.iptc.org/newscodes/subjectcode/10001000

kryds og gåder
type: Concept
definition: Krydsord og andre logiske gåder.
in scheme: mediatopic
created: 2009-10-22T02:00:00+00:00
modified: 2021-02-18T12:00:00+00:00
broader: spil
broad match: http://cv.iptc.org/newscodes/subjectcode/10001000

brikspil
type: Concept
definition: Spil, der spilles med brikker, såsom domino.
in scheme: mediatopic
created: 2009-10-22T02:00:00+00:00
modified: 2021-02-18T12:00:00+00:00
broader: spil
broad match: http://cv.iptc.org/newscodes/subjectcode/10001000

video- og computerspil
type: Concept
definition: Digitalt spil, der foregår på en computer, spillekonsol eller mobiltelefon.
in scheme: mediatopic
created: 2009-10-22T02:00:00+00:00
modified: 2021-02-18T12:00:00+00:00
broader: spil
broad match: http://cv.iptc.org/newscodes/subjectcode/10001000

bilentusiasme
type: Concept
definition: Interesse for nye og gamle biler.
in scheme: mediatopic
created: 2009-10-22T02:00:00+00:00
modified: 2021-02-18T12:00:00+00:00
broader: hobby
broad match: http://cv.iptc.org/newscodes/subjectcode/10000000

cykelentusiasme
type: Concept
definition: Interesse for nye og gamle cykler.
in scheme: mediatopic
created: 2009-10-22T02:00:00+00:00
modified: 2021-02-18T12:00:00+00:00
broader: hobby
broad match: http://cv.iptc.org/newscodes/subjectcode/10000000

interesse for mad
type: Concept
definition: Interesse for mad og drikke.
in scheme: mediatopic
created: 2009-10-22T02:00:00+00:00
modified: 2021-02-18T12:00:00+00:00
broader: hobby
narrower: madlavning og bagning
narrower: øl, vin og spiritus
broad match: http://cv.iptc.org/newscodes/subjectcode/10000000

motorcykelentusiasme
type: Concept
definition: Interesse for nye og gamle motorkøretøjer med to eller tre hjul.
in scheme: mediatopic
created: 2009-10-22T02:00:00+00:00
modified: 2021-05-05T12:00:00+00:00
broader: hobby
broad match: http://cv.iptc.org/newscodes/subjectcode/10000000

samler
type: Concept
definition: En hobby, hvor man finder og køber genstande indenfor en bestemt kategori og måske udstiller, sorterer eller katalogiserer dem.
in scheme: mediatopic
created: 2019-07-30T12:00:00+00:00
modified: 2021-07-12T12:00:00+00:00
broader: hobby

helligdag
type: Concept
definition: En årlig officiel fridag til festligheder erklæret af myndighederne, ofte i forbindelse med en religiøs højtid.
in scheme: mediatopic
created: 2009-10-22T02:00:00+00:00
modified: 2021-02-18T12:00:00+00:00
broader: ferie
narrower: midsommer/sankthansfest
narrower: nationaldag
narrower: nytår

halloween/allehelgensaften
type: Concept
definition: Foregår 31. oktober og er oprindeligt en dag, hvor man mindes de døde. Efter amerikansk forbillede har fejringen i Danmark udviklet sig til en udklædningsfest, hvor man skræmmer hinanden for sjov, og hvor børnene tigger slik i nabolaget.
in scheme: mediatopic
created: 2019-09-05T12:00:00+00:00
modified: 2021-07-12T12:00:00+00:00
broader: ferie

midsommer/sankthansfest
type: Concept
definition: Særlig nordisk tradition, hvor man fejrer sommersolhvervet.
in scheme: mediatopic
created: 2019-09-05T12:00:00+00:00
modified: 2021-07-12T12:00:00+00:00
broader: helligdag

nationaldag
type: Concept
definition: En dato, hvor en nation fejrer sig selv. I Danmark sker det grundlovsdag (5. juni).
in scheme: mediatopic
created: 2019-09-05T12:00:00+00:00
modified: 2021-07-12T12:00:00+00:00
broader: helligdag

nytår
type: Concept
definition: Fejringen af, at et kalenderår afsluttes og et nyt begynder. Afhængig af kultur og tidsregning.
in scheme: mediatopic
created: 2019-09-05T12:00:00+00:00
modified: 2021-07-12T12:00:00+00:00
broader: helligdag

forlystelsespark
type: Concept
definition: En park med forskellige forlystelser og underholdningsattraktioner for både voksne og børn, herunder forlystelsesparker.
in scheme: mediatopic
created: 2009-10-22T02:00:00+00:00
modified: 2021-02-18T12:00:00+00:00
broader: underholdningssted
broad match: http://cv.iptc.org/newscodes/subjectcode/10000000

bar
type: Concept
definition: Et serveringssted, hvor drinks eller lette måltider tilberedes og serveres til offentligheden til indtagelse i lokalerne.
in scheme: mediatopic
created: 2009-10-22T02:00:00+00:00
modified: 2021-02-18T12:00:00+00:00
broader: underholdningssted
broad match: http://cv.iptc.org/newscodes/subjectcode/10000000

cafe
type: Concept
definition: Lokale, hvor der serveres kaffe, te og læskedrikke samt morgenmad, kager og sandwich.
in scheme: mediatopic
created: 2009-10-22T02:00:00+00:00
modified: 2021-02-18T12:00:00+00:00
broader: underholdningssted
broad match: http://cv.iptc.org/newscodes/subjectcode/10000000

natklub
type: Concept
definition: Bar eller restaurant der holder åbent om natten, og hvor underholdning kan forekomme i form af dans eller musik.
in scheme: mediatopic
created: 2009-10-22T02:00:00+00:00
modified: 2021-02-18T12:00:00+00:00
broader: underholdningssted

restaurant
type: Concept
definition: En forretning, hvor måltiderne tilberedes og serveres for offentligheden mod betaling.
in scheme: mediatopic
created: 2009-10-22T02:00:00+00:00
modified: 2021-02-18T12:00:00+00:00
broader: underholdningssted
broad match: http://cv.iptc.org/newscodes/subjectcode/10000000

sportsfacilitet
type: Concept
definition: Bygninger og anlæg, hvor sportsbegivenheder finder sted.
in scheme: mediatopic
created: 2009-10-22T02:00:00+00:00
retired: 2021-02-18T12:00:00+00:00
modified: 2021-02-18T12:00:00+00:00
broader: underholdningssted
broad match: http://cv.iptc.org/newscodes/subjectcode/10000000

zoologisk have
type: Concept
definition: En park, hvor de besøgende kan se både vilde og tamme dyr, der lever i bure eller indhegninger.
in scheme: mediatopic
created: 2021-02-18T12:00:00+00:00
modified: 2021-07-12T12:00:00+00:00
broader: underholdningssted

http://cv.iptc.org/newscodes/mediatopic/20001392
type: Concept
in scheme: mediatopic
created: 2025-06-30T12:00:00+00:00
modified: 2025-06-30T12:00:00+00:00
broader: underholdningssted

lystfiskeri
type: Concept
definition: En rekreativ aktivitet, hvor man forsøger at fange fisk ved hjælp af agn, våben og fælder.
in scheme: mediatopic
created: 2009-10-22T02:00:00+00:00
modified: 2021-02-18T12:00:00+00:00
broader: fritidsaktivitet

jagt
type: Concept
definition: En aktivitet, der involverer brug af våben eller fælder til fangst af dyr.
in scheme: mediatopic
created: 2009-10-22T02:00:00+00:00
modified: 2021-02-18T12:00:00+00:00
broader: fritidsaktivitet

flaskedykning
type: Concept
definition: Dykning i forskellige dybder med tidsmåling.
in scheme: mediatopic
created: 2009-10-22T02:00:00+00:00
modified: 2021-02-18T12:00:00+00:00
broader: fritidsaktivitet

bjergklatring og -vandring
type: Concept
definition: Sportsaktiviteter i bjergene.
in scheme: mediatopic
created: 2012-10-04T12:00:00+00:00
modified: 2023-10-02T12:00:00+00:00
broader: fritidsaktivitet

hesteridning
type: Concept
definition: Ridning for fornøjelsens skyld.
in scheme: mediatopic
created: 2019-06-26T12:00:00+00:00
modified: 2021-07-12T12:00:00+00:00
broader: fritidsaktivitet

turisme
type: Concept
definition: Fritidsrejser, der involverer besøg på en række lokationer og/eller lande over en længere periode, ofte som en del af en organiseret gruppe.
in scheme: mediatopic
created: 2009-10-22T02:00:00+00:00
retired: 2019-07-22T12:00:00+00:00
modified: 2021-02-18T12:00:00+00:00
broader: rejse

økologisk fødevare
type: Concept
definition: Mad der dyrkes uden kunstgødning eller kemiske forbindelser.
in scheme: mediatopic
created: 2009-10-22T02:00:00+00:00
modified: 2021-02-18T12:00:00+00:00
broader: livsstil

hus og hjem
type: Concept
definition: Interesse for hus og hjem, herunder indretning og have.
in scheme: mediatopic
created: 2009-10-22T02:00:00+00:00
modified: 2021-02-18T12:00:00+00:00
broader: livsstil
narrower: gør-det-selv
narrower: boligindretning
narrower: havearbejde
broad match: http://cv.iptc.org/newscodes/subjectcode/10000000

trends
type: Concept
definition: Interesse for udvikling af stil, mode og design.
in scheme: mediatopic
created: 2009-10-22T02:00:00+00:00
modified: 2021-02-18T12:00:00+00:00
broader: livsstil
narrower: kropsmodifikation
broad match: http://cv.iptc.org/newscodes/subjectcode/10000000

fest
type: Concept
definition: Social begivenhed med dans.
in scheme: mediatopic
created: 2012-10-04T12:00:00+00:00
modified: 2021-07-12T12:00:00+00:00
broader: livsstil

http://cv.iptc.org/newscodes/mediatopic/20001391
type: Concept
in scheme: mediatopic
created: 2025-06-30T12:00:00+00:00
modified: 2025-06-30T12:00:00+00:00
broader: livsstil

madlavning og bagning
type: Concept
definition: Interesse for at tilberede mad eller bagværk.
in scheme: mediatopic
created: 2019-07-30T12:00:00+00:00
modified: 2021-07-12T12:00:00+00:00
broader: interesse for mad

øl, vin og spiritus
type: Concept
definition: Interesse i produktionen eller nydelsen af alkoholiske drikke.
in scheme: mediatopic
created: 2019-07-30T12:00:00+00:00
modified: 2021-07-12T12:00:00+00:00
broader: interesse for mad

gør-det-selv
type: Concept
definition: Interesse i at istandsætte fast ejendom.
in scheme: mediatopic
created: 2019-07-30T12:00:00+00:00
modified: 2021-07-12T12:00:00+00:00
broader: hus og hjem

boligindretning
type: Concept
definition: Interesse i at indrette en bolig.
in scheme: mediatopic
created: 2019-07-30T12:00:00+00:00
modified: 2021-07-12T12:00:00+00:00
broader: hus og hjem

havearbejde
type: Concept
definition: Interesse i at beplante og ordne en have.
in scheme: mediatopic
created: 2019-07-30T12:00:00+00:00
modified: 2021-07-12T12:00:00+00:00
broader: hus og hjem

kropsmodifikation
type: Concept
definition: Kropsudsmykning, der ændrer kroppens udseende. Det kan være i form af piercing eller tatovering.
in scheme: mediatopic
created: 2019-07-30T12:00:00+00:00
modified: 2021-07-12T12:00:00+00:00
broader: trends
narrower: piercing
narrower: tatovering

borgerforslag
type: Concept
definition: Politiske forslag fra ngo'er eller enkeltpersoner til korrigerende handlinger eller ændringer i love og regler.
in scheme: mediatopic
created: 2009-10-22T02:00:00+00:00
modified: 2021-05-12T12:00:00+00:00
broader: valg

valgsystem
type: Concept
definition: Regler for hvordan et valg skal afvikles, og hvordan stemmerne omsættes i mandater inden for et bestemt politisk system.
in scheme: mediatopic
created: 2009-10-22T02:00:00+00:00
modified: 2024-09-26T12:00:00+00:00
broader: valg
broad match: http://cv.iptc.org/newscodes/subjectcode/11000000

mellemstatsligt valg
type: Concept
definition: At vælge repræsentanter til en mellemstatslig regering, f.eks. Europa-Parlamentet.
in scheme: mediatopic
created: 2009-10-22T02:00:00+00:00
modified: 2021-07-12T12:00:00+00:00
broader: valg
broad match: http://cv.iptc.org/newscodes/subjectcode/11000000

lokalvalg
type: Concept
definition: Valg af repræsentanter for en lokal regering, f.eks. en kommune.
in scheme: mediatopic
created: 2009-10-22T02:00:00+00:00
modified: 2021-07-12T12:00:00+00:00
broader: valg

nationalt valg
type: Concept
definition: At vælge repræsentanter til et nationalt parlament, f.eks. Folketinget.
in scheme: mediatopic
created: 2009-10-22T02:00:00+00:00
modified: 2021-07-12T12:00:00+00:00
broader: valg

politisk kampagne
type: Concept
definition: Intensive aktiviteter i en bestemt periode med henblik på at få en valgt.
in scheme: mediatopic
created: 2009-10-22T02:00:00+00:00
retired: 2024-09-26T12:00:00+00:00
modified: 2024-09-26T12:00:00+00:00
broader: valg

kampagnefinansiering
type: Concept
definition: Penge, der bruges til at hjælpe folk med at blive valgt.
in scheme: mediatopic
created: 2009-10-22T02:00:00+00:00
modified: 2021-02-18T12:00:00+00:00
broader: valg

politisk kandidat
type: Concept
definition: Enkeltpersoner, der er valgt til at stille op for deres respektive partier eller til valg.
in scheme: mediatopic
created: 2009-10-22T02:00:00+00:00
modified: 2021-02-18T12:00:00+00:00
broader: valg

primærvalg
type: Concept
definition: Forberedelse af lokale og regionale valg, især i USA, inden for et parti for at give vejledning til at nominere kandidater på regionalt eller nationalt niveau.
in scheme: mediatopic
created: 2009-10-22T02:00:00+00:00
modified: 2021-07-12T12:00:00+00:00
broader: valg

folkeafstemning
type: Concept
definition: Afstemning om et bestemt emne, hvor alle berettigede vælgere kan deltage.
in scheme: mediatopic
created: 2009-10-22T02:00:00+00:00
modified: 2024-09-26T12:00:00+00:00
broader: valg

regionalvalg
type: Concept
definition: Valg, hvor borgerne i de 5 danske regioner vælger medlemmer til regionsrådene.
in scheme: mediatopic
created: 2009-10-22T02:00:00+00:00
modified: 2021-07-12T12:00:00+00:00
broader: valg

afstemning
type: Concept
definition: At vælge den person eller det parti, som vælgeren ønsker, skal repræsentere sine interesser.
in scheme: mediatopic
created: 2009-10-22T02:00:00+00:00
modified: 2021-02-18T12:00:00+00:00
broader: valg

kirke- og menighedsrådsvalg
type: Concept
definition: Valghandling, hvor ledende personer i en kirkelig organisation skal udpeges.
in scheme: mediatopic
created: 2019-09-05T12:00:00+00:00
retired: 2024-09-26T12:00:00+00:00
modified: 2024-09-26T12:00:00+00:00
broader: valg

politisk debatmøde
type: Concept
definition: En organiseret debat mellem to eller flere kandidater. Kan foregå på tv og/eller foran et publikum.
in scheme: mediatopic
created: 2019-09-05T12:00:00+00:00
modified: 2021-07-12T12:00:00+00:00
broader: valg

http://cv.iptc.org/newscodes/mediatopic/20001380
type: Concept
in scheme: mediatopic
created: 2024-09-26T12:00:00+00:00
modified: 2024-09-26T12:00:00+00:00
broader: valg

http://cv.iptc.org/newscodes/mediatopic/20001381
type: Concept
in scheme: mediatopic
created: 2024-09-26T12:00:00+00:00
modified: 2024-09-26T12:00:00+00:00
broader: valg

http://cv.iptc.org/newscodes/mediatopic/20001382
type: Concept
in scheme: mediatopic
created: 2024-09-26T12:00:00+00:00
modified: 2024-09-26T12:00:00+00:00
broader: valg

censur
type: Concept
definition: Gruppers forsøg på at kontrollere trykke- og religionsfriheden i skrift, billede, internet og så videre.
in scheme: mediatopic
created: 2009-10-22T02:00:00+00:00
modified: 2021-02-18T12:00:00+00:00
broader: grundlæggende rettighed

religionsfrihed
type: Concept
definition: Retten til at udøve sin religion uden indblanding fra verdslige myndigheder.
in scheme: mediatopic
created: 2009-10-22T02:00:00+00:00
modified: 2021-05-05T12:00:00+00:00
broader: grundlæggende rettighed

pressefrihed
type: Concept
definition: Lovbestemt ret til frit at udtrykke tanker og meninger i trykt form, hvorved en anden end forfatteren holdes ansvarlig for publikationen.
in scheme: mediatopic
created: 2009-10-22T02:00:00+00:00
modified: 2021-02-18T12:00:00+00:00
broader: grundlæggende rettighed

menneskerettighed
type: Concept
definition: Individets grundlæggende rettigheder over for statsmagten, såsom ytringsfrihed, religionsfrihed og diskrimination.
in scheme: mediatopic
created: 2009-10-22T02:00:00+00:00
modified: 2021-02-18T12:00:00+00:00
broader: grundlæggende rettighed

privatliv
type: Concept
definition: Individets eller en gruppes rettighed til at holde personlige informationer privat.
in scheme: mediatopic
created: 2020-08-05T12:00:00+00:00
modified: 2021-07-12T12:00:00+00:00
broader: grundlæggende rettighed

http://cv.iptc.org/newscodes/mediatopic/20001326
type: Concept
in scheme: mediatopic
created: 2021-05-05T12:00:00+00:00
modified: 2021-12-21T12:00:00+00:00
broader: grundlæggende rettighed

offentlig forvaltning
type: Concept
definition: Statslig og kommunal forvaltning.
in scheme: mediatopic
created: 2009-10-22T02:00:00+00:00
retired: 2025-03-31T12:00:00+00:00
modified: 2025-03-31T12:00:00+00:00
broader: regering og Folketing
narrower: civil embedsvæsen

offentligt ansat
type: Concept
definition: Personer ansat af staten på alle niveauer.
in scheme: mediatopic
created: 2009-10-22T02:00:00+00:00
modified: 2025-03-31T12:00:00+00:00
broader: regering og Folketing

offentlig embedsmand
type: Concept
definition: Personer der arbejder inden for den offentlige administration.
in scheme: mediatopic
created: 2009-10-22T02:00:00+00:00
modified: 2025-03-31T12:00:00+00:00
broader: regering og Folketing

grundlov
type: Concept
definition: Et sæt juridiske bestemmelser, der specificerer, hvordan et bestemt land skal styres.
in scheme: mediatopic
created: 2009-10-22T02:00:00+00:00
modified: 2025-03-31T12:00:00+00:00
broader: regering og Folketing

forsvar
type: Concept
definition: Alt, der involverer beskyttelse af ens eget land.
in scheme: mediatopic
created: 2009-10-22T02:00:00+00:00
modified: 2025-03-31T12:00:00+00:00
broader: regering og Folketing
narrower: væbnet styrke
narrower: militært udstyr
narrower: våben
narrower: sikkerhedstiltag (forsvar)
narrower: spionage- og efterretningsaktivitet

udøvende (regering)
type: Concept
definition: Den højeste udøvende magt i et land, hvor magten er delt i tre mellem udøvende, lovgivende og dømmende.
in scheme: mediatopic
created: 2009-10-22T02:00:00+00:00
modified: 2025-03-31T12:00:00+00:00
broader: regering og Folketing

finanslov
type: Concept
definition: Et skøn på forhånd af statens indtægter og udgifter i et år, regnskabsåret.
in scheme: mediatopic
created: 2009-10-22T02:00:00+00:00
modified: 2025-03-31T12:00:00+00:00
broader: regering og Folketing
narrower: offentlige finanser
broad match: http://cv.iptc.org/newscodes/subjectcode/11013000

ministerium
type: Concept
definition: Afdeling under statsforvaltningen som administrerer lovgivning etc. på et bestemt område, og som ledes af en minister.
in scheme: mediatopic
created: 2009-10-22T02:00:00+00:00
retired: 2025-03-31T12:00:00+00:00
modified: 2025-03-31T12:00:00+00:00
broader: regering og Folketing

statsoverhoved
type: Concept
definition: Øverste leder eller repræsentant for en stat f.eks. konge, dronning eller præsident.
in scheme: mediatopic
created: 2009-10-22T02:00:00+00:00
modified: 2025-03-31T12:00:00+00:00
broader: regering og Folketing

rigsretssag
type: Concept
definition: Proces med at bringe regeringsmedlemmer eller lignende personer for en særlig domstol for lovstridig embedsførelse.
in scheme: mediatopic
created: 2009-10-22T02:00:00+00:00
modified: 2021-02-18T12:00:00+00:00
broader: regering og Folketing

kommune
type: Concept
definition: Lokal myndighed, som ledes af en valgt kommunalbestyrelse.
in scheme: mediatopic
created: 2009-10-22T02:00:00+00:00
modified: 2025-03-31T12:00:00+00:00
broader: regering og Folketing

minister (regering)
type: Concept
definition: Medlem af en regering og leder af et ministerium.
in scheme: mediatopic
created: 2009-10-22T02:00:00+00:00
modified: 2025-03-31T12:00:00+00:00
broader: regering og Folketing

national regering
type: Concept
definition: Et lands styrende organ.
in scheme: mediatopic
created: 2009-10-22T02:00:00+00:00
modified: 2021-02-18T12:00:00+00:00
broader: regering og Folketing

lovgivende parlament
type: Concept
definition: Folkevalgt forsamling der udgør den øverste lovgivende magt i et land.
in scheme: mediatopic
created: 2009-10-22T02:00:00+00:00
modified: 2021-03-31T12:00:00+00:00
broader: regering og Folketing
narrower: nedre hus (parlament)
narrower: øverste hus (parlament)

region
type: Concept
definition: Myndigheder, der arbejder på et niveau mellem det lokale og det nationale.
in scheme: mediatopic
created: 2009-10-22T02:00:00+00:00
modified: 2025-03-31T12:00:00+00:00
broader: regering og Folketing

lobbyvirksomhed
type: Concept
definition: Påvirkning af f.eks. embedsmænd eller politikere til at tage bestemte beslutninger i forbindelse med udarbejdelse og vedtagelse af love etc..
in scheme: mediatopic
created: 2009-10-22T02:00:00+00:00
modified: 2025-03-31T12:00:00+00:00
broader: regering og Folketing

politisk parti og bevægelse
type: Concept
definition: Sammenslutning eller gruppe af vælgere, der optræder i valg under særlig udpegning såvel som mere uformelle politiske formationer.
in scheme: mediatopic
created: 2009-10-22T02:00:00+00:00
retired: 2025-03-31T12:00:00+00:00
modified: 2025-03-31T12:00:00+00:00
broader: regering og Folketing

politisk udvikling
type: Concept
definition: Oprettelsen og opkomsten af politiske systemer og historien til de mennesker og nationer, der er forbundet med disse systemer.
in scheme: mediatopic
created: 2009-10-22T02:00:00+00:00
retired: 2025-03-31T12:00:00+00:00
modified: 2025-03-31T12:00:00+00:00
broader: regering og Folketing

politisk system
type: Concept
definition: Et system med embedsmænd og institutioner, der sammen udøver politisk magt.
in scheme: mediatopic
created: 2009-10-22T02:00:00+00:00
modified: 2025-03-31T12:00:00+00:00
broader: regering og Folketing
narrower: demokrati
narrower: diktatur
narrower: http://cv.iptc.org/newscodes/mediatopic/20001386
narrower: http://cv.iptc.org/newscodes/mediatopic/20001387
narrower: http://cv.iptc.org/newscodes/mediatopic/20001388
narrower: http://cv.iptc.org/newscodes/mediatopic/20001389

styrelse og tilsyn
type: Concept
definition: Myndigheder, der er ansvarlige for at regulere og føre tilsyn med en branche.
in scheme: mediatopic
created: 2016-04-04T12:00:00+00:00
retired: 2025-03-31T12:00:00+00:00
modified: 2025-03-31T12:00:00+00:00
broader: regering og Folketing

politisk kongres eller årsmøde
type: Concept
definition: Et års- eller landsmøde, hvor et politisk parti fastlægger sin politik, foretager valg til tillidsposter og udnævner kandidater.
in scheme: mediatopic
created: 2019-09-05T12:00:00+00:00
modified: 2025-03-31T12:00:00+00:00
broader: regering og Folketing

politisk udvalg
type: Concept
definition: En underafdeling af en lovgivende forsamling, der beskæftiger sig med et særligt emne eller geografisk område.
in scheme: mediatopic
created: 2019-09-05T12:00:00+00:00
modified: 2025-03-31T12:00:00+00:00
broader: regering og Folketing

regeringschef
type: Concept
definition: Den øverste politiske ansvarlige i en stat eller et selvstyreområde.
in scheme: mediatopic
created: 2019-09-05T12:00:00+00:00
modified: 2025-03-31T12:00:00+00:00
broader: regering og Folketing

kommission
type: Concept
definition: En officiel undersøgelse af en begivenhed eller sag, som er iværksat af en statslig myndighed.
in scheme: mediatopic
created: 2019-09-05T12:00:00+00:00
modified: 2021-07-12T12:00:00+00:00
broader: regering og Folketing

partiledelse
type: Concept
definition: Ledelsen i et politisk partis landsorganisation eller folketingsgruppe.
in scheme: mediatopic
created: 2021-02-18T12:00:00+00:00
modified: 2025-03-31T12:00:00+00:00
broader: regering og Folketing

http://cv.iptc.org/newscodes/mediatopic/20001384
type: Concept
in scheme: mediatopic
created: 2025-03-31T12:00:00+00:00
modified: 2025-03-31T12:00:00+00:00
broader: regering og Folketing

http://cv.iptc.org/newscodes/mediatopic/20001385
type: Concept
in scheme: mediatopic
created: 2025-03-31T12:00:00+00:00
modified: 2025-03-31T12:00:00+00:00
broader: regering og Folketing

civil embedsvæsen
type: Concept
definition: Arbejde udført af den del af samfundet, hvor mennesker hjælper hinanden uden inddragelse af offentligheden, staten eller kommunerne.
in scheme: mediatopic
created: 2012-10-04T12:00:00+00:00
retired: 2025-03-31T12:00:00+00:00
modified: 2021-07-12T12:00:00+00:00
broader: offentlig forvaltning

væbnet styrke
type: Concept
definition: De, der er ansat af staten til, at føre krig eller forsvare kongeriget.
in scheme: mediatopic
created: 2009-10-22T02:00:00+00:00
modified: 2025-03-31T12:00:00+00:00
broader: forsvar
narrower: veterananliggende
narrower: værnepligt/militærtjeneste

militært udstyr
type: Concept
definition: Udstyr brugt af medlemmer af et lands væbnede styrker.
in scheme: mediatopic
created: 2009-10-22T02:00:00+00:00
retired: 2025-03-31T12:00:00+00:00
modified: 2025-03-31T12:00:00+00:00
broader: forsvar

våben
type: Concept
definition: Et lands samling af våben.
in scheme: mediatopic
created: 2009-10-22T02:00:00+00:00
modified: 2025-03-31T12:00:00+00:00
broader: forsvar

sikkerhedstiltag (forsvar)
type: Concept
definition: Midler til at beskytte en stat, bygning eller person mod skade.
in scheme: mediatopic
created: 2009-10-22T02:00:00+00:00
retired: 2025-03-31T12:00:00+00:00
modified: 2025-03-31T12:00:00+00:00
broader: forsvar
narrower: national sikkerhed

spionage- og efterretningsaktivitet
type: Concept
definition: Skjult indsamling af information.
in scheme: mediatopic
created: 2009-10-22T02:00:00+00:00
modified: 2025-03-31T12:00:00+00:00
broader: forsvar

veterananliggende
type: Concept
definition: Anliggender der vedrører de tidligere ansatte i de væbnede styrker.
in scheme: mediatopic
created: 2009-10-22T02:00:00+00:00
modified: 2021-05-05T12:00:00+00:00
broader: væbnet styrke

værnepligt/militærtjeneste
type: Concept
definition: Obligatorisk tjeneste for borgerne ved det nationale militær i en begrænset periode.
in scheme: mediatopic
created: 2012-10-04T12:00:00+00:00
modified: 2021-07-12T12:00:00+00:00
broader: væbnet styrke

national sikkerhed
type: Concept
definition: Arbejdet med at sikre en stat og dens grænser mod udefra- og indefrakommende trusler og bevare borgernes trivsel.
in scheme: mediatopic
created: 2009-10-22T02:00:00+00:00
retired: 2025-03-31T12:00:00+00:00
modified: 2025-03-31T12:00:00+00:00
broader: sikkerhedstiltag (forsvar)

offentlige finanser
type: Concept
definition: De offentlige finanser er en samlet betegnelse for den offentlige sektors indtægter og udgifter.
in scheme: mediatopic
created: 2009-10-22T02:00:00+00:00
retired: 2025-03-31T12:00:00+00:00
modified: 2025-03-31T12:00:00+00:00
broader: finanslov

nedre hus (parlament)
type: Concept
definition: Den direkte valgte del af et parlament.
in scheme: mediatopic
created: 2009-10-22T02:00:00+00:00
modified: 2021-02-18T12:00:00+00:00
broader: lovgivende parlament

øverste hus (parlament)
type: Concept
definition: Den indirekte valgte del af et parlament.
in scheme: mediatopic
created: 2009-10-22T02:00:00+00:00
modified: 2021-02-18T12:00:00+00:00
broader: lovgivende parlament

borgeres sikkerhed
type: Concept
definition: Politikker, der sigter mod at beskytte borgerne.
in scheme: mediatopic
created: 2009-10-22T02:00:00+00:00
retired: 2025-03-31T12:00:00+00:00
modified: 2025-03-31T12:00:00+00:00
broader: regeringspolitik

skattepolitik
type: Concept
definition: Politik, der vedrører opkrævning af skatter og afgifter til bl.a. finansiering af offentlige udgifter.
in scheme: mediatopic
created: 2009-10-22T02:00:00+00:00
modified: 2025-03-31T12:00:00+00:00
broader: regeringspolitik
broad match: http://cv.iptc.org/newscodes/subjectcode/11013000

indenrigspolitik
type: Concept
definition: Politik der vedrører et lands interne anliggender.
in scheme: mediatopic
created: 2009-10-22T02:00:00+00:00
retired: 2025-03-31T12:00:00+00:00
modified: 2025-03-31T12:00:00+00:00
broader: regeringspolitik

IT-sikkerhedspolitik
type: Concept
definition: Politikker, der sigter mod at beskytte data i it-systemer.
in scheme: mediatopic
created: 2009-10-22T02:00:00+00:00
modified: 2025-03-31T12:00:00+00:00
broader: regeringspolitik

bolig- og byplanlægningspolitik
type: Concept
definition: Systematisk planlægning af by- og forstadsområder og boliger inden for disse områder.
in scheme: mediatopic
created: 2009-10-22T02:00:00+00:00
modified: 2025-03-31T12:00:00+00:00
broader: regeringspolitik

politik for indfødte
type: Concept
definition: Politikker, der påvirker statens forhold til nationale mindretal.
in scheme: mediatopic
created: 2009-10-22T02:00:00+00:00
modified: 2025-03-31T12:00:00+00:00
broader: regeringspolitik

pensions- og velfærdspolitik
type: Concept
definition: Politik, der påvirker borgernes velbefindende, såsom arbejdsløshedsunderstøttelse, folkepension og lignende.
in scheme: mediatopic
created: 2009-10-22T02:00:00+00:00
modified: 2025-03-31T12:00:00+00:00
broader: regeringspolitik

politik for personlig dataindsamling
type: Concept
definition: Bestemmelser om beskyttelse af behandling af personoplysninger herunder den frie strøm af sådanne data.
in scheme: mediatopic
created: 2009-10-22T02:00:00+00:00
retired: 2025-03-31T12:00:00+00:00
modified: 2025-03-31T12:00:00+00:00
broader: regeringspolitik

våbenlovgivning
type: Concept
definition: Bestemmelser om besiddelse af våben og ammunition.
in scheme: mediatopic
created: 2009-10-22T02:00:00+00:00
modified: 2025-03-31T12:00:00+00:00
broader: regeringspolitik

bygge- og anlægshøring
type: Concept
definition: Teknisk høring om foreslåede bygningsstrukturer.
in scheme: mediatopic
created: 2009-10-22T02:00:00+00:00
retired: 2025-03-31T12:00:00+00:00
modified: 2025-03-31T12:00:00+00:00
broader: regeringspolitik

migration
type: Concept
definition: Politik vedrørende modtagelse af mennesker fra andre lande.
in scheme: mediatopic
created: 2009-10-22T02:00:00+00:00
modified: 2025-03-31T12:00:00+00:00
broader: regeringspolitik

atompolitik
type: Concept
definition: Politikker, der vedrører kernekraft som energikilde eller som del af et våbenarsenal.
in scheme: mediatopic
created: 2009-10-22T02:00:00+00:00
modified: 2025-03-31T12:00:00+00:00
broader: regeringspolitik

regulering af industri
type: Concept
definition: Regler og organisationer, både nationale og internationale, der bruges til at løse interessekonflikter og skabe gode regler i en del af erhvervslivet.
in scheme: mediatopic
created: 2009-10-22T02:00:00+00:00
modified: 2025-03-31T12:00:00+00:00
broader: regeringspolitik
narrower: fødevarepolitik

kulturpolitik
type: Concept
definition: Politik, der påvirker kulturlivet.
in scheme: mediatopic
created: 2012-10-04T12:00:00+00:00
modified: 2025-03-31T12:00:00+00:00
broader: regeringspolitik

integrationspolitik
type: Concept
definition: Politik om indvandring og integration, herunder hvordan man sikrer at nye medborgere finder sig til rette i samfundet.
in scheme: mediatopic
created: 2012-10-04T12:00:00+00:00
retired: 2025-03-31T12:00:00+00:00
modified: 2025-03-31T12:00:00+00:00
broader: regeringspolitik

Idrætspolitik
type: Concept
definition: Politik, der påvirker sport.
in scheme: mediatopic
created: 2012-10-04T12:00:00+00:00
modified: 2025-03-31T12:00:00+00:00
broader: regeringspolitik

regional udviklingspolitik
type: Concept
definition: Politikker, der sigter mod at sikre lige vilkår for udviklingen af samfundet i forskellige dele af et land.
in scheme: mediatopic
created: 2016-04-04T12:00:00+00:00
modified: 2025-03-31T12:00:00+00:00
broader: regeringspolitik

infrastrukturpolitik
type: Concept
definition: Politik, der fastlægger retningen for nybyggeri og vedligeholdelse af grundlæggende faciliteter som veje og kommunikation.
in scheme: mediatopic
created: 2019-09-05T12:00:00+00:00
modified: 2025-03-31T12:00:00+00:00
broader: regeringspolitik

lokalt selvstyre
type: Concept
definition: Politik, der uddelegerer beslutningskompetence til politiske enheder på lokalt niveau.
in scheme: mediatopic
created: 2019-09-05T12:00:00+00:00
modified: 2021-07-12T12:00:00+00:00
broader: regeringspolitik

http://cv.iptc.org/newscodes/mediatopic/20001338
type: Concept
in scheme: mediatopic
created: 2021-12-17T12:00:00+00:00
modified: 2025-03-31T12:00:00+00:00
broader: regeringspolitik

http://cv.iptc.org/newscodes/mediatopic/20001383
type: Concept
in scheme: mediatopic
created: 2025-03-31T12:00:00+00:00
modified: 2025-03-31T12:00:00+00:00
broader: regeringspolitik

fødevarepolitik
type: Concept
definition: Politik, der påvirker mad og drikke.
in scheme: mediatopic
created: 2009-10-22T02:00:00+00:00
modified: 2025-03-31T12:00:00+00:00
broader: regulering af industri
broad match: http://cv.iptc.org/newscodes/subjectcode/11022000

diplomati
type: Concept
definition: Aktiviteter i forbindelse med mellemstatslige politiske forbindelser.
in scheme: mediatopic
created: 2009-10-22T02:00:00+00:00
modified: 2025-03-31T12:00:00+00:00
broader: international forbindelse
narrower: topmøde
narrower: traktat

økonomisk sanktion
type: Concept
definition: En stats eller international organisations afbrydelse af økonomiske forbindelser med en anden stat for at nå politiske mål eller håndhæve regler.
in scheme: mediatopic
created: 2009-10-22T02:00:00+00:00
modified: 2025-03-31T12:00:00+00:00
broader: international forbindelse

udviklingsbistand
type: Concept
definition: Hjælp fra én stat til en anden.
in scheme: mediatopic
created: 2009-10-22T02:00:00+00:00
modified: 2025-03-31T12:00:00+00:00
broader: international forbindelse

international organisation
type: Concept
definition: Organisationer med medlemmer og funktioner, der krydser internationale grænser, kan omfatte mellemstatslige organisationer.
in scheme: mediatopic
created: 2009-10-22T02:00:00+00:00
modified: 2025-03-31T12:00:00+00:00
broader: international forbindelse

flygtning og internt fordrevet
type: Concept
definition: En person, der undgik enhver fare, især fare for liv, frihed og mere i sit hjemland på grund af race, religion, nationalitet, tilhørende en bestemt social gruppe eller politisk mening.
in scheme: mediatopic
created: 2009-10-22T02:00:00+00:00
modified: 2025-03-31T12:00:00+00:00
broader: international forbindelse

grænsestridigheder
type: Concept
definition: Diplomatiske uengheder mellem to lande, der grænser op til hinanden. Kan udvikle sig til kamphandlinger.
in scheme: mediatopic
created: 2021-02-18T12:00:00+00:00
modified: 2025-03-31T12:00:00+00:00
broader: international forbindelse

topmøde
type: Concept
definition: Møder på højt niveau, ofte mellem stats- eller regeringschefer.
in scheme: mediatopic
created: 2009-10-22T02:00:00+00:00
modified: 2025-03-31T12:00:00+00:00
broader: diplomati

traktat
type: Concept
definition: En skriftlig aftale mellem internationale enheder, der er bindende i henhold til folkeretten.
in scheme: mediatopic
created: 2009-10-22T02:00:00+00:00
modified: 2025-03-31T12:00:00+00:00
broader: diplomati

demokrati
type: Concept
definition: Regering, hvor folket besidder magten enten direkte eller gennem valgte embedsmænd.
in scheme: mediatopic
created: 2009-10-22T02:00:00+00:00
modified: 2025-03-31T12:00:00+00:00
broader: politisk system

diktatur
type: Concept
definition: Regeringsform, hvor al statsmagt er koncentreret til en bestemt person eller gruppe.
in scheme: mediatopic
created: 2009-10-22T02:00:00+00:00
modified: 2025-03-31T12:00:00+00:00
broader: politisk system
broad match: http://cv.iptc.org/newscodes/subjectcode/11006000

http://cv.iptc.org/newscodes/mediatopic/20001386
type: Concept
in scheme: mediatopic
created: 2025-03-31T12:00:00+00:00
modified: 2025-03-31T12:00:00+00:00
broader: politisk system

http://cv.iptc.org/newscodes/mediatopic/20001387
type: Concept
in scheme: mediatopic
created: 2025-03-31T12:00:00+00:00
modified: 2025-03-31T12:00:00+00:00
broader: politisk system

http://cv.iptc.org/newscodes/mediatopic/20001388
type: Concept
in scheme: mediatopic
created: 2025-03-31T12:00:00+00:00
modified: 2025-03-31T12:00:00+00:00
broader: politisk system

http://cv.iptc.org/newscodes/mediatopic/20001389
type: Concept
in scheme: mediatopic
created: 2025-03-31T12:00:00+00:00
modified: 2025-03-31T12:00:00+00:00
broader: politisk system

buddhisme
type: Concept
definition: En østlig religion, der baserer sig på Buddhas lære.
in scheme: mediatopic
created: 2009-10-22T02:00:00+00:00
modified: 2021-12-21T12:00:00+00:00
broader: religiøs overbevisning

kristendom/folkekirke
type: Concept
definition: Religion baseret på Jesus Kristus og hans prædikener.
in scheme: mediatopic
created: 2009-10-22T02:00:00+00:00
modified: 2021-12-21T12:00:00+00:00
broader: religiøs overbevisning
narrower: økumeni
narrower: mormon
narrower: gammelkatolik
narrower: ortodoks
narrower: protestant
narrower: romersk-katolsk
narrower: http://cv.iptc.org/newscodes/mediatopic/20001344

konfucianisme
type: Concept
definition: En kinesisk visdom og social lære, der er baseret på idéer fra tænkeren Confucius.
in scheme: mediatopic
created: 2009-10-22T02:00:00+00:00
modified: 2021-12-17T12:00:00+00:00
broader: religiøs overbevisning

kult og sekt
type: Concept
definition: Religiøse grupperinger, der er kendetegnet ved en diffus organisation og et afvigende trossystem i forhold til andre religiøse grupper.
in scheme: mediatopic
created: 2009-10-22T02:00:00+00:00
modified: 2021-12-21T12:00:00+00:00
broader: religiøs overbevisning

frimureri
type: Concept
definition: Et hemmeligt internationalt samfund baseret på principperne om broderskab, velgørenhed og gensidig hjælp.
in scheme: mediatopic
created: 2009-10-22T02:00:00+00:00
retired: 2021-12-17T12:00:00+00:00
modified: 2021-12-17T12:00:00+00:00
broader: religiøs overbevisning

hinduisme
type: Concept
definition: En indisk religion med en tro på selvtransformation og den guddommelige tilstedeværelse i alle dele af universet.
in scheme: mediatopic
created: 2009-10-22T02:00:00+00:00
modified: 2021-12-21T12:00:00+00:00
broader: religiøs overbevisning

islam
type: Concept
definition: Monoteistisk religion, der regner Muhammed som en profet og Koranen som hellig skrift.
in scheme: mediatopic
created: 2009-10-22T02:00:00+00:00
modified: 2021-12-17T12:00:00+00:00
broader: religiøs overbevisning
narrower: http://cv.iptc.org/newscodes/mediatopic/20001347
narrower: http://cv.iptc.org/newscodes/mediatopic/20001348

jainisme
type: Concept
definition: Jainisme er en indisk religion baseret på Mahavir Swamis forkyndelser.
in scheme: mediatopic
created: 2009-10-22T02:00:00+00:00
modified: 2021-12-21T12:00:00+00:00
broader: religiøs overbevisning

jødedom
type: Concept
definition: Monoteistisk religion baseret på Det Gamle Testamente.
in scheme: mediatopic
created: 2009-10-22T02:00:00+00:00
modified: 2021-12-21T12:00:00+00:00
broader: religiøs overbevisning
narrower: http://cv.iptc.org/newscodes/mediatopic/20001351

naturreligion
type: Concept
definition: Tilbedelse af naturlige elementer som ild, vand, træer og bjerge.
in scheme: mediatopic
created: 2009-10-22T02:00:00+00:00
modified: 2021-12-21T12:00:00+00:00
broader: religiøs overbevisning

zoroastrianisme
type: Concept
definition: En religion i Indien efter den iranske profet Zoroaster, hovedsageligt i Bombay, men også i Karachi (Pakistan).
in scheme: mediatopic
created: 2009-10-22T02:00:00+00:00
modified: 2021-12-17T12:00:00+00:00
broader: religiøs overbevisning

Scientology
type: Concept
definition: Scientology er en nyreligiøs bevægelse startet omkring 1951 af den amerikanskfødte forfatter L. Ron Hubbard med oprindelse i hans Dianetik.
in scheme: mediatopic
created: 2009-10-22T02:00:00+00:00
modified: 2021-12-21T12:00:00+00:00
broader: religiøs overbevisning

shintoisme
type: Concept
definition: Urbefolkningens religiøse overbevisning og praksis i Japan. Ordet Shinto kom i brug for at skelne den oprindelige japanske tro fra buddhismen.
in scheme: mediatopic
created: 2009-10-22T02:00:00+00:00
modified: 2021-12-17T12:00:00+00:00
broader: religiøs overbevisning

sikhisme
type: Concept
definition: En religion, som kombinerer hinduistiske og islamiske elementer og blev grundlagt i Punjabi slutningen af det 15. århundrede e.Kr. af Guru Nanak.
in scheme: mediatopic
created: 2009-10-22T02:00:00+00:00
modified: 2021-12-17T12:00:00+00:00
broader: religiøs overbevisning

taoisme
type: Concept
definition: En kinesisk visdomslære, der går ind for et enkelt liv i harmoni med naturen.
in scheme: mediatopic
created: 2009-10-22T02:00:00+00:00
modified: 2021-12-17T12:00:00+00:00
broader: religiøs overbevisning

Moon-bevægelsen
type: Concept
definition: Trosystemet for medlemmer af Unification Church oprettet af præsten Sun Myung Moon.
in scheme: mediatopic
created: 2009-10-22T02:00:00+00:00
modified: 2021-12-17T12:00:00+00:00
broader: religiøs overbevisning

http://cv.iptc.org/newscodes/mediatopic/20001349
type: Concept
in scheme: mediatopic
created: 2021-12-17T12:00:00+00:00
modified: 2021-12-21T12:00:00+00:00
broader: religiøs overbevisning

økumeni
type: Concept
definition: Forholdet mellem kristne kirker.
in scheme: mediatopic
created: 2009-10-22T02:00:00+00:00
retired: 2021-12-17T12:00:00+00:00
modified: 2021-02-18T12:00:00+00:00
broader: kristendom/folkekirke

mormon
type: Concept
definition: En kristen bevægelse, hvis grundlag foruden Bibelen bl.a. er *Mormons Bog*, som blev åbenbaret for J. Smith i 1827.
in scheme: mediatopic
created: 2009-10-22T02:00:00+00:00
modified: 2021-12-21T12:00:00+00:00
broader: kristendom/folkekirke

gammelkatolik
type: Concept
definition: Medlemmer af en katolsk kirke, der startede i 1870 og benægter dogmen om pavens ufejlbarhed.
in scheme: mediatopic
created: 2009-10-22T02:00:00+00:00
retired: 2021-12-17T12:00:00+00:00
modified: 2021-02-18T12:00:00+00:00
broader: kristendom/folkekirke

ortodoks
type: Concept
definition: En kristen retning, især aktiv i Østeuropa, kendetegnet ved dens fortsatte tro på kirkefædre og deres liturgi.
in scheme: mediatopic
created: 2009-10-22T02:00:00+00:00
modified: 2021-12-17T12:00:00+00:00
broader: kristendom/folkekirke

protestant
type: Concept
definition: Generel betegnelse for kristne kirker og religiøse samfund, der udviklede sig gennem reformeringen i det 16. århundrede.
in scheme: mediatopic
created: 2009-10-22T02:00:00+00:00
modified: 2021-12-17T12:00:00+00:00
broader: kristendom/folkekirke
narrower: anglikansk
narrower: baptist
narrower: luthersk
narrower: mennonit
narrower: methodist
narrower: reformert

romersk-katolsk
type: Concept
definition: Den største kristne kirke verden over, der sporer dens oprindelse til Jesus Kristus.
in scheme: mediatopic
created: 2009-10-22T02:00:00+00:00
retired: 2021-12-17T12:00:00+00:00
modified: 2021-02-18T12:00:00+00:00
broader: kristendom/folkekirke
narrower: konkordat

http://cv.iptc.org/newscodes/mediatopic/20001344
type: Concept
in scheme: mediatopic
created: 2021-12-17T12:00:00+00:00
modified: 2021-12-21T12:00:00+00:00
broader: kristendom/folkekirke

anglikansk
type: Concept
definition: Den pædagogiske, liturgiske og etiske holdning, der kendetegner den engelske statskirke.
in scheme: mediatopic
created: 2009-10-22T02:00:00+00:00
retired: 2021-12-17T12:00:00+00:00
modified: 2021-02-18T12:00:00+00:00
broader: protestant

baptist
type: Concept
definition: En kristen retning, der hævder, at dåb skal foregå med et bevidst valg, og som derfor afviser børnedåb.
in scheme: mediatopic
created: 2009-10-22T02:00:00+00:00
retired: 2021-12-17T12:00:00+00:00
modified: 2021-07-12T12:00:00+00:00
broader: protestant

luthersk
type: Concept
definition: En kortfattet beskrivelse af kirkerne og fromhedslivet baseret på Martin Luther og den lutherske reformation.
in scheme: mediatopic
created: 2009-10-22T02:00:00+00:00
retired: 2021-12-17T12:00:00+00:00
modified: 2021-02-18T12:00:00+00:00
broader: protestant

mennonit
type: Concept
definition: Medlemmer af en kristen kirke fra 1500-tallet, som er imod militærtjeneste og at døbe spædbørn.
in scheme: mediatopic
created: 2009-10-22T02:00:00+00:00
retired: 2021-12-17T12:00:00+00:00
modified: 2021-12-17T12:00:00+00:00
broader: protestant

methodist
type: Concept
definition: En frikirkebevægelse med fokus på omhyggeligt planlagt fromhedsliv.
in scheme: mediatopic
created: 2009-10-22T02:00:00+00:00
retired: 2021-12-17T12:00:00+00:00
modified: 2021-02-18T12:00:00+00:00
broader: protestant

reformert
type: Concept
definition: Kristne, der følger undervisningen af reformatorerne Johannes Calvin og Ulrich Zwingli.
in scheme: mediatopic
created: 2009-10-22T02:00:00+00:00
retired: 2021-12-17T12:00:00+00:00
modified: 2021-02-18T12:00:00+00:00
broader: protestant

konkordat
type: Concept
definition: Aftale mellem en stat og den romersk-katolske kirke.
in scheme: mediatopic
created: 2009-10-22T02:00:00+00:00
retired: 2021-12-17T12:00:00+00:00
modified: 2021-12-17T12:00:00+00:00
broader: romersk-katolsk

http://cv.iptc.org/newscodes/mediatopic/20001347
type: Concept
in scheme: mediatopic
created: 2021-12-17T12:00:00+00:00
modified: 2021-12-21T12:00:00+00:00
broader: islam

http://cv.iptc.org/newscodes/mediatopic/20001348
type: Concept
in scheme: mediatopic
created: 2021-12-17T12:00:00+00:00
modified: 2021-12-21T12:00:00+00:00
broader: islam

http://cv.iptc.org/newscodes/mediatopic/20001351
type: Concept
in scheme: mediatopic
created: 2021-12-17T12:00:00+00:00
modified: 2021-12-21T12:00:00+00:00
broader: jødedom

jul
type: Concept
definition: Kristen højtid til minde om Jesu Kristi fødsel.
in scheme: mediatopic
created: 2009-10-22T02:00:00+00:00
modified: 2021-12-21T12:00:00+00:00
broader: religiøs helligdag og fest

påske
type: Concept
definition: Kristen højtid til minde om Jesu Kristi opstandelse.
in scheme: mediatopic
created: 2009-10-22T02:00:00+00:00
modified: 2021-12-17T12:00:00+00:00
broader: religiøs helligdag og fest

pinse
type: Concept
definition: Kristen højtid, fejret 50 dage efter påske til minde om Helligåndens komme.
in scheme: mediatopic
created: 2009-10-22T02:00:00+00:00
modified: 2021-12-17T12:00:00+00:00
broader: religiøs helligdag og fest

ramadan
type: Concept
definition: Den muslimske fastemåned.
in scheme: mediatopic
created: 2009-10-22T02:00:00+00:00
modified: 2021-12-17T12:00:00+00:00
broader: religiøs helligdag og fest

yom kippur
type: Concept
definition: Forsoningsdag inden for den jødiske religion fejret i efteråret.
in scheme: mediatopic
created: 2009-10-22T02:00:00+00:00
modified: 2021-12-17T12:00:00+00:00
broader: religiøs helligdag og fest

allehelgensdag
type: Concept
definition: En fejring af alle helgener, som ikke er en dansk helligdag. Ligger altid 1. november.
in scheme: mediatopic
created: 2019-09-05T12:00:00+00:00
modified: 2021-12-17T12:00:00+00:00
broader: religiøs helligdag og fest

valborgsaften
type: Concept
definition: En tradition, hvor man tæner bål aftenen før 1. maj for at holde heksene væk. Er ikke særligt udbredt i Danmark længere
in scheme: mediatopic
created: 2019-09-05T12:00:00+00:00
modified: 2021-07-12T12:00:00+00:00
broader: religiøs helligdag og fest

http://cv.iptc.org/newscodes/mediatopic/20001350
type: Concept
in scheme: mediatopic
created: 2021-12-17T12:00:00+00:00
modified: 2021-12-21T12:00:00+00:00
broader: religiøs helligdag og fest

http://cv.iptc.org/newscodes/mediatopic/20001352
type: Concept
in scheme: mediatopic
created: 2021-12-17T12:00:00+00:00
modified: 2021-12-21T12:00:00+00:00
broader: religiøs helligdag og fest

dåb
type: Concept
definition: En kristen ceremoni, hvor man dypper en person i vand som et symbol på renselse og dens indtræden i den kristne kirke.
in scheme: mediatopic
created: 2019-09-05T12:00:00+00:00
modified: 2021-12-17T12:00:00+00:00
broader: religiøst ritual

http://cv.iptc.org/newscodes/mediatopic/20001345
type: Concept
in scheme: mediatopic
created: 2021-12-17T12:00:00+00:00
modified: 2021-12-21T12:00:00+00:00
broader: religiøst ritual

http://cv.iptc.org/newscodes/mediatopic/20001346
type: Concept
in scheme: mediatopic
created: 2021-12-17T12:00:00+00:00
modified: 2021-12-21T12:00:00+00:00
broader: religiøst ritual

kirke
type: Concept
definition: Generelt en bygning, der kan identificeres som et sted for tilbedelse for den kristne religion.
in scheme: mediatopic
created: 2009-10-22T02:00:00+00:00
modified: 2021-12-17T12:00:00+00:00
broader: religiøs facilitet
broad match: http://cv.iptc.org/newscodes/subjectcode/12000000

moské
type: Concept
definition: Generelt en bygning, der kan identificeres som et sted for tilbedelse for den islamiske religion.
in scheme: mediatopic
created: 2009-10-22T02:00:00+00:00
modified: 2021-12-17T12:00:00+00:00
broader: religiøs facilitet
broad match: http://cv.iptc.org/newscodes/subjectcode/12000000

synagoge
type: Concept
definition: Generelt en bygning, der kan identificeres som et sted for tilbedelse for den jødiske religion.
in scheme: mediatopic
created: 2009-10-22T02:00:00+00:00
modified: 2021-12-17T12:00:00+00:00
broader: religiøs facilitet
broad match: http://cv.iptc.org/newscodes/subjectcode/12000000

tempel
type: Concept
definition: Generelt en bygning, der kan identificeres som et sted for tilbedelse.
in scheme: mediatopic
created: 2009-10-22T02:00:00+00:00
retired: 2021-12-17T12:00:00+00:00
modified: 2021-02-18T12:00:00+00:00
broader: religiøs facilitet
broad match: http://cv.iptc.org/newscodes/subjectcode/12000000

pave
type: Concept
definition: Den øverste leder af den romersk-katolske kirke.
in scheme: mediatopic
created: 2009-10-22T02:00:00+00:00
modified: 2021-12-17T12:00:00+00:00
broader: religiøs leder

Bibel
type: Concept
definition: Hellige skrifter om kristendommen bestående af det gamle og nye testamente.
in scheme: mediatopic
created: 2009-10-22T02:00:00+00:00
modified: 2021-12-17T12:00:00+00:00
broader: religiøs tekst

Koran
type: Concept
definition: Den hellige islambog.
in scheme: mediatopic
created: 2009-10-22T02:00:00+00:00
modified: 2021-02-18T12:00:00+00:00
broader: religiøs tekst

Tora
type: Concept
definition: Jødedommens hellige skrifter.
in scheme: mediatopic
created: 2009-10-22T02:00:00+00:00
modified: 2021-12-17T12:00:00+00:00
broader: religiøs tekst

bioteknologi
type: Concept
definition: Den videnskabelige manipulation af levende organismer og biologiske processer til videnskabelige, medicinske eller landbrugsmæssige formål.
in scheme: mediatopic
created: 2009-10-22T02:00:00+00:00
modified: 2021-02-18T12:00:00+00:00
broader: biomedicinsk videnskab

maskiningeniør
type: Concept
definition: Videnskaben og brugen af design, konstruktion og håndtering af mekaniske systemer.
in scheme: mediatopic
created: 2009-10-22T02:00:00+00:00
modified: 2021-02-18T12:00:00+00:00
broader: teknologi og teknik
broad match: http://cv.iptc.org/newscodes/subjectcode/13002000

astronomi
type: Concept
definition: Undersøgelse af himmelobjekter gennem direkte observation og teoretiske modeller.
in scheme: mediatopic
created: 2009-10-22T02:00:00+00:00
modified: 2021-02-18T12:00:00+00:00
broader: naturvidenskab

biologi
type: Concept
definition: Videnskaben om de levende organismer.
in scheme: mediatopic
created: 2009-10-22T02:00:00+00:00
modified: 2021-02-18T12:00:00+00:00
broader: naturvidenskab
narrower: botanik
narrower: genetik
narrower: palæontologi
narrower: fysiologi
narrower: zoologi

kemi
type: Concept
definition: Undersøgelsen af stoffets sammensætning og egenskaber i skalaen fra atomer og molekyler og af reaktionerne mellem forbindelser.
in scheme: mediatopic
created: 2009-10-22T02:00:00+00:00
modified: 2021-02-18T12:00:00+00:00
broader: naturvidenskab

kosmologi
type: Concept
definition: Undersøgelsen af universets oprindelse, evolution, organisering og struktur.
in scheme: mediatopic
created: 2009-10-22T02:00:00+00:00
modified: 2021-02-18T12:00:00+00:00
broader: naturvidenskab

geologi
type: Concept
definition: Undersøgelsen af Jordens fysiske processer, materielle strukturer og dens egenskaber.
in scheme: mediatopic
created: 2009-10-22T02:00:00+00:00
modified: 2021-02-18T12:00:00+00:00
broader: naturvidenskab

havebrug
type: Concept
definition: Undersøgelse og kunst af plantedyrkning, herunder landskabs- og havedesign og plantebeskyttelse.
in scheme: mediatopic
created: 2009-10-22T02:00:00+00:00
modified: 2021-02-18T12:00:00+00:00
broader: naturvidenskab
broad match: http://cv.iptc.org/newscodes/subjectcode/13004000

marinevidenskab
type: Concept
definition: Undersøgelsen af levende organismer og miljøer i saltvand økosystemer.
in scheme: mediatopic
created: 2009-10-22T02:00:00+00:00
modified: 2021-02-18T12:00:00+00:00
broader: naturvidenskab

meteorologi
type: Concept
definition: Undersøgelsen af atmosfærisk kemi og fysik med fokus på vejrprognose.
in scheme: mediatopic
created: 2009-10-22T02:00:00+00:00
modified: 2021-02-18T12:00:00+00:00
broader: naturvidenskab

fysik
type: Concept
definition: Undersøgelsen af materiens bevægelse og struktur, og hvordan den forholder sig til energi.
in scheme: mediatopic
created: 2009-10-22T02:00:00+00:00
modified: 2021-02-18T12:00:00+00:00
broader: naturvidenskab
narrower: elektromagnetisme
narrower: atomfysik

botanik
type: Concept
definition: Planternes videnskab.
in scheme: mediatopic
created: 2009-10-22T02:00:00+00:00
modified: 2021-02-18T12:00:00+00:00
broader: biologi

genetik
type: Concept
definition: Undersøgelse af gener i levende organismer og af deres rolle i arvelighed, udvikling eller genetisk tilpasning.
in scheme: mediatopic
created: 2009-10-22T02:00:00+00:00
modified: 2021-02-18T12:00:00+00:00
broader: biologi

palæontologi
type: Concept
definition: Undersøgelsen af forhistoriske livsformer, geologiske perioder og fossiler.
in scheme: mediatopic
created: 2009-10-22T02:00:00+00:00
modified: 2021-02-18T12:00:00+00:00
broader: biologi

fysiologi
type: Concept
definition: Undersøgelse af de vitale processer, indre organer eller funktionelle mekanismer i levende organismer.
in scheme: mediatopic
created: 2009-10-22T02:00:00+00:00
modified: 2021-02-18T12:00:00+00:00
broader: biologi

zoologi
type: Concept
definition: Undersøgelsen af biologi, fysiologi, udvikling, adfærd eller andre aspekter af dyr.
in scheme: mediatopic
created: 2009-10-22T02:00:00+00:00
modified: 2021-02-18T12:00:00+00:00
broader: biologi

elektromagnetisme
type: Concept
definition: Undersøgelsen af de fysiske interaktioner mellem elektrisk ladede partikler og magnetiske felter.
in scheme: mediatopic
created: 2009-10-22T02:00:00+00:00
modified: 2021-07-12T12:00:00+00:00
broader: fysik
broad match: http://cv.iptc.org/newscodes/subjectcode/13001001

atomfysik
type: Concept
definition: Undersøgelsen af atomkerners struktur og opførsel.
in scheme: mediatopic
created: 2009-10-22T02:00:00+00:00
modified: 2021-02-18T12:00:00+00:00
broader: fysik
narrower: partikelfysik
broad match: http://cv.iptc.org/newscodes/subjectcode/13001001

partikelfysik
type: Concept
definition: Videnskaben for de mindste bestanddele af stof, deres struktur og deres interaktion.
in scheme: mediatopic
created: 2009-10-22T02:00:00+00:00
modified: 2021-02-18T12:00:00+00:00
broader: atomfysik

videnskabelig innovation
type: Concept
definition: Udvikling eller oprettelse af nye videnskabelige eller teknologiske produkter eller processer, såsom AI-applikationer, robotarme og nanokameraer.
in scheme: mediatopic
created: 2009-10-22T02:00:00+00:00
modified: 2021-02-18T12:00:00+00:00
broader: videnskabelig undersøgelse
broad match: http://cv.iptc.org/newscodes/subjectcode/13006000

medicinsk forskning
type: Concept
definition: Undersøgelse foretaget inden for sundhed og medicin, såsom genetiske studier, sygdomsforskning eller farmaceutiske lægemiddelforsøg.
in scheme: mediatopic
created: 2009-10-22T02:00:00+00:00
modified: 2021-02-18T12:00:00+00:00
broader: videnskabelig undersøgelse

videnskabelig ekspedition
type: Concept
definition: Land-, sø- eller rumrejser, der er foretaget for at finde nye oplysninger.
in scheme: mediatopic
created: 2009-10-22T02:00:00+00:00
modified: 2021-02-18T12:00:00+00:00
broader: videnskabelig undersøgelse
narrower: rumfart

videnskabelig publikation
type: Concept
definition: Akademiske forskningsresultater offentliggjort i et tidsskrift, bog eller speciale.
in scheme: mediatopic
created: 2009-10-22T02:00:00+00:00
modified: 2021-02-18T12:00:00+00:00
broader: videnskabelig undersøgelse
broad match: http://cv.iptc.org/newscodes/subjectcode/13006000

rumfart
type: Concept
definition: Den videnskabelige udforskning af det ydre rum gennem bemandede og ubemandede missioner.
in scheme: mediatopic
created: 2009-10-22T02:00:00+00:00
modified: 2021-02-18T12:00:00+00:00
broader: videnskabelig ekspedition

antropologi
type: Concept
definition: Videnskab af menneskelig adfærd og sociale interaktioner på tværs af tiden.
in scheme: mediatopic
created: 2009-10-22T02:00:00+00:00
modified: 2021-02-18T12:00:00+00:00
broader: samfundsvidenskab

arkæologi
type: Concept
definition: Videnskab af menneskelig aktivitet gennem tid og kulturhistorie ved hjælp af artefakter, der er efterladt af gamle folk.
in scheme: mediatopic
created: 2009-10-22T02:00:00+00:00
modified: 2021-02-18T12:00:00+00:00
broader: samfundsvidenskab

økonomi (videnskab)
type: Concept
definition: Videnskab af økonomiernes love og principper, såsom produktion og distribution af varer og tjenester.
in scheme: mediatopic
created: 2009-10-22T02:00:00+00:00
modified: 2021-02-18T12:00:00+00:00
broader: samfundsvidenskab
broad match: http://cv.iptc.org/newscodes/subjectcode/04017000

geografi
type: Concept
definition: Videnskaben af de fysiske træk ved jordoverfladen og dens politiske opdelinger.
in scheme: mediatopic
created: 2009-10-22T02:00:00+00:00
modified: 2021-02-18T12:00:00+00:00
broader: samfundsvidenskab

historie
type: Concept
definition: Videnskaben om alt, hvad der er sket i fortiden med den menneskelige race, og udforskningen og beskrivelsen af den.
in scheme: mediatopic
created: 2009-10-22T02:00:00+00:00
modified: 2021-02-18T12:00:00+00:00
broader: samfundsvidenskab

informationsvidenskab
type: Concept
definition: Videnskaben og praksis med at indsamle, klassificere, lagre, hente og formidle information.
in scheme: mediatopic
created: 2009-10-22T02:00:00+00:00
modified: 2021-02-18T12:00:00+00:00
broader: samfundsvidenskab
broad match: http://cv.iptc.org/newscodes/subjectcode/13003001

jura
type: Concept
definition: Videnskaben om juridiske regler og deres anvendelse.
in scheme: mediatopic
created: 2009-10-22T02:00:00+00:00
modified: 2023-10-02T12:00:00+00:00
broader: samfundsvidenskab
broad match: http://cv.iptc.org/newscodes/subjectcode/13003001

lingvistik
type: Concept
definition: Videnskaben af alle aspekter af det menneskelige sprog såsom syntaks, fonetik, skriftlige og talte former og variationer over tid.
in scheme: mediatopic
created: 2009-10-22T02:00:00+00:00
modified: 2021-02-18T12:00:00+00:00
broader: samfundsvidenskab
broad match: http://cv.iptc.org/newscodes/subjectcode/13000000

filosofi
type: Concept
definition: Videnskaben om de grundlæggende betingelser for eksistens, viden og moral.
in scheme: mediatopic
created: 2009-10-22T02:00:00+00:00
modified: 2021-02-18T12:00:00+00:00
broader: samfundsvidenskab

statskundskab
type: Concept
definition: En samfundsvidenskabelig disciplin fokuseret på studiet af politik.
in scheme: mediatopic
created: 2009-10-22T02:00:00+00:00
modified: 2021-02-18T12:00:00+00:00
broader: samfundsvidenskab
broad match: http://cv.iptc.org/newscodes/subjectcode/13000000

psykologi
type: Concept
definition: Videnskaben om sjæleliv (folks oplevelser, følelser, adfærd og tanker generelt).
in scheme: mediatopic
created: 2009-10-22T02:00:00+00:00
modified: 2021-02-18T12:00:00+00:00
broader: samfundsvidenskab

sociologi
type: Concept
definition: Videnskaben om social opførsel, grupper og forhold.
in scheme: mediatopic
created: 2009-10-22T02:00:00+00:00
modified: 2021-02-18T12:00:00+00:00
broader: samfundsvidenskab

luftfartsteknologi
type: Concept
definition: Videnskab, design, udvikling og konstruktion af fly, rumfartøjer og missilsystemer.
in scheme: mediatopic
created: 2009-10-22T02:00:00+00:00
modified: 2021-02-18T12:00:00+00:00
broader: teknologi og teknik
narrower: raket
broad match: http://cv.iptc.org/newscodes/subjectcode/04011001

landbrugsteknologi
type: Concept
definition: Videnskab og udvikling af teknikker og maskiner, der forbedrer landbrugsstyring og produktivitet.
in scheme: mediatopic
created: 2009-10-22T02:00:00+00:00
modified: 2021-05-05T12:00:00+00:00
broader: teknologi og teknik
broad match: http://cv.iptc.org/newscodes/subjectcode/13020000

ingeniørvidenskab
type: Concept
definition: Videnskab, design, udvikling og konstruktion af strukturer såsom bygninger, broer, tunneler, kunstvandings- og kloaksystemer, veje og jernbaner.
in scheme: mediatopic
created: 2009-10-22T02:00:00+00:00
modified: 2021-02-18T12:00:00+00:00
broader: teknologi og teknik
broad match: http://cv.iptc.org/newscodes/subjectcode/13002000

elektronikteknik
type: Concept
definition: Videnskab og teknologi vedrørende ledning af elektricitet i vakuum, gasser og halvledere.
in scheme: mediatopic
created: 2009-10-22T02:00:00+00:00
modified: 2021-02-18T12:00:00+00:00
broader: teknologi og teknik

identifikationsteknologi
type: Concept
definition: Videnskab, udvikling, anvendelse og etiske spørgsmål vedrørende tekniske metoder til genkendelse af produkter, dyr eller mennesker, såsom ansigtsgenkendelse og biometrisk teknologi.
in scheme: mediatopic
created: 2009-10-22T02:00:00+00:00
modified: 2021-02-18T12:00:00+00:00
broader: teknologi og teknik

informationsteknologi og datalogi
type: Concept
definition: Videnskab og design relateret til computersystemer, software og netværk.
in scheme: mediatopic
created: 2009-10-22T02:00:00+00:00
modified: 2021-02-18T12:00:00+00:00
broader: teknologi og teknik
narrower: kunstig intelligens

materialevidenskab
type: Concept
definition: Videnskaben om grundlæggende principper for konstruktion af materialer.
in scheme: mediatopic
created: 2009-10-22T02:00:00+00:00
modified: 2021-02-18T12:00:00+00:00
broader: teknologi og teknik

mikrovidenskab
type: Concept
definition: Videnskab af og teknologier bygget på mikroskopisk skala, såsom mikrobiologi eller mikrocomputing.
in scheme: mediatopic
created: 2009-10-22T02:00:00+00:00
modified: 2021-02-18T12:00:00+00:00
broader: teknologi og teknik
narrower: nanoteknologi

raket
type: Concept
definition: Videnskab, design, udvikling og konstruktion af raketter.
in scheme: mediatopic
created: 2009-10-22T02:00:00+00:00
modified: 2021-02-18T12:00:00+00:00
broader: luftfartsteknologi

kunstig intelligens
type: Concept
definition: Et videnskabeligt forsøg på at bruge computerteknologi til at simulere den menneskelige hjerne ved brug af statistiske, heuristiske metoder eller algoritmer på store datasæt.
in scheme: mediatopic
created: 2020-08-05T12:00:00+00:00
modified: 2021-07-12T12:00:00+00:00
broader: informationsteknologi og datalogi

nanoteknologi
type: Concept
definition: Teknologi til fremstilling, påvirkning og håndtering af materialer og genstande med mindst en dimension i størrelsesordenen 1–100 nanometer.
in scheme: mediatopic
created: 2009-10-22T02:00:00+00:00
modified: 2021-02-18T12:00:00+00:00
broader: mikrovidenskab

socialt netværk
type: Concept
definition: Opbygning af fællesskaber af mennesker, herunder brug af onlinemedier.
in scheme: mediatopic
created: 2009-10-22T02:00:00+00:00
modified: 2021-02-18T12:00:00+00:00
broader: fællesskab
broad match: http://cv.iptc.org/newscodes/subjectcode/14000000

http://cv.iptc.org/newscodes/mediatopic/20001360
type: Concept
in scheme: mediatopic
created: 2022-09-23T12:00:00+00:00
modified: 2022-09-23T12:00:00+00:00
broader: fællesskab

befolkning og folketælling
type: Concept
definition: Antallet af mennesker i en geografisk region og deres antal.
in scheme: mediatopic
created: 2009-10-22T02:00:00+00:00
modified: 2021-05-05T12:00:00+00:00
broader: demografi

illegal indvandrer
type: Concept
definition: Bevægelse af enkeltpersoner fra det ene land til det andet med ulovlige midler.
in scheme: mediatopic
created: 2009-10-22T02:00:00+00:00
modified: 2021-02-18T12:00:00+00:00
broader: indvandring

aldersdiskrimination
type: Concept
definition: Skadelige holdninger til en anden gruppe baseret på forskellige aldre.
in scheme: mediatopic
created: 2009-10-22T02:00:00+00:00
modified: 2021-02-18T12:00:00+00:00
broader: forskelsbehandling
broad match: http://cv.iptc.org/newscodes/subjectcode/14025003

racisme
type: Concept
definition: Skadelige holdninger til en anden gruppe baseret på racemæssige forskelle.
in scheme: mediatopic
created: 2009-10-22T02:00:00+00:00
modified: 2021-02-18T12:00:00+00:00
broader: forskelsbehandling

religiøs diskrimination
type: Concept
definition: Skadelige holdninger til en anden gruppe baseret på religiøs overbevisning.
in scheme: mediatopic
created: 2009-10-22T02:00:00+00:00
modified: 2021-02-18T12:00:00+00:00
broader: forskelsbehandling
broad match: http://cv.iptc.org/newscodes/subjectcode/14025003

sexisme
type: Concept
definition: Skadelige holdninger til en anden gruppe baseret på kønsforskelle.
in scheme: mediatopic
created: 2009-10-22T02:00:00+00:00
modified: 2021-09-30T12:00:00+00:00
broader: forskelsbehandling
broad match: http://cv.iptc.org/newscodes/subjectcode/14025003

adoption
type: Concept
definition: At formelt adoptere en person som deres eget barn.
in scheme: mediatopic
created: 2009-10-22T02:00:00+00:00
modified: 2021-02-18T12:00:00+00:00
broader: familie

frieri
type: Concept
definition: At kurtisere og vinde en partner.
in scheme: mediatopic
created: 2009-10-22T02:00:00+00:00
modified: 2021-07-12T12:00:00+00:00
broader: familie

skilsmisse
type: Concept
definition: Den proces, hvorpå et ægteskab opløses.
in scheme: mediatopic
created: 2009-10-22T02:00:00+00:00
modified: 2022-06-14T12:00:00+00:00
broader: familie

familieplanlægning
type: Concept
definition: Et bevidst forsøg på at påvirke familiens størrelse.
in scheme: mediatopic
created: 2009-10-22T02:00:00+00:00
modified: 2022-06-14T12:00:00+00:00
broader: familie
narrower: abort
narrower: prævention

ægteskab
type: Concept
definition: De ceremonier og festligheder, der finder sted, når to mennesker gifter sig.
in scheme: mediatopic
created: 2009-10-22T02:00:00+00:00
modified: 2021-03-15T12:00:00+00:00
broader: familie

forælder og barn
type: Concept
definition: To eller flere individer med et hierarkisk familieforhold.
in scheme: mediatopic
created: 2009-10-22T02:00:00+00:00
modified: 2021-02-18T12:00:00+00:00
broader: familie

http://cv.iptc.org/newscodes/mediatopic/20001359
type: Concept
in scheme: mediatopic
created: 2022-06-14T12:00:00+00:00
modified: 2022-06-14T12:00:00+00:00
broader: familie

abort
type: Concept
definition: Det faktum, at en graviditet afbrydes inden slutningen af den 22. uge af graviditeten, og at fosteret er død ved fødslen.
in scheme: mediatopic
created: 2009-10-22T02:00:00+00:00
modified: 2021-02-18T12:00:00+00:00
broader: familieplanlægning

prævention
type: Concept
definition: En metode eller en genstand, som bruges for at forhindre graviditet.
in scheme: mediatopic
created: 2019-09-05T12:00:00+00:00
modified: 2021-07-12T12:00:00+00:00
broader: familieplanlægning

voksen
type: Concept
definition: Personer, der har opnået en myndighedsalder på 18 år.
in scheme: mediatopic
created: 2009-10-22T02:00:00+00:00
modified: 2021-02-18T12:00:00+00:00
broader: befolkningsgrupper

barn
type: Concept
definition: Personer i fasen mellem fødsel og voksen alder.
in scheme: mediatopic
created: 2009-10-22T02:00:00+00:00
modified: 2021-02-18T12:00:00+00:00
broader: befolkningsgrupper

handicap
type: Concept
definition: Fysiske eller mentale forhold, der begrænser en persons bevægelser, sanser eller aktiviteter.
in scheme: mediatopic
created: 2009-10-22T02:00:00+00:00
modified: 2024-03-28T12:00:00+00:00
broader: befolkningsgrupper

LGBT+
type: Concept
definition: Mennesker, der identificerer sig som homoseksuelle, biseksuelle eller transseksuelle.
in scheme: mediatopic
created: 2009-10-22T02:00:00+00:00
modified: 2021-05-05T12:00:00+00:00
broader: befolkningsgrupper

køn
type: Concept
definition: Den sociale klassificering af, hvad der betragtes som mand og kvinde.
in scheme: mediatopic
created: 2009-10-22T02:00:00+00:00
modified: 2021-02-18T12:00:00+00:00
broader: befolkningsgrupper
broad match: http://cv.iptc.org/newscodes/subjectcode/14024000

spædbarn
type: Concept
definition: Børn op til omkring et års alder, når de begynder at gå.
in scheme: mediatopic
created: 2009-10-22T02:00:00+00:00
modified: 2021-02-18T12:00:00+00:00
broader: befolkningsgrupper

national eller etnisk minoritet
type: Concept
definition: Grupper af mennesker, der udgør et mindretal på etnisk eller nationalt grundlag, deres status, problemer og forhold til flertallet.
in scheme: mediatopic
created: 2009-10-22T02:00:00+00:00
modified: 2021-02-18T12:00:00+00:00
broader: befolkningsgrupper

offer for nuklear stråling
type: Concept
definition: Inkluderer antinuklear bevægelser og kompensation for ofre for nuklear stråling.
in scheme: mediatopic
created: 2009-10-22T02:00:00+00:00
retired: 2019-10-07T12:00:00+00:00
modified: 2021-02-18T12:00:00+00:00
broader: befolkningsgrupper

ældre
type: Concept
definition: Personer, der har passeret pensionsalderen.
in scheme: mediatopic
created: 2009-10-22T02:00:00+00:00
modified: 2021-02-18T12:00:00+00:00
broader: befolkningsgrupper

teenager
type: Concept
definition: Personer i en alder mellem barndom og voksen alder.
in scheme: mediatopic
created: 2009-10-22T02:00:00+00:00
modified: 2021-02-18T12:00:00+00:00
broader: befolkningsgrupper

oprindeligt folk
type: Concept
definition: Den befolkningsgruppe, der oprindeligt beboede et geografisk område i modsætning til bosættere eller kolonister.
in scheme: mediatopic
created: 2019-11-25T12:00:00+00:00
modified: 2021-07-12T12:00:00+00:00
broader: befolkningsgrupper

http://cv.iptc.org/newscodes/mediatopic/20001327
type: Concept
in scheme: mediatopic
created: 2021-05-05T12:00:00+00:00
modified: 2021-12-21T12:00:00+00:00
broader: befolkningsgrupper

http://cv.iptc.org/newscodes/mediatopic/20001328
type: Concept
in scheme: mediatopic
created: 2021-05-05T12:00:00+00:00
modified: 2021-12-21T12:00:00+00:00
broader: befolkningsgrupper

hjemløshed
type: Concept
definition: Mangel på fast bopæl.
in scheme: mediatopic
created: 2009-10-22T02:00:00+00:00
modified: 2021-02-18T12:00:00+00:00
broader: sociale forhold

fattigdom
type: Concept
definition: Levestandard, der er uacceptabelt lav.
in scheme: mediatopic
created: 2009-10-22T02:00:00+00:00
modified: 2021-02-18T12:00:00+00:00
broader: sociale forhold

stødende eller krænkende opførsel
type: Concept
definition: At behandle en eller flere personer nedsættende ved at angribe dem i ord eller gennem handling.
in scheme: mediatopic
created: 2009-10-22T02:00:00+00:00
modified: 2021-02-18T12:00:00+00:00
broader: socialt problem

afhængighed og misbrug
type: Concept
definition: Den sædvanlige og ofte ukontrollerbare anvendelse af skadelige stoffer som alkohol, tobak og farmaceutiske stoffer eller stoffer.
in scheme: mediatopic
created: 2009-10-22T02:00:00+00:00
modified: 2021-02-18T12:00:00+00:00
broader: socialt problem

ungdomskriminalitet
type: Concept
definition: Hændelser, der involverer mindreårige gerningsmænd.
in scheme: mediatopic
created: 2009-10-22T02:00:00+00:00
modified: 2021-02-18T12:00:00+00:00
broader: socialt problem

prostitution
type: Concept
definition: Dem, der sælger sex og dem, der udnytter dem.
in scheme: mediatopic
created: 2009-10-22T02:00:00+00:00
modified: 2021-02-18T12:00:00+00:00
broader: socialt problem

slaveri
type: Concept
definition: Systemer med personlig ufrihed og lovløshed, herunder ufrivilligt ulønnet arbejde og børnearbejde.
in scheme: mediatopic
created: 2009-10-22T02:00:00+00:00
modified: 2021-02-18T12:00:00+00:00
broader: socialt problem

sexchikane
type: Concept
definition: Uønsket adfærd af seksuel karakter, der er af mindre fornærmelse end seksualforbrydelse, især når adfærd forekommer i en normalt ikke-seksuel situation, eller hvor der er et aspekt af personlig magt eller autoritet involveret.
in scheme: mediatopic
created: 2019-04-06T12:00:00+00:00
modified: 2024-07-01T12:00:00+00:00
broader: socialt problem

mobning
type: Concept
definition: Opførsel, der har til hensigt at skade, nedgøre eller skræmme en anden person, der opfattes som sårbar.
in scheme: mediatopic
created: 2019-11-20T12:00:00+00:00
modified: 2021-07-12T12:00:00+00:00
broader: socialt problem

korrupt praksis
type: Concept
definition: Enhver handling, der er skadelig for andre.
in scheme: mediatopic
created: 2009-10-22T02:00:00+00:00
retired: 2019-10-07T12:00:00+00:00
modified: 2021-02-18T12:00:00+00:00
broader: værdier

død og døende
type: Concept
definition: Sociale spørgsmål vedrørende død og døende.
in scheme: mediatopic
created: 2009-10-22T02:00:00+00:00
modified: 2021-02-18T12:00:00+00:00
broader: værdier
narrower: aktiv dødshjælp
narrower: selvmord

etik
type: Concept
definition: Læren om (god) moral.
in scheme: mediatopic
created: 2009-10-22T02:00:00+00:00
modified: 2021-07-12T12:00:00+00:00
broader: værdier

pornografi
type: Concept
definition: Tekster eller billeder, der beskriver sex på en sådan måde, at enhver, der læser eller ser på billederne, skal være seksuelt ophidset.
in scheme: mediatopic
created: 2009-10-22T02:00:00+00:00
modified: 2021-02-18T12:00:00+00:00
broader: værdier

seksuel adfærd
type: Concept
definition: Individer eller gruppers seksuelle adfærd.
in scheme: mediatopic
created: 2009-10-22T02:00:00+00:00
modified: 2021-02-18T12:00:00+00:00
broader: værdier
broad match: http://cv.iptc.org/newscodes/subjectcode/12006000

aktiv dødshjælp
type: Concept
definition: Bevidst hjælp til en anden persons død i håbløs sygdom.
in scheme: mediatopic
created: 2009-10-22T02:00:00+00:00
modified: 2021-02-18T12:00:00+00:00
broader: død og døende
narrower: assisteret selvmord

selvmord
type: Concept
definition: Forsætlig selvdestruktiv handling, der fører til død.
in scheme: mediatopic
created: 2009-10-22T02:00:00+00:00
modified: 2021-02-18T12:00:00+00:00
broader: død og døende

assisteret selvmord
type: Concept
definition: Forsætlig selvdestruktiv handling, der fører til død, udført med hjælp fra en anden person.
in scheme: mediatopic
created: 2009-10-22T02:00:00+00:00
modified: 2021-02-18T12:00:00+00:00
broader: aktiv dødshjælp
broad match: http://cv.iptc.org/newscodes/subjectcode/14005000

velgørenhed
type: Concept
definition: Uselvisk hjælp til mennesker i nød eller til at hjælpe de mindre heldige.
in scheme: mediatopic
created: 2009-10-22T02:00:00+00:00
modified: 2021-05-05T12:00:00+00:00
broader: socialhjælp

langvarig pleje
type: Concept
definition: Omfattende sundhedsydelser på grund af alvorlig sygdom eller handicap.
in scheme: mediatopic
created: 2009-10-22T02:00:00+00:00
modified: 2021-05-05T12:00:00+00:00
broader: socialhjælp

social ydelse
type: Concept
definition: Understøttede programmer til forbedring af enkeltpersoners eller grupper af individers trivsel.
in scheme: mediatopic
created: 2009-10-22T02:00:00+00:00
modified: 2021-02-18T12:00:00+00:00
broader: socialhjælp

ældrepleje
type: Concept
definition: Pleje af ældre, hvad enten det foregår på plejehjem eller som hjemmehjælp.
in scheme: mediatopic
created: 2019-06-26T12:00:00+00:00
modified: 2021-07-12T12:00:00+00:00
broader: socialhjælp

socialt byggeri
type: Concept
definition: Byggeri der er ejet eller styret af en regering eller non-profit organisation med mål om at udleje til rimelige priser. Berettigelse til dette variere fra land til land.
in scheme: mediatopic
created: 2020-08-05T12:00:00+00:00
modified: 2021-07-12T12:00:00+00:00
broader: socialhjælp

børneinstitution
type: Concept
definition: Vuggestue, dagpleje eller børnehave, hvor børn bliver passet af andre voksne, mens deres forældre er på arbejde.
in scheme: mediatopic
created: 2021-02-18T12:00:00+00:00
modified: 2021-07-12T12:00:00+00:00
broader: socialhjælp

amerikansk fodbold
type: Concept
definition: Kampe mellem to hold af elleve mænd på en 120 yards bane, hvor holdet får point ved at flytte den ovale bold ind i modstanderens målzone.
in scheme: mediatopic
created: 2009-10-22T02:00:00+00:00
modified: 2021-02-18T12:00:00+00:00
broader: sportsgren

bueskydning
type: Concept
definition: Deltagerne bruger pil og bue og prøver at ramme målet fra forskellige afstande.
in scheme: mediatopic
created: 2009-10-22T02:00:00+00:00
modified: 2021-02-18T12:00:00+00:00
broader: sportsgren
narrower: armbrøst
narrower: langbue

atletik
type: Concept
definition: Forskellige konkurrencer, der inkluderer løb, spring og kast.
in scheme: mediatopic
created: 2009-10-22T02:00:00+00:00
modified: 2021-05-05T12:00:00+00:00
broader: sportsgren
narrower: crossløb
narrower: tikamp
narrower: diskoskast
narrower: hammerkast
narrower: syvkamp
narrower: højdespring
narrower: hækkeløb
narrower: spydkast
narrower: langdistanceløb
narrower: længdespring
narrower: mellemdistanceløb
narrower: femkamp
narrower: stangspring
narrower: kapgang
narrower: stafetløb
narrower: kuglestød
narrower: sprintløb
narrower: trespring
narrower: forhindringsløb

australsk fodbold
type: Concept
definition: En boldsport med en oval bold, der kan siges at være en blanding mellem almindelig fodbold og rugby.
in scheme: mediatopic
created: 2009-10-22T02:00:00+00:00
modified: 2021-02-18T12:00:00+00:00
broader: sportsgren

badminton
type: Concept
definition: To spillere eller to hold af to, konkurrerer ved at slå en fjerbold, der vejer cirka fem gram over et højt net. Målet for hver spiller/hold er at forhindre, at fjerbolden lander på deres side af den afgrænsede bane.
in scheme: mediatopic
created: 2009-10-22T02:00:00+00:00
modified: 2021-02-18T12:00:00+00:00
broader: sportsgren

bandy
type: Concept
definition: Spilles på en skøjtebane af omtrent samme størrelse som en fodboldbane. Spillerne har skøjter på og en stav med korte afrundede klinger. Spilles med en lille hård bold. Holdet består af elleve spillere, hvoraf den ene er en målmand.
in scheme: mediatopic
created: 2009-10-22T02:00:00+00:00
modified: 2021-02-18T12:00:00+00:00
broader: sportsgren

baseball
type: Concept
definition: Kamp mellem Nimands hold, hvor det hold, der samler flest point vinder. Point opnås ved at løbe rundt på banen, der er markeret med fire afrundingsmærker. Spilleren skal først ramme en bold, der er kastet af en spiller i modstanderholdet.
in scheme: mediatopic
created: 2009-10-22T02:00:00+00:00
modified: 2021-02-18T12:00:00+00:00
broader: sportsgren
narrower: rubberball baseball (nanshiki)

basketball
type: Concept
definition: Basketball spilles mellem to hold af fem. Point scores ved at placere den store bold i et net, der er fastgjort på en ring 3,05 m over jorden.
in scheme: mediatopic
created: 2009-10-22T02:00:00+00:00
modified: 2021-02-18T12:00:00+00:00
broader: sportsgren

skiskydning
type: Concept
definition: En kombination af langrend og skydning. Antallet af skud og regler for missede skud i skydning varierer mellem de forskellige konkurrencetyper. Kaldes også biatlon.
in scheme: mediatopic
created: 2009-10-22T02:00:00+00:00
modified: 2021-05-05T12:00:00+00:00
broader: sportsgren

billard
type: Concept
definition: Deltagerne bruger en kø til at støde kugler på et specielt bord og bringe kuglerne i huller i hjørnerne og på langsiderne.
in scheme: mediatopic
created: 2009-10-22T02:00:00+00:00
modified: 2021-02-18T12:00:00+00:00
broader: sportsgren
broad match: http://cv.iptc.org/newscodes/subjectcode/15010000
has facet: billiardtype

bobslæde
type: Concept
definition: To eller fire konkurrenter sidder i en specielt designet slæde og kører ned ad en kunstig isbane.
in scheme: mediatopic
created: 2009-10-22T02:00:00+00:00
modified: 2022-02-03T12:00:00+00:00
broader: sportsgren

bowls og petanque
type: Concept
definition: Et spil, hvor spillere kaster kugler mod et mål og hvor vinderen er den spiller, der lander tættest.
in scheme: mediatopic
created: 2009-10-22T02:00:00+00:00
modified: 2021-05-05T12:00:00+00:00
broader: sportsgren

boksning
type: Concept
definition: To deltagere med handsker på hænderne forsøger at ramme hinanden med næverne.
in scheme: mediatopic
created: 2009-10-22T02:00:00+00:00
modified: 2021-02-18T12:00:00+00:00
broader: sportsgren
narrower: bantamvægt
narrower: cruiservægt
narrower: fjervægt
narrower: fluevægt
narrower: sværvægt
narrower: letfluevægt
narrower: letsværvægt
narrower: letmellemvægt
narrower: letweltervægt
narrower: letvægt
narrower: mellemvægt
narrower: stråvægt
narrower: superbantamvægt
narrower: superfjervægt
narrower: superfluevægt
narrower: supersværvægt
narrower: supermellemvægt
narrower: weltervægt
has facet: weightclasstype

tyrefægtning
type: Concept
definition: Konkurrence, hvor folk udfordrer tyre på en arena.
in scheme: mediatopic
created: 2009-10-22T02:00:00+00:00
modified: 2021-02-18T12:00:00+00:00
broader: sportsgren

canadisk fodbold
type: Concept
definition: En sport, der minder om amerikansk fodbold, men har forskellige dimensioner og regler og et andet antal spillere.
in scheme: mediatopic
created: 2009-10-22T02:00:00+00:00
modified: 2021-02-18T12:00:00+00:00
broader: sportsgren

kano
type: Concept
definition: Konkurrence i kanoer, hvor konkurrenterne normalt sidder på knæene og padler med en ensidet padle.
in scheme: mediatopic
created: 2009-10-22T02:00:00+00:00
modified: 2021-02-18T12:00:00+00:00
broader: sportsgren
narrower: C1 (kano)
narrower: C2 (kano)
narrower: C4 (kano)
narrower: kanosejlads
narrower: pontoniering
has facet: canoekayaktype
broad match: http://cv.iptc.org/newscodes/subjectcode/15015000

fiskekonkurrence
type: Concept
definition: Alle former for konkurrencer, som omhandler lystfiskeri.
in scheme: mediatopic
created: 2009-10-22T02:00:00+00:00
modified: 2021-07-12T12:00:00+00:00
broader: sportsgren

bjergklatring
type: Concept
definition: Bevæge sig op ad bjerge ved hjælp af hænder og fødder, samt diverse hjælpemidler til klatringen.
in scheme: mediatopic
created: 2009-10-22T02:00:00+00:00
modified: 2021-02-18T12:00:00+00:00
broader: sportsgren
narrower: isklatring
narrower: bjergbestigning

sportsklatring
type: Concept
definition: Konkurrencer i klatring i kunstige miljøer med forskellige vanskeligheder.
in scheme: mediatopic
created: 2009-10-22T02:00:00+00:00
modified: 2021-07-12T12:00:00+00:00
broader: sportsgren

cricket
type: Concept
definition: En boldsport, der spilles på græs med bold og boldtræ.
in scheme: mediatopic
created: 2009-10-22T02:00:00+00:00
modified: 2021-02-18T12:00:00+00:00
broader: sportsgren

kroket
type: Concept
definition: Spilles på en græsplæne med buer, som spillerne skal slå deres bolde igennem og være de første til at komme igennem banen.
in scheme: mediatopic
created: 2009-10-22T02:00:00+00:00
modified: 2021-02-18T12:00:00+00:00
broader: sportsgren

curling
type: Concept
definition: Spilles mellem to hold på is med hver deres runde sten med håndtag på toppen. Det gælder om at placere stenene så tæt på centrum som muligt.
in scheme: mediatopic
created: 2009-10-22T02:00:00+00:00
modified: 2021-02-18T12:00:00+00:00
broader: sportsgren
narrower: isstok

cykelsport
type: Concept
definition: Konkurrenter cykler en bestemt afstand så hurtigt som muligt, individuelt eller i hold.
in scheme: mediatopic
created: 2009-10-22T02:00:00+00:00
modified: 2021-02-18T12:00:00+00:00
broader: sportsgren
narrower: cykelakrobatik
narrower: cykel forhindringsløb
narrower: bmx
narrower: cykelbold
narrower: cykelsprint
narrower: cykelcross
narrower: individuelt forfølgelsesløb
narrower: tidskørsel
narrower: keirin
narrower: parløb
narrower: mountainbike
narrower: pointløb
narrower: landevejscykling
narrower: etapeløb
narrower: holdsprint
narrower: holdforfølgelsesløb
narrower: holdtidskørsel
narrower: banecykling
narrower: http://cv.iptc.org/newscodes/mediatopic/20001332
has facet: cyclingtype

sportsdans
type: Concept
definition: Dansende par udfører forskellige typer dansestilarter og bedømmes af dommere.
in scheme: mediatopic
created: 2009-10-22T02:00:00+00:00
modified: 2024-05-10T12:00:00+00:00
broader: sportsgren
narrower: http://cv.iptc.org/newscodes/mediatopic/20001379

dart
type: Concept
definition: Individuel konkurrence eller holdkonkurrence, hvor deltagerne kaster pile på et pilebræt med et specielt mønster.
in scheme: mediatopic
created: 2009-10-22T02:00:00+00:00
modified: 2021-02-18T12:00:00+00:00
broader: sportsgren

udspring
type: Concept
definition: Dykkere springer fra en fast platform eller vippe og vurderes af syv dommere, der giver karakterer op til ti for deres akrobatiske træk.
in scheme: mediatopic
created: 2009-10-22T02:00:00+00:00
modified: 2021-02-18T12:00:00+00:00
broader: sportsgren
narrower: udspring fra platform
narrower: udspring fra vippe
narrower: synkronudspring

sportsdykning
type: Concept
definition: Forskellige sportsgrene udført under vand.
in scheme: mediatopic
created: 2009-10-22T02:00:00+00:00
modified: 2021-02-18T12:00:00+00:00
broader: sportsgren

hundeløb
type: Concept
definition: Samlingskoncept til konkurrencer, hvor hunde løber rundt på en bane.
in scheme: mediatopic
created: 2009-10-22T02:00:00+00:00
modified: 2021-02-18T12:00:00+00:00
broader: sportsgren
narrower: hundevæddeløb
narrower: hundeslædeløb
has facet: dogracingtype

duathlon
type: Concept
definition: Konkurrencegren, som indeholder løb og cykling.
in scheme: mediatopic
created: 2009-10-22T02:00:00+00:00
modified: 2021-02-18T12:00:00+00:00
broader: sportsgren

ridesport
type: Concept
definition: Samlingskoncept til konkurrencer med hest og rytter.
in scheme: mediatopic
created: 2009-10-22T02:00:00+00:00
modified: 2021-07-12T12:00:00+00:00
broader: sportsgren
narrower: terrænridning
narrower: dressur
narrower: ridebanespringning
narrower: military
narrower: hestevognskørsel
has facet: equestriantype

fægtning
type: Concept
definition: Kamp mellem to konkurrenter, der er udstyret med sabel, fleuret eller kårde. Træf på modstanderen registreres elektrisk.
in scheme: mediatopic
created: 2009-10-22T02:00:00+00:00
modified: 2021-02-18T12:00:00+00:00
broader: sportsgren
narrower: kårde
narrower: fleuret
narrower: sabel
has facet: fencingtype

hockey
type: Concept
definition: Holdsport mellem to ellevemandshold. Spilles på græs med bold og bøjede klubber.
in scheme: mediatopic
created: 2009-10-22T02:00:00+00:00
modified: 2021-02-18T12:00:00+00:00
broader: sportsgren

kunstskøjteløb
type: Concept
definition: Konkurrencer individuelt eller i par, hvor deltagerne udfører kunst på is med skøjter på fødderne. Programmet udføres til musik og bedømmes af dommere.
in scheme: mediatopic
created: 2009-10-22T02:00:00+00:00
modified: 2021-02-18T12:00:00+00:00
broader: sportsgren
narrower: isdans
has facet: figureskatingtype

fistball
type: Concept
definition: Holdsport svarende til volleyball (med et meget lavere net) udført hovedsageligt i gymnastikklubber.
in scheme: mediatopic
created: 2009-10-22T02:00:00+00:00
modified: 2021-02-18T12:00:00+00:00
broader: sportsgren

floorball
type: Concept
definition: Floorball er en holdsport i hockeyfamilien med 5 markspillere og en målmand på hvert hold. Man spiller med stave og plastikbold med huller på en indendørsbane med 50 cm høje bander.
in scheme: mediatopic
created: 2009-10-22T02:00:00+00:00
modified: 2021-02-18T12:00:00+00:00
broader: sportsgren

frisbee
type: Concept
definition: Et gruppe begivenheder, hvor spillet spilles med en frisbee, som kastes med hånden.
in scheme: mediatopic
created: 2009-10-22T02:00:00+00:00
modified: 2021-02-18T12:00:00+00:00
broader: sportsgren
has facet: flyingdisctype

gælisk fodbold
type: Concept
definition: Boldsport med 15-mand hold. Mindre og hårdere bold end i fodbold. Bolden kan afleveres både med fod og hånd. Stor sport i Irland.
in scheme: mediatopic
created: 2009-10-22T02:00:00+00:00
modified: 2021-02-18T12:00:00+00:00
broader: sportsgren
broad match: http://cv.iptc.org/newscodes/subjectcode/15000000

golf
type: Concept
definition: Spillerne rammer en lille hård bold med forskellige køller rundt om en bane med normalt 18 huller af forskellig længde og vanskelighed. Minimum antal slag vinder. Banerne kan have forhindringer i form af græs, vand og sand.
in scheme: mediatopic
created: 2009-10-22T02:00:00+00:00
modified: 2021-02-18T12:00:00+00:00
broader: sportsgren
narrower: minigolf

gymnastik
type: Concept
definition: Deltagerne udfører forskellige bevægelser på forskellige redskaber og bedømmes af dommere.
in scheme: mediatopic
created: 2009-10-22T02:00:00+00:00
modified: 2021-02-18T12:00:00+00:00
broader: sportsgren
narrower: rytmisk gymnastik
narrower: trampolin
narrower: redskabsgymnastik

håndbold
type: Concept
definition: Et boldspil ved brug af hænderne mellem to hold på syv spillere, der prøver at kaste bolden i modstanderens mål.
in scheme: mediatopic
created: 2009-10-22T02:00:00+00:00
modified: 2021-02-18T12:00:00+00:00
broader: sportsgren

hornuss
type: Concept
definition: Schweizisk holdsport, hvor en puck bliver slået i høj hastighed. Minder lidt om baseball.
in scheme: mediatopic
created: 2009-10-22T02:00:00+00:00
modified: 2021-02-18T12:00:00+00:00
broader: sportsgren

hestevæddeløb
type: Concept
definition: Hestevæddeløb er en sport, hvor to eller flere ryttere eller kuske rider eller fører en hest over en given distance for at komme først i mål.
in scheme: mediatopic
created: 2009-10-22T02:00:00+00:00
modified: 2021-02-18T12:00:00+00:00
broader: sportsgren
narrower: galopløb
narrower: travløb
narrower: hesteforhindringsløb

hurling
type: Concept
definition: Irsk holdsport med 15-mands hold efter en plan, der har de samme dimensioner som gælisk fodbold. Spillerne har en trækølle og prøver at slå en lille hård bold i mål. Man må også aflevere bolden med hånden eller fødderne.
in scheme: mediatopic
created: 2009-10-22T02:00:00+00:00
modified: 2021-02-18T12:00:00+00:00
broader: sportsgren
broad match: http://cv.iptc.org/newscodes/subjectcode/15000000

ishockey
type: Concept
definition: To hold på seks polstrede ishockeyspillere med stave, som forsøger at score mod hinanden ved at slå en puck ind i modstanderens mål.
in scheme: mediatopic
created: 2009-10-22T02:00:00+00:00
modified: 2021-02-18T12:00:00+00:00
broader: sportsgren
narrower: slædehockey

rulleskøjteløb
type: Concept
definition: Konkurrencesport på rulleskøjter.
in scheme: mediatopic
created: 2009-10-22T02:00:00+00:00
retired: 2021-02-18T12:00:00+00:00
modified: 2021-02-18T12:00:00+00:00
broader: sportsgren

jai alai (pelota)
type: Concept
definition: Hurtig boldsport mod en væg, hvor spillerne enten bruger deres hænder eller en specielt designet handske.
in scheme: mediatopic
created: 2009-10-22T02:00:00+00:00
modified: 2021-02-18T12:00:00+00:00
broader: sportsgren
has facet: jaialaitype

kabaddi
type: Concept
definition: To hold stiller sig op over for hinanden, hvorefter en spiller fra det ene hold skal løbe frem og berøre eller tackle en modstander. Den berørte modstander har nu 30 sekunder til at stoppe den første spiller, før han når tilbage bag en linje på egen banehalvdel.
in scheme: mediatopic
created: 2009-10-22T02:00:00+00:00
modified: 2021-02-18T12:00:00+00:00
broader: sportsgren

kajak
type: Concept
definition: Sejlads i kajak, hvor deltageren sidder med ben og fødder fremad og bruger en padle med blade i begge ender.
in scheme: mediatopic
created: 2009-10-22T02:00:00+00:00
modified: 2021-02-18T12:00:00+00:00
broader: sportsgren
narrower: K1 (kajak)
narrower: K2 (kajak)
narrower: K4 (kajak)
broad match: http://cv.iptc.org/newscodes/subjectcode/15015000
has facet: canoekayaktype

lacrosse
type: Concept
definition: Lacrosse er en holdsport af indiansk oprindelse. Stor sport i USA og Canada. Spillerne har en stav med et trekantet net foran. Der kan bolden fanges. Du kan ramme modstanderens stav og hånd og også tackles.
in scheme: mediatopic
created: 2009-10-22T02:00:00+00:00
modified: 2021-02-18T12:00:00+00:00
broader: sportsgren

kælk
type: Concept
definition: Konkurrenten ligger sig på ryggen med fødderne først på en lille kælk, på en bane, som kan være naturlig, men oftest er opbygget.
in scheme: mediatopic
created: 2009-10-22T02:00:00+00:00
modified: 2021-02-18T12:00:00+00:00
broader: sportsgren

maratonløb
type: Concept
definition: Et langdistanceløb, hvor konkurrenterne løber 42,195 km.
in scheme: mediatopic
created: 2009-10-22T02:00:00+00:00
modified: 2021-02-18T12:00:00+00:00
broader: sportsgren

moderne femkamp
type: Concept
definition: Moderne femkamp blev introduceret ved OL i Stockholm i 1912 som en moderne version af antik femkamp. I moderne pentathlon konkurrerer du i skydning, fægtning, svømning, ridning og løb.
in scheme: mediatopic
created: 2009-10-22T02:00:00+00:00
modified: 2021-02-18T12:00:00+00:00
broader: sportsgren

motorbådssport
type: Concept
definition: Fællesbetegnelse til løb med motorbåde på vandet.
in scheme: mediatopic
created: 2009-10-22T02:00:00+00:00
modified: 2021-02-18T12:00:00+00:00
broader: sportsgren
broad match: http://cv.iptc.org/newscodes/subjectcode/15046000

motorløb
type: Concept
definition: Fællesbetegnelse for konkurrencer med forskellige typer af biler.
in scheme: mediatopic
created: 2009-10-22T02:00:00+00:00
modified: 2021-02-18T12:00:00+00:00
broader: sportsgren
narrower: langdistanceløb
narrower: F3000
narrower: formel 1
narrower: indyracing
narrower: rallycross
narrower: rally
has facet: motorcarracingtype

motorcykelsport
type: Concept
definition: Fællesbetegnelse til konkurrencer med motorkøretøjer. Normalt tohjulede, men der er også trehjulede og firehjulede varianter.
in scheme: mediatopic
created: 2009-10-22T02:00:00+00:00
modified: 2021-02-18T12:00:00+00:00
broader: sportsgren
narrower: motorcykel langdistanceløb
narrower: enduro
narrower: græsbane
narrower: motorbold
narrower: motorcross
narrower: motorcykel grand prix
narrower: motorcykel rally
narrower: sidevognscross
narrower: speedway
narrower: motorcykel terrænløb
has facet: motorcyclingtype

netbold
type: Concept
definition: Meget som basketball, men kurven har ingen plade bag på, men sidder på en stolpe. Hovedsageligt spillet af kvinder.
in scheme: mediatopic
created: 2009-10-22T02:00:00+00:00
modified: 2021-02-18T12:00:00+00:00
broader: sportsgren

orienteringsløb
type: Concept
definition: Udstyret med et kort og kompas skal deltagerne lede efter et antal poster.
in scheme: mediatopic
created: 2009-10-22T02:00:00+00:00
modified: 2021-02-18T12:00:00+00:00
broader: sportsgren
narrower: skiorientering

faldskærmsudspring
type: Concept
definition: Faldskærmsudspringeren hopper ud af et fly med faldskærm og laver kunst i luften eller præcisionslandinger. Individuelt eller i hold.
in scheme: mediatopic
created: 2009-10-22T02:00:00+00:00
modified: 2021-02-18T12:00:00+00:00
broader: sportsgren

polo
type: Concept
definition: Ved hjælp af en kølle forsøger to hold på fire ryttere at banke en bambusbold ind i modstanderens mål over en bane, der er 250 meter lang og 150 meter bred. Spillet er opdelt i 4, 6 eller 8 tidsperioder på 7 min. 30 sek. kaldet chukkas.
in scheme: mediatopic
created: 2009-10-22T02:00:00+00:00
modified: 2021-02-18T12:00:00+00:00
broader: sportsgren

pool
type: Concept
definition: En sport på et bord med huller, hvor der anvendes en kø, og hvor der spilles med forskellige antal nummererede kugler.
in scheme: mediatopic
created: 2009-10-22T02:00:00+00:00
modified: 2021-02-18T12:00:00+00:00
broader: sportsgren
broad match: http://cv.iptc.org/newscodes/subjectcode/15010000
has facet: billiardtype

powerboating
type: Concept
definition: Speedbådløb mellem motorbåde på floder eller søer.
in scheme: mediatopic
created: 2009-10-22T02:00:00+00:00
modified: 2021-02-18T12:00:00+00:00
broader: sportsgren

rodeo
type: Concept
definition: En sport, hvor deltagerne skal håndtere vilde heste, tyre, kalve eller geder.
in scheme: mediatopic
created: 2009-10-22T02:00:00+00:00
modified: 2021-02-18T12:00:00+00:00
broader: sportsgren
narrower: bareback bronc
narrower: barrel racing
narrower: bull riding
narrower: bulldogging
narrower: calf roping
narrower: goat roping
narrower: saddle bronc

roning
type: Concept
definition: Konkurrence på markeret bane i naturlige farvande, hvor hver konkurrent har to årer. Roning er tilgængelig hver for sig eller i større både, for eksempel to, fire eller otte personer. Forskellige løb har forskellige længder.
in scheme: mediatopic
created: 2009-10-22T02:00:00+00:00
modified: 2021-02-18T12:00:00+00:00
broader: sportsgren
narrower: firer med styrmand
narrower: toer med styrmand
narrower: firer uden styrmand
narrower: toer uden styrmand
narrower: dobbeltsculler
narrower: otter med styrmand
narrower: dobbeltfirer
narrower: singlesculler
has facet: rowingtype

sejlsport
type: Concept
definition: Fællesbetegnelse for konkurrencer med både omkring en markeret bane, hvor bådene drives af vinden ved hjælp af sejl. Mange forskellige bådtyper og banelængder.
in scheme: mediatopic
created: 2009-10-22T02:00:00+00:00
modified: 2021-02-18T12:00:00+00:00
broader: sportsgren
narrower: multihull
narrower: jolle
narrower: kølbåd
narrower: regattasejlads
narrower: oceansejllads
narrower: verdensomsejling
narrower: solo oceansejlads
narrower: non-stop solo løb
has facet: sailingtype

sepak takraw
type: Concept
definition: En sydøstasiatiske holdsport svarende til volleyball, hvor man bruger fødderne, knæene, brystet eller hovedet til at røre bolden.
in scheme: mediatopic
created: 2009-10-22T02:00:00+00:00
modified: 2021-02-18T12:00:00+00:00
broader: sportsgren

shinty
type: Concept
definition: En keltisk boldsport, der udføres mellem to hold med specielle køller, og hvor mål scores ved at skubbe en lille læderkugle mellem målstolperne.
in scheme: mediatopic
created: 2009-10-22T02:00:00+00:00
modified: 2021-02-18T12:00:00+00:00
broader: sportsgren
broad match: http://cv.iptc.org/newscodes/subjectcode/15000000

skydning
type: Concept
definition: Præcisionsport ved hjælp af en håndpistol, rifle eller haglgevær.
in scheme: mediatopic
created: 2009-10-22T02:00:00+00:00
modified: 2023-10-02T12:00:00+00:00
broader: sportsgren
narrower: pistolskydning
narrower: riffelskydning
narrower: skydning efter bevægeligt mål
narrower: skeetskydning
narrower: flugtskydning
has facet: shootingtype

skeleton
type: Concept
definition: Ligner slæde, men konkurrenten ligger på maven og går med hovedet først.
in scheme: mediatopic
created: 2009-10-22T02:00:00+00:00
modified: 2021-02-18T12:00:00+00:00
broader: sportsgren

skiløb
type: Concept
definition: Fællesbetegnelse for alle typer konkurrencer, hvor konkurrenterne har ski på.
in scheme: mediatopic
created: 2009-10-22T02:00:00+00:00
modified: 2021-02-18T12:00:00+00:00
broader: sportsgren
narrower: alpint skiløb
narrower: freestyle skiløb
narrower: skiløb på græs
narrower: nordisk disciplin
narrower: skihop
narrower: langrend
narrower: nordisk kombineret
narrower: Telemark skiløb
narrower: http://cv.iptc.org/newscodes/mediatopic/20001390
broad match: http://cv.iptc.org/newscodes/subjectcode/15000000

faldskærmsudspring (frit fald)
type: Concept
definition: En individuel konkurrencegren i faldskærmsudspring, hvor springeren falder med hovedet mod jorden i frit fald og falder så hurtigt som muligt.
in scheme: mediatopic
created: 2009-10-22T02:00:00+00:00
modified: 2021-02-18T12:00:00+00:00
broader: sportsgren

snooker
type: Concept
definition: En variant af billard med baller på et bord, der skal pottes i en bestemt rækkefølge.
in scheme: mediatopic
created: 2009-10-22T02:00:00+00:00
modified: 2021-02-18T12:00:00+00:00
broader: sportsgren
has facet: billiardtype

snowboarding
type: Concept
definition: Fællesbetegnelse af konkurrencer udført af rytteren med begge fødder på det samme bræt. I modsætning til skiløb, hvor du har fødderne på hver ski.
in scheme: mediatopic
created: 2009-10-22T02:00:00+00:00
modified: 2021-02-18T12:00:00+00:00
broader: sportsgren
has facet: snowboardingtype

fodbold
type: Concept
definition: Holdsport, hvor to hold af elleve spillere, forsøger at få en bold ind i modstanderens mål. Hvert hold har en målmand og ti udenfor spillere.
in scheme: mediatopic
created: 2009-10-22T02:00:00+00:00
modified: 2024-09-26T12:00:00+00:00
broader: sportsgren
narrower: http://cv.iptc.org/newscodes/mediatopic/20001393
narrower: http://cv.iptc.org/newscodes/mediatopic/20001394

softball
type: Concept
definition: Ligner baseball, men spilles med en større og blødere bold, et tyndere bat, kortere mellemrum mellem baserne og mindrere omgange.
in scheme: mediatopic
created: 2009-10-22T02:00:00+00:00
modified: 2021-02-18T12:00:00+00:00
broader: sportsgren

hurtigløb på skøjter
type: Concept
definition: Tidskørsel, hvor to skøjteløbere med specielle langdistance skøjter, løber på en oval isbane og skifter mellem inderbane og yderbane.
in scheme: mediatopic
created: 2009-10-22T02:00:00+00:00
modified: 2021-03-31T12:00:00+00:00
broader: sportsgren

squash
type: Concept
definition: Ketjersport med en lille gummikugle, hvor man konkurrerer i et rum med vægge.
in scheme: mediatopic
created: 2009-10-22T02:00:00+00:00
modified: 2021-02-18T12:00:00+00:00
broader: sportsgren

sumobrydning
type: Concept
definition: En japansk kampsport, hvor tunge og stærke udøvere kæmper stående for enten at få modstanderen ud af ringen eller få ham til at røre jorden med enhver anden kropsdel end fodsålerne.
in scheme: mediatopic
created: 2009-10-22T02:00:00+00:00
modified: 2021-02-18T12:00:00+00:00
broader: sportsgren

surfing
type: Concept
definition: Vandsport, hvor deltagere forsøger at *fange* og *ride* på bølger stående på et bræt af glasfiber.
in scheme: mediatopic
created: 2009-10-22T02:00:00+00:00
modified: 2021-02-18T12:00:00+00:00
broader: sportsgren

svømning
type: Concept
definition: En vandsport, hvor deltagere svømmer så hurtigt som muligt i en given stil og på en bestemt distance og vinderen er den som er hurtigst.
in scheme: mediatopic
created: 2009-10-22T02:00:00+00:00
modified: 2021-02-18T12:00:00+00:00
broader: sportsgren
narrower: rygcrawl
narrower: brystsvømning
narrower: butterfly
narrower: freestyle (fri stil)
narrower: medley
narrower: åbent vand
narrower: freestyle stafet
narrower: medley stafet
narrower: kortbane
has facet: swimmingtype

bordtennis
type: Concept
definition: En ketsjersport for to eller fire (i dobbelt), der konkurrerer ved et bord delt med et net i midten. Spillerne bruger et lille bat til at spille med og en lille let plastikbold.
in scheme: mediatopic
created: 2009-10-22T02:00:00+00:00
modified: 2021-03-15T12:00:00+00:00
broader: sportsgren

tennis
type: Concept
definition: Deltagerne slår en lille bold med en ketsjer og skal ramme modstanderens halvdel. Et net adskiller banehalvdelene. Forskellige underlag i forskellige konkurrencer. Spillet spilles individuelt eller i par og i flere sæt, der består af flere partier.
in scheme: mediatopic
created: 2009-10-22T02:00:00+00:00
modified: 2021-02-18T12:00:00+00:00
broader: sportsgren

bowling
type: Concept
definition: Et spil, hvor en spiller scorer point ved at forsøge at vælte ti kegler ned ved hjælp af en bowlingkugle - hvis det ikke lykkes, har spilleren et andet forsøg. Et spil består af ti runder.
in scheme: mediatopic
created: 2009-10-22T02:00:00+00:00
modified: 2021-02-18T12:00:00+00:00
broader: sportsgren

triatlon
type: Concept
definition: En udholdenheds multisport, hvor konkurrenterne først svømmer, cykler og derefter løber. Afstande varierer afhængigt af konkurrencen.
in scheme: mediatopic
created: 2009-10-22T02:00:00+00:00
modified: 2021-02-18T12:00:00+00:00
broader: sportsgren

tovtrækning
type: Concept
definition: To hold trækker i et reb. Holdet, der formår at trække modstanderne til deres side, har vundet.
in scheme: mediatopic
created: 2009-10-22T02:00:00+00:00
modified: 2021-02-18T12:00:00+00:00
broader: sportsgren

volleyball
type: Concept
definition: Holdsport, hvor seksmandshold forsvarer deres side og forsøger at slå bolden over nettet til modstandernes side. Holdet får point, hvis modstanderne ikke klarer at ramme bolden med højst tre hits, slår bolden i nettet eller slår bolden ud fra banen. Spilles i sæt.
in scheme: mediatopic
created: 2009-10-22T02:00:00+00:00
modified: 2021-02-18T12:00:00+00:00
broader: sportsgren
narrower: beachvolley

vandpolo
type: Concept
definition: Holdsport som spilles i et vandbassin mellem to holds af syv personer. Spillere får lov til at svømme og skubbe bolden fremad, eller aflevere til en medspiller med den ene hånd. Målet er at få bolden ind i modstanderens mål.
in scheme: mediatopic
created: 2009-10-22T02:00:00+00:00
modified: 2021-02-18T12:00:00+00:00
broader: sportsgren

vandski
type: Concept
definition: På en eller to ski bliver deltagere trukket af en motorbåd langs vandoverfladen.
in scheme: mediatopic
created: 2009-10-22T02:00:00+00:00
modified: 2021-02-18T12:00:00+00:00
broader: sportsgren
has facet: waterskiingtype

vægtløftning
type: Concept
definition: En styrketest, hvor konkurrenter løfter en så tung vægtstang som muligt.
in scheme: mediatopic
created: 2009-10-22T02:00:00+00:00
modified: 2021-07-12T12:00:00+00:00
broader: sportsgren
narrower: stød
narrower: styrkeløft
narrower: træk
has facet: weightliftingtype

vindsurfing
type: Concept
definition: Ligner sejlads, men i stedet for at sidde i en båd konkurrerer de stående på et windsurfingbræt og håndterer sejlet med deres hænder.
in scheme: mediatopic
created: 2009-10-22T02:00:00+00:00
modified: 2021-02-18T12:00:00+00:00
broader: sportsgren
has facet: windsurfingtype

brydning
type: Concept
definition: Kampsport, hvor konkurrenterne ved hjælp af forskellige greb skal få modstanderens skuldre ned i måtten. Hvis en kamp ikke ender med skuldrerne nede afgøres kampen af dommerne. Du konkurrerer i græsk-romersk stil og freestyle.
in scheme: mediatopic
created: 2009-10-22T02:00:00+00:00
modified: 2021-02-18T12:00:00+00:00
broader: sportsgren
narrower: fristilsbrydning
narrower: græsk-romersk brydning
narrower: schweizisk brydning
has facet: weightclasstype

shorttrack
type: Concept
definition: Skøjteløb på en oval bane. Normalt fire deltagere pr. løb.
in scheme: mediatopic
created: 2014-01-20T12:00:00+00:00
modified: 2021-02-18T12:00:00+00:00
broader: sportsgren

skak
type: Concept
definition: Brætspil mellem to spillere, der har 16 brikker hver, når spillet starter. Skiftevis laver hver modstander et træk og bevæger sig efter forskellige mønstre. Den, der sætter modstanderens konge mat, så den ikke kan flytte sig, vinder.
in scheme: mediatopic
created: 2014-11-07T12:00:00+00:00
modified: 2021-07-12T12:00:00+00:00
broader: sportsgren

rullesport
type: Concept
definition: Forskellige typer konkurrencer, hvor konkurrenterne har rulleskøjter på fødderne.
in scheme: mediatopic
created: 2014-11-07T12:00:00+00:00
modified: 2021-07-12T12:00:00+00:00
broader: sportsgren
narrower: rulleskøjtehockey
narrower: skateboarding

kampsport
type: Concept
definition: Kampsport praktiseres af forskellige årsager: selvforsvar, konkurrence, fysisk sundhed og fitness, underholdning, såvel som mental, fysisk og åndelig udvikling.
in scheme: mediatopic
created: 2015-08-27T12:00:00+00:00
modified: 2021-07-12T12:00:00+00:00
broader: sportsgren
narrower: judo
narrower: jukendo
narrower: karate
narrower: kendo
narrower: kyudo
narrower: naginata
narrower: taekwondo
narrower: wushu
narrower: mixed martial arts (MMA)
narrower: krav maga
narrower: kickboksning
narrower: sambo

synkronsvømning
type: Concept
definition: En sport, hvor svømmere i solo-, duet- eller holdkonfigurationer udfører koordinerede eller identiske bevægelser i tid til musik. De bedømmes og tildeles point for kropsposition, kontrol og bevægelsens sværhedsgrad.
in scheme: mediatopic
created: 2016-04-05T12:00:00+00:00
modified: 2021-07-12T12:00:00+00:00
broader: sportsgren
narrower: synkronsvømning fri rutine
narrower: synkronsvømning teknisk rutine

rugby
type: Concept
definition: En form for fodbold udviklet i Rugby (England) spillet med en oval bold, der kan sparkes, bæres og sendes fra hånd til hånd. Der scores point, når det ene hold bærer bolden over det andet holds mållinje eller sparker bolden mellem to målposter.
in scheme: mediatopic
created: 2016-04-05T12:00:00+00:00
modified: 2021-07-12T12:00:00+00:00
broader: sportsgren
narrower: rugby league (13-mands rugby)
narrower: rugby union (15-mands rugby)
narrower: rugby sevens (7-mands rugby)

E-sport
type: Concept
definition: Konkurrencer, der involverer computer- eller videospil, der spilles af professionelle spillere.
in scheme: mediatopic
created: 2018-04-19T12:00:00+00:00
modified: 2021-07-12T12:00:00+00:00
broader: sportsgren

bodybuilding
type: Concept
definition: Konkurrence, hvor deltagerne poserer for at vise deres muskler frem og bliver vurderet af et dommerpanel.
in scheme: mediatopic
created: 2019-06-26T12:00:00+00:00
modified: 2021-07-12T12:00:00+00:00
broader: sportsgren

racketball
type: Concept
definition: En ketsjersport, der minder om squash,men spilles med en ketsjer med kortere skaft. Den spilles også på en lukket bane, hvor man må benytte alle flader, når man sender bolden afsted.
in scheme: mediatopic
created: 2019-10-07T12:00:00+00:00
modified: 2021-07-12T12:00:00+00:00
broader: sportsgren

ringette
type: Concept
definition: En holdsport, der spilles på is. Spillerne er udstyret med helt lige stave og skal forsøge at få en gummring i modstandernes mål.
in scheme: mediatopic
created: 2019-10-07T12:00:00+00:00
modified: 2021-07-12T12:00:00+00:00
broader: sportsgren

armlægning
type: Concept
definition: En sport, hvor det gælder om at lægge den andens arm ned.
in scheme: mediatopic
created: 2019-11-25T12:00:00+00:00
modified: 2021-07-12T12:00:00+00:00
broader: sportsgren

padel
type: Concept
definition: En ketsjersport, der spilles på en lukket bane, og som er en mellemting mellem tennis og squash.
in scheme: mediatopic
created: 2021-02-18T12:00:00+00:00
modified: 2021-07-12T12:00:00+00:00
broader: sportsgren

kiting
type: Concept
definition: Sport, hvor man iført en faldskærm bruger vinden til at bevæge sig fremad med. Kitesurfing ved kysterne er den mest populære form.
in scheme: mediatopic
created: 2021-02-18T12:00:00+00:00
modified: 2021-07-12T12:00:00+00:00
broader: sportsgren

stand up paddleboarding (SUP)
type: Concept
definition: Vandsport, hvor man bruger et bræt og en padel til at bevæge sig fremad med.
in scheme: mediatopic
created: 2021-02-18T12:00:00+00:00
modified: 2021-07-12T12:00:00+00:00
broader: sportsgren

cheerleading
type: Concept
definition: Idræt, hvor heppekor konkurrerer om at udføre de mest spektakulære øvelser.
in scheme: mediatopic
created: 2021-02-18T12:00:00+00:00
modified: 2021-07-12T12:00:00+00:00
broader: sportsgren

http://cv.iptc.org/newscodes/mediatopic/20001329
type: Concept
in scheme: mediatopic
created: 2021-07-12T12:00:00+00:00
modified: 2021-12-21T12:00:00+00:00
broader: sportsgren

http://cv.iptc.org/newscodes/mediatopic/20001330
type: Concept
in scheme: mediatopic
created: 2021-07-12T12:00:00+00:00
modified: 2021-12-21T12:00:00+00:00
broader: sportsgren

http://cv.iptc.org/newscodes/mediatopic/20001331
type: Concept
in scheme: mediatopic
created: 2021-07-12T12:00:00+00:00
modified: 2021-12-21T12:00:00+00:00
broader: sportsgren

http://cv.iptc.org/newscodes/mediatopic/20001333
type: Concept
in scheme: mediatopic
created: 2021-07-12T12:00:00+00:00
modified: 2021-12-21T12:00:00+00:00
broader: sportsgren

http://cv.iptc.org/newscodes/mediatopic/20001334
type: Concept
in scheme: mediatopic
created: 2021-07-12T12:00:00+00:00
modified: 2021-12-21T12:00:00+00:00
broader: sportsgren

http://cv.iptc.org/newscodes/mediatopic/20001335
type: Concept
in scheme: mediatopic
created: 2021-07-12T12:00:00+00:00
modified: 2021-12-21T12:00:00+00:00
broader: sportsgren

http://cv.iptc.org/newscodes/mediatopic/20001336
type: Concept
in scheme: mediatopic
created: 2021-07-12T12:00:00+00:00
modified: 2021-12-21T12:00:00+00:00
broader: sportsgren

armbrøst
type: Concept
definition: Som en bueskytte, men med en armbrøst, der skyder hårdere og længere end en bue og skal lades, før den kan skyde.
in scheme: mediatopic
created: 2009-10-22T02:00:00+00:00
modified: 2021-02-18T12:00:00+00:00
broader: bueskydning

langbue
type: Concept
definition: Skyd med langbue på mål fra forskellige afstande. Konkurrencen afholdes udendørs på et åbent (fladt) felt.
in scheme: mediatopic
created: 2009-10-22T02:00:00+00:00
modified: 2021-05-05T12:00:00+00:00
broader: bueskydning
broad match: http://cv.iptc.org/newscodes/subjectcode/15004000

crossløb
type: Concept
definition: En løbedisciplin indenfor atletikken, hvor atleter konkurrerer i et terræn, som er anderledes end landevejen eller atletikbanen.
in scheme: mediatopic
created: 2009-10-22T02:00:00+00:00
modified: 2021-05-05T12:00:00+00:00
broader: atletik
broad match: http://cv.iptc.org/newscodes/subjectcode/15005000

tikamp
type: Concept
definition: En atletikgren, hvor deltagerne udfører ti forskellige discipliner i løbet af to dages konkurrence.
in scheme: mediatopic
created: 2009-10-22T02:00:00+00:00
modified: 2021-02-18T12:00:00+00:00
broader: atletik

diskoskast
type: Concept
definition: Konkurrenterne står i en cirkel med net rundt om og forsøger med en drejebevægelse at kaste en diskos.
in scheme: mediatopic
created: 2009-10-22T02:00:00+00:00
modified: 2021-02-18T12:00:00+00:00
broader: atletik

hammerkast
type: Concept
definition: Konkurrenterne kaster en hammer bestående af en metalkugle, kæde og håndtag så langt de kan fra en cirkel med net rundt om.
in scheme: mediatopic
created: 2009-10-22T02:00:00+00:00
modified: 2021-02-18T12:00:00+00:00
broader: atletik

syvkamp
type: Concept
definition: En atletikgren for kvinder med syv discipliner over to dage. Det bedste resultat i hver disciplin giver en sammenlignelig score, og den deltager med højeste sum vinder.
in scheme: mediatopic
created: 2009-10-22T02:00:00+00:00
modified: 2021-02-18T12:00:00+00:00
broader: atletik

højdespring
type: Concept
definition: Konkurrenterne opbygger hastigheden over en kort sprint og springer så højt som muligt over en vandret bjælke.
in scheme: mediatopic
created: 2009-10-22T02:00:00+00:00
modified: 2021-02-18T12:00:00+00:00
broader: atletik

hækkeløb
type: Concept
definition: Et sprintløb, hvor atleter hopper over en række opstillede forhindringer.
in scheme: mediatopic
created: 2009-10-22T02:00:00+00:00
modified: 2021-05-05T12:00:00+00:00
broader: atletik
broad match: http://cv.iptc.org/newscodes/subjectcode/15005000

spydkast
type: Concept
definition: Deltagerne kaster et spyd så langt som muligt.
in scheme: mediatopic
created: 2009-10-22T02:00:00+00:00
modified: 2021-02-18T12:00:00+00:00
broader: atletik

langdistanceløb
type: Concept
definition: Alle former for løbekonkurrence, der er længere end 1500 meter.
in scheme: mediatopic
created: 2009-10-22T02:00:00+00:00
modified: 2021-02-18T12:00:00+00:00
broader: atletik
broad match: http://cv.iptc.org/newscodes/subjectcode/15005000

længdespring
type: Concept
definition: Konkurrenter opbygger hastigheden over en kort sprint og springer så langt som muligt.
in scheme: mediatopic
created: 2009-10-22T02:00:00+00:00
modified: 2021-02-18T12:00:00+00:00
broader: atletik

mellemdistanceløb
type: Concept
definition: Løbskonkurrencer på mere end 400 meter og maksimalt 1500 meter.
in scheme: mediatopic
created: 2009-10-22T02:00:00+00:00
modified: 2021-02-18T12:00:00+00:00
broader: atletik
broad match: http://cv.iptc.org/newscodes/subjectcode/15005000

femkamp
type: Concept
definition: Indendørskonkurrence, hvor deltagerne udfører fem forskellige discipliner, svarende til tikamp udendørs.
in scheme: mediatopic
created: 2009-10-22T02:00:00+00:00
modified: 2021-02-18T12:00:00+00:00
broader: atletik

stangspring
type: Concept
definition: Ved hjælp af en stang skal deltagerne nå en så høj højde som muligt.
in scheme: mediatopic
created: 2009-10-22T02:00:00+00:00
modified: 2021-02-18T12:00:00+00:00
broader: atletik

kapgang
type: Concept
definition: Et løb, der kræver, at konkurrenten altid har en fod på jorden.
in scheme: mediatopic
created: 2009-10-22T02:00:00+00:00
modified: 2021-02-18T12:00:00+00:00
broader: atletik
broad match: http://cv.iptc.org/newscodes/subjectcode/15005000

stafetløb
type: Concept
definition: Et stafetløb er en konkurrence, hvor flere hold-deltagere afløser hinanden og viderelevere en depeche for at levere en samlet præstation.
in scheme: mediatopic
created: 2009-10-22T02:00:00+00:00
modified: 2021-02-18T12:00:00+00:00
broader: atletik
broad match: http://cv.iptc.org/newscodes/subjectcode/15005000

kuglestød
type: Concept
definition: Konkurrenter står i en cirkel og forsøger at støde en metalkugle så langt som muligt.
in scheme: mediatopic
created: 2009-10-22T02:00:00+00:00
modified: 2021-02-18T12:00:00+00:00
broader: atletik

sprintløb
type: Concept
definition: Spurtkonkurrencer i afstande til og med 400 meter.
in scheme: mediatopic
created: 2009-10-22T02:00:00+00:00
modified: 2021-02-18T12:00:00+00:00
broader: atletik

trespring
type: Concept
definition: En variant af længdespring, hvor deltagerne får lov til at tage et hop, et skridt og et spring.
in scheme: mediatopic
created: 2009-10-22T02:00:00+00:00
modified: 2021-02-18T12:00:00+00:00
broader: atletik

forhindringsløb
type: Concept
definition: Atletikdisciplin, hvor forhindringer som bomme og vandgrave skal forceres.
in scheme: mediatopic
created: 2019-07-23T12:00:00+00:00
modified: 2021-07-12T12:00:00+00:00
broader: atletik

rubberball baseball (nanshiki)
type: Concept
definition: Nogle gange kaldet ''blød baseball'', spillet spilles med en gummibaseball i forskellige grader af hårdhed, afhængig af spillernes alder og niveau.
in scheme: mediatopic
created: 2009-10-22T02:00:00+00:00
modified: 2021-05-05T12:00:00+00:00
broader: baseball

bantamvægt
type: Concept
definition: Vægtkategori, der varierer afhængigt af føderationen eller de olympiske lege.
in scheme: mediatopic
created: 2009-10-22T02:00:00+00:00
retired: 2015-02-24T12:00:00+00:00
modified: 2021-12-21T12:00:00+00:00
broader: boksning

cruiservægt
type: Concept
definition: Vægtkategori, der varierer afhængigt af føderationen eller de olympiske lege.
in scheme: mediatopic
created: 2009-10-22T02:00:00+00:00
retired: 2015-02-24T12:00:00+00:00
modified: 2021-12-21T12:00:00+00:00
broader: boksning

fjervægt
type: Concept
definition: Vægtkategori, der varierer afhængigt af føderationen eller de olympiske lege.
in scheme: mediatopic
created: 2014-04-08T12:00:00+00:00
retired: 2015-02-24T12:00:00+00:00
modified: 2021-12-21T12:00:00+00:00
broader: boksning

fluevægt
type: Concept
definition: Vægtkategori, der varierer afhængigt af føderationen eller de olympiske lege.
in scheme: mediatopic
created: 2009-10-22T02:00:00+00:00
retired: 2015-02-24T12:00:00+00:00
modified: 2021-12-21T12:00:00+00:00
broader: boksning

sværvægt
type: Concept
definition: Vægtkategori, der varierer afhængigt af føderationen eller de olympiske lege.
in scheme: mediatopic
created: 2009-10-22T02:00:00+00:00
retired: 2015-02-24T12:00:00+00:00
modified: 2021-12-21T12:00:00+00:00
broader: boksning

letfluevægt
type: Concept
definition: Vægtkategori, der varierer afhængigt af føderationen eller de olympiske lege.
in scheme: mediatopic
created: 2009-10-22T02:00:00+00:00
retired: 2015-02-24T12:00:00+00:00
modified: 2021-12-21T12:00:00+00:00
broader: boksning

letsværvægt
type: Concept
definition: Vægtkategori, der varierer afhængigt af føderationen eller de olympiske lege.
in scheme: mediatopic
created: 2009-10-22T02:00:00+00:00
retired: 2015-02-24T12:00:00+00:00
modified: 2021-12-21T12:00:00+00:00
broader: boksning

letmellemvægt
type: Concept
definition: Vægtkategori, der varierer afhængigt af føderationen eller de olympiske lege.
in scheme: mediatopic
created: 2009-10-22T02:00:00+00:00
retired: 2015-02-24T12:00:00+00:00
modified: 2021-12-21T12:00:00+00:00
broader: boksning

letweltervægt
type: Concept
definition: Vægtkategori, der varierer afhængigt af føderationen eller de olympiske lege.
in scheme: mediatopic
created: 2009-10-22T02:00:00+00:00
retired: 2015-02-24T12:00:00+00:00
modified: 2021-12-21T12:00:00+00:00
broader: boksning

letvægt
type: Concept
definition: Vægtkategori, der varierer afhængigt af føderationen eller de olympiske lege.
in scheme: mediatopic
created: 2009-10-22T02:00:00+00:00
retired: 2015-02-24T12:00:00+00:00
modified: 2021-12-21T12:00:00+00:00
broader: boksning

mellemvægt
type: Concept
definition: Vægtkategori, der varierer afhængigt af føderationen eller de olympiske lege.
in scheme: mediatopic
created: 2009-10-22T02:00:00+00:00
retired: 2015-02-24T12:00:00+00:00
modified: 2021-12-21T12:00:00+00:00
broader: boksning

stråvægt
type: Concept
definition: Vægtkategori, der varierer afhængigt af føderationen eller de olympiske lege.
in scheme: mediatopic
created: 2009-10-22T02:00:00+00:00
retired: 2015-02-24T12:00:00+00:00
modified: 2021-12-21T12:00:00+00:00
broader: boksning
broad match: http://cv.iptc.org/newscodes/subjectcode/15014000

superbantamvægt
type: Concept
definition: Vægtkategori, der varierer afhængigt af føderationen eller de olympiske lege.
in scheme: mediatopic
created: 2009-10-22T02:00:00+00:00
retired: 2015-02-24T12:00:00+00:00
modified: 2021-12-21T12:00:00+00:00
broader: boksning

superfjervægt
type: Concept
definition: Vægtkategori, der varierer afhængigt af føderationen eller de olympiske lege.
in scheme: mediatopic
created: 2009-10-22T02:00:00+00:00
retired: 2015-02-24T12:00:00+00:00
modified: 2021-12-21T12:00:00+00:00
broader: boksning

superfluevægt
type: Concept
definition: Vægtkategori, der varierer afhængigt af føderationen eller de olympiske lege.
in scheme: mediatopic
created: 2009-10-22T02:00:00+00:00
retired: 2015-02-24T12:00:00+00:00
modified: 2021-12-21T12:00:00+00:00
broader: boksning

supersværvægt
type: Concept
definition: Vægtkategori, der varierer afhængigt af føderationen eller de olympiske lege.
in scheme: mediatopic
created: 2009-10-22T02:00:00+00:00
retired: 2015-02-24T12:00:00+00:00
modified: 2021-12-21T12:00:00+00:00
broader: boksning

supermellemvægt
type: Concept
definition: Vægtkategori, der varierer afhængigt af føderationen eller de olympiske lege.
in scheme: mediatopic
created: 2009-10-22T02:00:00+00:00
retired: 2015-02-24T12:00:00+00:00
modified: 2021-12-21T12:00:00+00:00
broader: boksning

weltervægt
type: Concept
definition: Vægtkategori, der varierer afhængigt af føderationen eller de olympiske lege.
in scheme: mediatopic
created: 2009-10-22T02:00:00+00:00
retired: 2015-02-24T12:00:00+00:00
modified: 2021-12-21T12:00:00+00:00
broader: boksning

C1 (kano)
type: Concept
definition: Et-sædet kano.
in scheme: mediatopic
created: 2009-10-22T02:00:00+00:00
retired: 2015-02-24T12:00:00+00:00
modified: 2021-12-21T12:00:00+00:00
broader: kano

C2 (kano)
type: Concept
definition: Tosædet kano.
in scheme: mediatopic
created: 2009-10-22T02:00:00+00:00
retired: 2015-02-24T12:00:00+00:00
modified: 2021-12-21T12:00:00+00:00
broader: kano

C4 (kano)
type: Concept
definition: Fire-sædet kano.
in scheme: mediatopic
created: 2009-10-22T02:00:00+00:00
retired: 2015-02-24T12:00:00+00:00
modified: 2021-12-21T12:00:00+00:00
broader: kano
broad match: http://cv.iptc.org/newscodes/subjectcode/15015010

kanosejlads
type: Concept
definition: Et løb, der involverer en kano udstyret med et sejl.
in scheme: mediatopic
created: 2009-10-22T02:00:00+00:00
retired: 2017-07-04T12:00:00+00:00
modified: 2021-05-05T12:00:00+00:00
broader: kano

pontoniering
type: Concept
definition: Sejlsport i hold med militære traditioner.
in scheme: mediatopic
created: 2009-10-22T02:00:00+00:00
retired: 2017-07-04T12:00:00+00:00
modified: 2021-02-18T12:00:00+00:00
broader: kano

isklatring
type: Concept
definition: Isklatring er aktiviteten at klatre på isformationer, hvilket også kaldes fossklatring efter det norske ord for vandfald.
in scheme: mediatopic
created: 2009-10-22T02:00:00+00:00
modified: 2021-02-18T12:00:00+00:00
broader: bjergklatring
broad match: http://cv.iptc.org/newscodes/subjectcode/15016000

bjergbestigning
type: Concept
definition: Konkurrencer i klatring op ad bjerge. Forskellige sværhedsgrader.
in scheme: mediatopic
created: 2009-10-22T02:00:00+00:00
modified: 2023-10-02T12:00:00+00:00
broader: bjergklatring

isstok
type: Concept
definition: Minder om curling, men i stedet for sten er det en plade med lige håndtag. Mest spillede i Centraleuropa omkring Alperne.
in scheme: mediatopic
created: 2009-10-22T02:00:00+00:00
modified: 2021-02-18T12:00:00+00:00
broader: curling

cykelakrobatik
type: Concept
definition: Individuel eller holdkonkurrence, hvor deltagerne laver forskellige tricks bedømt af dommere.
in scheme: mediatopic
created: 2009-10-22T02:00:00+00:00
modified: 2021-02-18T12:00:00+00:00
broader: cykelsport

cykel forhindringsløb
type: Concept
definition: Cykelkonkurrence, hvor konkurrenterne skal passere et spor med forhindringer så hurtigt som muligt.
in scheme: mediatopic
created: 2009-10-22T02:00:00+00:00
retired: 2017-07-04T12:00:00+00:00
modified: 2021-02-18T12:00:00+00:00
broader: cykelsport

bmx
type: Concept
definition: Cykelløb med inline-start og forskellige forhindringer i off-road terræn.
in scheme: mediatopic
created: 2009-10-22T02:00:00+00:00
modified: 2021-07-12T12:00:00+00:00
broader: cykelsport
has facet: bmxfreestyletype
broad match: http://cv.iptc.org/newscodes/subjectcode/15019000

cykelbold
type: Concept
definition: Boldsport, hvor konkurrenterne sidder på cykler og forsøger at bevæge bolden med cyklens hjul uden at sætte fødderne i jorden.
in scheme: mediatopic
created: 2009-10-22T02:00:00+00:00
modified: 2021-02-18T12:00:00+00:00
broader: cykelsport

cykelsprint
type: Concept
definition: To konkurrenter ad gangen kører to eller tre omgange på en cykelbane, og tiden tages de sidste 200 meter.
in scheme: mediatopic
created: 2009-10-22T02:00:00+00:00
retired: 2017-07-04T12:00:00+00:00
modified: 2021-02-18T12:00:00+00:00
broader: cykelsport

cykelcross
type: Concept
definition: Cykelkonkurrence på bane, hvor der køres flere omgange. Banen skal have forskellige typer terræn og hældning og også have et betydeligt antal forhindringer, hvor cyklisten skal bære cyklen.
in scheme: mediatopic
created: 2009-10-22T02:00:00+00:00
retired: 2017-07-04T12:00:00+00:00
modified: 2021-02-18T12:00:00+00:00
broader: cykelsport

individuelt forfølgelsesløb
type: Concept
definition: Konkurrenterne starter på hver sin side af cykelbanen. Hvis nogen henter modstanderen, er løbet forbi, ellers vinder den bedste tid.
in scheme: mediatopic
created: 2009-10-22T02:00:00+00:00
retired: 2017-07-04T12:00:00+00:00
modified: 2021-02-18T12:00:00+00:00
broader: cykelsport

tidskørsel
type: Concept
definition: Et løb eller etape, hvor hver cyklist starter individuelt eller som hold, mod uret.
in scheme: mediatopic
created: 2009-10-22T02:00:00+00:00
retired: 2017-07-04T12:00:00+00:00
modified: 2021-02-18T12:00:00+00:00
broader: cykelsport

keirin
type: Concept
definition: Sprint mellem seks cyklister, hvor en pacer på en knallert gradvist øger tempoet i løbet af de første 1400 meter. Når paceren forlader banen, udvikles løbet til en sprintfinale over den sidste 6-700 meter.
in scheme: mediatopic
created: 2009-10-22T02:00:00+00:00
retired: 2017-07-04T12:00:00+00:00
modified: 2021-02-18T12:00:00+00:00
broader: cykelsport

parløb
type: Concept
definition: Et pointløb af hold bestående af to cyklister. Den ene rytter konkurrerer mod de øvrige deltagere, mens den anden rytter kører langsomt rundt indtil der afløses.
in scheme: mediatopic
created: 2009-10-22T02:00:00+00:00
retired: 2017-07-04T12:00:00+00:00
modified: 2021-02-18T12:00:00+00:00
broader: cykelsport

mountainbike
type: Concept
definition: Terræn, off-road cykeltur, der kræver udholdenhed og specielt tilpassede mountainbikes.
in scheme: mediatopic
created: 2009-10-22T02:00:00+00:00
modified: 2021-02-18T12:00:00+00:00
broader: cykelsport
has facet: mountainbikingtype
broad match: http://cv.iptc.org/newscodes/subjectcode/15019015

pointløb
type: Concept
definition: Cyklister sigter mod at gennemføre det højeste antal omgange. Bonuspoint samles i mellemliggende sprints, der afholdes hver 2500 meter.
in scheme: mediatopic
created: 2009-10-22T02:00:00+00:00
retired: 2017-07-04T12:00:00+00:00
modified: 2021-02-18T12:00:00+00:00
broader: cykelsport

landevejscykling
type: Concept
definition: Cykelløb på landevej med massestart.
in scheme: mediatopic
created: 2009-10-22T02:00:00+00:00
retired: 2017-07-04T12:00:00+00:00
modified: 2024-07-01T12:00:00+00:00
broader: cykelsport

etapeløb
type: Concept
definition: Cykelkonkurrencer, der afgøres over en række etaper over flere dage. Tiderne tilføjes fra hver dags konkurrence, og den, der har den laveste tid, når alle etaper køres, vinder.
in scheme: mediatopic
created: 2009-10-22T02:00:00+00:00
retired: 2017-07-04T12:00:00+00:00
modified: 2021-05-05T12:00:00+00:00
broader: cykelsport

holdsprint
type: Concept
definition: Et baneløb, hvor to hold kæmper mod hinanden, startende på modsatte sider af banen. Efter den første omgang, trækker den første rytter væk, hvilket efterlader den anden rytter til at føre, der derefter gør det samme på den sidste omgang og forlader den tredje rytter, der afslutter løbet. Holdet med den hurtigste tid er vinderen
in scheme: mediatopic
created: 2009-10-22T02:00:00+00:00
retired: 2017-07-04T12:00:00+00:00
modified: 2021-02-18T12:00:00+00:00
broader: cykelsport
broad match: http://cv.iptc.org/newscodes/subjectcode/15019000

holdforfølgelsesløb
type: Concept
definition: Konkurrenterne starter på den modsatte side af den runde bane. Hvis nogen den ene modstanderen, er løbet forbi, ellers vinder den bedste tid.
in scheme: mediatopic
created: 2009-10-22T02:00:00+00:00
retired: 2017-07-04T12:00:00+00:00
modified: 2021-02-18T12:00:00+00:00
broader: cykelsport
broad match: http://cv.iptc.org/newscodes/subjectcode/15019000

holdtidskørsel
type: Concept
definition: Hold af cyklister kæmper mod uret.
in scheme: mediatopic
created: 2009-10-22T02:00:00+00:00
retired: 2017-07-04T12:00:00+00:00
modified: 2021-02-18T12:00:00+00:00
broader: cykelsport
broad match: http://cv.iptc.org/newscodes/subjectcode/15019000

banecykling
type: Concept
definition: Et løb iscenesat på en bane i en velodrome.
in scheme: mediatopic
created: 2009-10-22T02:00:00+00:00
retired: 2017-07-04T12:00:00+00:00
modified: 2021-02-18T12:00:00+00:00
broader: cykelsport

http://cv.iptc.org/newscodes/mediatopic/20001332
type: Concept
in scheme: mediatopic
created: 2021-07-12T12:00:00+00:00
modified: 2024-03-28T12:00:00+00:00
broader: cykelsport

http://cv.iptc.org/newscodes/mediatopic/20001379
type: Concept
in scheme: mediatopic
created: 2024-05-09T12:00:00+00:00
modified: 2024-05-09T12:00:00+00:00
broader: sportsdans

udspring fra platform
type: Concept
definition: Dykkere springer fra en høj platform.
in scheme: mediatopic
created: 2009-10-22T02:00:00+00:00
modified: 2021-02-18T12:00:00+00:00
broader: udspring
has facet: platformheight
broad match: http://cv.iptc.org/newscodes/subjectcode/15021000

udspring fra vippe
type: Concept
definition: Dykkere springer fra vippe.
in scheme: mediatopic
created: 2009-10-22T02:00:00+00:00
modified: 2021-02-18T12:00:00+00:00
broader: udspring
has facet: platformheight
broad match: http://cv.iptc.org/newscodes/subjectcode/15021000

synkronudspring
type: Concept
definition: To deltagere springer fra hvert sit sted og forsøger, at lave det samme hop synkront. Point for både udførelse af springet og synkroniseringen.
in scheme: mediatopic
created: 2009-10-22T02:00:00+00:00
modified: 2021-02-18T12:00:00+00:00
broader: udspring
broad match: http://cv.iptc.org/newscodes/subjectcode/15021004
has facet: platformheight

hundevæddeløb
type: Concept
definition: Konkurrenceløb, hvor hunde jager en kunstig kanin omkring en oval bane.
in scheme: mediatopic
created: 2009-10-22T02:00:00+00:00
retired: 2017-07-04T12:00:00+00:00
modified: 2021-02-18T12:00:00+00:00
broader: hundeløb

hundeslædeløb
type: Concept
definition: Konkurrenceløb, hvor hunde trækker en slæde.
in scheme: mediatopic
created: 2009-10-22T02:00:00+00:00
retired: 2017-07-04T12:00:00+00:00
modified: 2021-02-18T12:00:00+00:00
broader: hundeløb

terrænridning
type: Concept
definition: Hestevæddeløb på en bane i naturen, hvor der er både naturlige og konstruerede forhindringer.
in scheme: mediatopic
created: 2009-10-22T02:00:00+00:00
retired: 2017-07-04T12:00:00+00:00
modified: 2021-05-05T12:00:00+00:00
broader: ridesport

dressur
type: Concept
definition: Hestekonkurrence, hvor forskellige bevægelser skal udføres på en bane og derefter bedømmes af dommere.
in scheme: mediatopic
created: 2009-10-22T02:00:00+00:00
retired: 2017-07-04T12:00:00+00:00
modified: 2021-02-18T12:00:00+00:00
broader: ridesport

ridebanespringning
type: Concept
definition: En rytter og hest forsøger at hoppe over en række forhindringer i en lukket arena mod uret.
in scheme: mediatopic
created: 2009-10-22T02:00:00+00:00
retired: 2017-07-04T12:00:00+00:00
modified: 2021-02-18T12:00:00+00:00
broader: ridesport

military
type: Concept
definition: Kombinationskonkurrence med hest og rytter. Grenerne er dressur, udholdenhed, og ridebanespring.
in scheme: mediatopic
created: 2009-10-22T02:00:00+00:00
retired: 2017-07-04T12:00:00+00:00
modified: 2021-02-18T12:00:00+00:00
broader: ridesport

hestevognskørsel
type: Concept
definition: Hestekonkurrence, hvor en ekvipager med en eller flere heste kommer rundt på en forhindringsbane i en arena.
in scheme: mediatopic
created: 2009-10-22T02:00:00+00:00
retired: 2017-07-04T12:00:00+00:00
modified: 2021-02-18T12:00:00+00:00
broader: ridesport
broad match: http://cv.iptc.org/newscodes/subjectcode/15022000

kårde
type: Concept
definition: Kårde er det tyngste og største af våbene, bladet er trekantet, og du prøver at ramme modstanderen ved at skubbe kården fremad.
in scheme: mediatopic
created: 2009-10-22T02:00:00+00:00
retired: 2017-07-04T12:00:00+00:00
modified: 2021-07-12T12:00:00+00:00
broader: fægtning

fleuret
type: Concept
definition: Fleuret blev skabt som et træningsvåben. Strenge regler for, hvordan angreb skal afværges, før et modangreb kan finde sted.
in scheme: mediatopic
created: 2009-10-22T02:00:00+00:00
retired: 2017-07-04T12:00:00+00:00
modified: 2021-02-18T12:00:00+00:00
broader: fægtning

sabel
type: Concept
definition: En sabel til konkurrence har intet til fælles med traditionelle billeder af sabler. I fægtekonkurrence med sabel må du både støde og hugge.
in scheme: mediatopic
created: 2009-10-22T02:00:00+00:00
retired: 2017-07-04T12:00:00+00:00
modified: 2021-02-18T12:00:00+00:00
broader: fægtning

isdans
type: Concept
definition: Tre-dages konkurrence, hvor deltagerne gør obligatoriske ting to dage og frivilligt program den tredje dag.
in scheme: mediatopic
created: 2009-10-22T02:00:00+00:00
retired: 2017-07-04T12:00:00+00:00
modified: 2021-02-18T12:00:00+00:00
broader: kunstskøjteløb

minigolf
type: Concept
definition: Spilles på kunstige korte baner med forhindringer. Normalt 18 baner på en runde.
in scheme: mediatopic
created: 2009-10-22T02:00:00+00:00
modified: 2021-02-18T12:00:00+00:00
broader: golf

rytmisk gymnastik
type: Concept
definition: Blanding af dans og gymnastiske træk.
in scheme: mediatopic
created: 2009-10-22T02:00:00+00:00
modified: 2021-02-18T12:00:00+00:00
broader: gymnastik
narrower: bold
narrower: køller
narrower: tøndebånd
narrower: vimpel
narrower: tov
has facet: rhythmgymtype

trampolin
type: Concept
definition: Konkurrenterne hopper på en trampolin og udfører ti på hinanden følgende øvelser (tricks) i rækkefølge. Bedømt af dommere.
in scheme: mediatopic
created: 2009-10-22T02:00:00+00:00
modified: 2021-02-18T12:00:00+00:00
broader: gymnastik

redskabsgymnastik
type: Concept
definition: Deltagerne udfører bevægelser på forskellige redskaber og bedømmes af dommere.
in scheme: mediatopic
created: 2014-04-11T12:00:00+00:00
modified: 2021-07-12T12:00:00+00:00
broader: gymnastik
narrower: bom
narrower: gulvøvelse
narrower: reck
narrower: barre
narrower: bensving
narrower: ringe
narrower: forskudt barre
narrower: spring over hest
has facet: artisticgymtype

bold
type: Concept
definition: En øvelse baseret på smidighed af kroppen ved hjælp af en bold.
in scheme: mediatopic
created: 2009-10-22T02:00:00+00:00
retired: 2015-02-24T12:00:00+00:00
modified: 2021-12-21T12:00:00+00:00
broader: rytmisk gymnastik

bom
type: Concept
definition: Gymnaster udfører spring og rotation fra en balancebom, der kun er 10 centimeter bred.
in scheme: mediatopic
created: 2009-10-22T02:00:00+00:00
retired: 2015-02-24T12:00:00+00:00
modified: 2021-12-21T12:00:00+00:00
broader: redskabsgymnastik

køller
type: Concept
definition: Dans og gymnastikbevægelser mens gymnasten jonglerer med køller på gulv.
in scheme: mediatopic
created: 2009-10-22T02:00:00+00:00
retired: 2015-02-24T12:00:00+00:00
modified: 2021-12-21T12:00:00+00:00
broader: rytmisk gymnastik

gulvøvelse
type: Concept
definition: En gymnastikgulvøvelse på en defineret firkantet bane.
in scheme: mediatopic
created: 2009-10-22T02:00:00+00:00
retired: 2015-02-24T12:00:00+00:00
modified: 2021-12-21T12:00:00+00:00
broader: redskabsgymnastik

tøndebånd
type: Concept
definition: En ring rulles og kastes, mens gymnasten udfører en danserutine.
in scheme: mediatopic
created: 2009-10-22T02:00:00+00:00
retired: 2015-02-24T12:00:00+00:00
modified: 2021-12-21T12:00:00+00:00
broader: rytmisk gymnastik

reck
type: Concept
definition: Gymnaster svinger, springer og udfører piruetter omkring den vandrette bjælke.
in scheme: mediatopic
created: 2009-10-22T02:00:00+00:00
retired: 2015-02-24T12:00:00+00:00
modified: 2021-12-21T12:00:00+00:00
broader: redskabsgymnastik

barre
type: Concept
definition: Gymnaster svinger, springer og udfører piruetter omkring de parallelle bjælker.
in scheme: mediatopic
created: 2009-10-22T02:00:00+00:00
retired: 2015-02-24T12:00:00+00:00
modified: 2021-12-21T12:00:00+00:00
broader: redskabsgymnastik

bensving
type: Concept
definition: Gymnast udfører en uafbrudt svingbevægelse med benene over en *hest* ved hjælp af balance og styrke.
in scheme: mediatopic
created: 2009-10-22T02:00:00+00:00
retired: 2015-02-24T12:00:00+00:00
modified: 2021-12-21T12:00:00+00:00
broader: redskabsgymnastik

vimpel
type: Concept
definition: Gymnasten udfører øvelser i kast og dans med vimpel .
in scheme: mediatopic
created: 2009-10-22T02:00:00+00:00
retired: 2015-02-24T12:00:00+00:00
modified: 2021-12-21T12:00:00+00:00
broader: rytmisk gymnastik

tov
type: Concept
definition: Gymnasten udfører øvelser i kast og dans med tov (sjippetov).
in scheme: mediatopic
created: 2009-10-22T02:00:00+00:00
retired: 2015-02-24T12:00:00+00:00
modified: 2021-12-21T12:00:00+00:00
broader: rytmisk gymnastik

ringe
type: Concept
definition: Gymnast udfører balance og styrke fra to ophængte ringe.
in scheme: mediatopic
created: 2009-10-22T02:00:00+00:00
retired: 2015-02-24T12:00:00+00:00
modified: 2021-12-21T12:00:00+00:00
broader: redskabsgymnastik

forskudt barre
type: Concept
definition: Forskudt barre er en øvelse i redskabsgymnastik for kvinder. Redskabet forskudt barre består af to stænger i et stativophæng med ståltrådsforankring.
in scheme: mediatopic
created: 2009-10-22T02:00:00+00:00
retired: 2015-02-24T12:00:00+00:00
modified: 2021-12-21T12:00:00+00:00
broader: redskabsgymnastik

spring over hest
type: Concept
definition: Deltageren løber hen mod *hesten*, hvor han eller hun med hjælp fra en springplade sætter af med fødderne, slår an mod hesten og derefter lander på den anden side af hesten efter at have udført en eller flere akrobatiske vendinger i luften.
in scheme: mediatopic
created: 2009-10-22T02:00:00+00:00
retired: 2015-02-24T12:00:00+00:00
modified: 2021-12-21T12:00:00+00:00
broader: redskabsgymnastik

galopløb
type: Concept
definition: Ridesportskonkurrence med rytter på hest. Hesten skal galoppere.
in scheme: mediatopic
created: 2009-10-22T02:00:00+00:00
retired: 2017-07-04T12:00:00+00:00
modified: 2021-02-18T12:00:00+00:00
broader: hestevæddeløb

travløb
type: Concept
definition: Hestevæddeløb med en mand/kvinde i en sulky (lille vogn) bag hesten. Hesten må ikke galoppere.
in scheme: mediatopic
created: 2009-10-22T02:00:00+00:00
retired: 2017-07-04T12:00:00+00:00
modified: 2021-02-18T12:00:00+00:00
broader: hestevæddeløb

hesteforhindringsløb
type: Concept
definition: Hestevæddeløb, hvor ryttere på heste skal krydse otte forhindringer, hvoraf mindst fire skal være forskellige.
in scheme: mediatopic
created: 2009-10-22T02:00:00+00:00
retired: 2017-07-04T12:00:00+00:00
modified: 2021-02-18T12:00:00+00:00
broader: hestevæddeløb

slædehockey
type: Concept
definition: Holdsport, der ligner ishockey, men spillerne sidder på en lille slæde og bevæger sig fremad med kraft fra armene.
in scheme: mediatopic
created: 2009-10-22T02:00:00+00:00
modified: 2021-02-18T12:00:00+00:00
broader: ishockey

judo
type: Concept
definition: Judo blev udviklet fra jujutsu, men har ingen spark og slag. Det er mere en forsvarsteknik med kast og balance.
in scheme: mediatopic
created: 2009-10-22T02:00:00+00:00
modified: 2021-02-18T12:00:00+00:00
broader: kampsport
narrower: ekstra-letvægt
narrower: halv-sværvægt
narrower: halv-letvægt
narrower: halv-mellemvægt
narrower: sværvægt
narrower: letvægt
narrower: mellemvægt
has facet: weightclasstype

ekstra-letvægt
type: Concept
definition: Op til 60 kg for mænd og 48 kg for kvinder.
in scheme: mediatopic
created: 2009-10-22T02:00:00+00:00
retired: 2015-02-24T12:00:00+00:00
modified: 2021-12-21T12:00:00+00:00
broader: judo

halv-sværvægt
type: Concept
definition: Op til 100 kg for mænd og 78 kg for kvinder.
in scheme: mediatopic
created: 2009-10-22T02:00:00+00:00
retired: 2015-02-24T12:00:00+00:00
modified: 2021-12-21T12:00:00+00:00
broader: judo

halv-letvægt
type: Concept
definition: Op til 73 kg for mænd og 57 kg for kvinder.
in scheme: mediatopic
created: 2009-10-22T02:00:00+00:00
retired: 2015-02-24T12:00:00+00:00
modified: 2021-12-21T12:00:00+00:00
broader: judo

halv-mellemvægt
type: Concept
definition: Op til 81 kg for mænd og 63 kg for kvinder.
in scheme: mediatopic
created: 2009-10-22T02:00:00+00:00
retired: 2015-02-24T12:00:00+00:00
modified: 2021-12-21T12:00:00+00:00
broader: judo

sværvægt
type: Concept
definition: Åben, men normalt over 100 kg for mænd og over 78 kg for kvinder.
in scheme: mediatopic
created: 2009-10-22T02:00:00+00:00
retired: 2015-02-24T12:00:00+00:00
modified: 2021-12-21T12:00:00+00:00
broader: judo

letvægt
type: Concept
definition: Op til 66 kg for mænd og 52 kg for kvinder.
in scheme: mediatopic
created: 2009-10-22T02:00:00+00:00
retired: 2015-02-24T12:00:00+00:00
modified: 2021-12-21T12:00:00+00:00
broader: judo

mellemvægt
type: Concept
definition: Op til 90 kg for mænd og 70 kg for kvinder.
in scheme: mediatopic
created: 2009-10-22T02:00:00+00:00
retired: 2015-02-24T12:00:00+00:00
modified: 2021-12-21T12:00:00+00:00
broader: judo

jukendo
type: Concept
definition: Traditionel japansk kampsport, hvor våbnet er en model af en bajonetmonteret riffel.
in scheme: mediatopic
created: 2009-10-22T02:00:00+00:00
modified: 2021-02-18T12:00:00+00:00
broader: kampsport

K1 (kajak)
type: Concept
definition: Sejlads i kajak til én person, hvor deltageren sidder med ben og fødder fremad og bruger en padle med blade i begge ender.
in scheme: mediatopic
created: 2009-10-22T02:00:00+00:00
retired: 2015-02-24T12:00:00+00:00
modified: 2021-12-21T12:00:00+00:00
broader: kajak

K2 (kajak)
type: Concept
definition: Sejlads i kajak til to person, hvor deltageren sidder med ben og fødder fremad og bruger en padle med blade i begge ender.
in scheme: mediatopic
created: 2009-10-22T02:00:00+00:00
retired: 2015-02-24T12:00:00+00:00
modified: 2021-12-21T12:00:00+00:00
broader: kajak

K4 (kajak)
type: Concept
definition: Sejlads i kajak til fire person, hvor deltageren sidder med ben og fødder fremad og bruger en padle med blade i begge ender.
in scheme: mediatopic
created: 2009-10-22T02:00:00+00:00
retired: 2015-02-24T12:00:00+00:00
modified: 2021-12-21T12:00:00+00:00
broader: kajak

karate
type: Concept
definition: Kampsport oprindeligt fra Okinawa, hvor hovedsageligt slag og spark bruges til at besejre en modstander.
in scheme: mediatopic
created: 2009-10-22T02:00:00+00:00
modified: 2021-02-18T12:00:00+00:00
broader: kampsport

kendo
type: Concept
definition: Japansk kampsport, hvor våbnet er et sværd af bambus.
in scheme: mediatopic
created: 2009-10-22T02:00:00+00:00
modified: 2021-03-15T12:00:00+00:00
broader: kampsport

kyudo
type: Concept
definition: Japansk kampsport med en bue lavet af bambus.
in scheme: mediatopic
created: 2009-10-22T02:00:00+00:00
modified: 2021-02-18T12:00:00+00:00
broader: kampsport

langdistanceløb
type: Concept
definition: Motorløb som udholdenhedsløb over lang afstand eller tid.
in scheme: mediatopic
created: 2009-10-22T02:00:00+00:00
retired: 2017-07-04T12:00:00+00:00
modified: 2021-02-18T12:00:00+00:00
broader: motorløb

F3000
type: Concept
definition: Fungerer som formel 1, men med mindre kraftfulde motorer.
in scheme: mediatopic
created: 2009-10-22T02:00:00+00:00
retired: 2017-07-04T12:00:00+00:00
modified: 2021-02-18T12:00:00+00:00
broader: motorløb

formel 1
type: Concept
definition: Motorkonkurrence for biler med de største motorer. Cirka 20 biler pr. løb. Startposition opnås gennem gode træningstider dagene før løbet. Både en individuel konkurrence og en holdkonkurrence.
in scheme: mediatopic
created: 2009-10-22T02:00:00+00:00
retired: 2017-07-04T12:00:00+00:00
modified: 2021-02-18T12:00:00+00:00
broader: motorløb

indyracing
type: Concept
definition: Nordamerikansk ækvivalent til formel 1. Løbet går på ovale baner i høje hastigheder.
in scheme: mediatopic
created: 2009-10-22T02:00:00+00:00
retired: 2017-07-04T12:00:00+00:00
modified: 2021-02-18T12:00:00+00:00
broader: motorløb

rallycross
type: Concept
definition: Motorløb med biler, der ligner mere almindelige biler. Konkurrencen finder sted på grusbaner med niveauforskelle.
in scheme: mediatopic
created: 2009-10-22T02:00:00+00:00
retired: 2017-07-04T12:00:00+00:00
modified: 2021-02-18T12:00:00+00:00
broader: motorløb

rally
type: Concept
definition: Rally køres af biler, der har chauffører og kortlæsere i bilen, på offentlige, men lukkede veje. Hver konkurrence har flere etaper, og grundlaget varierer afhængigt af placering og sæson.
in scheme: mediatopic
created: 2009-10-22T02:00:00+00:00
retired: 2017-07-04T12:00:00+00:00
modified: 2021-02-18T12:00:00+00:00
broader: motorløb

motorcykel langdistanceløb
type: Concept
definition: Motorcykelløb, hvor udholdenhed og taktik med pit-stop er mere afgørende end hastighed. Ofte meget lange løb, så holdene skifter kørere med forskellige intervaller.
in scheme: mediatopic
created: 2009-10-22T02:00:00+00:00
retired: 2017-07-04T12:00:00+00:00
modified: 2021-02-18T12:00:00+00:00
broader: motorcykelsport

enduro
type: Concept
definition: Udholdenhedsløb på motorcykel, ofte på vanskeligt terræn.
in scheme: mediatopic
created: 2009-10-22T02:00:00+00:00
retired: 2017-07-04T12:00:00+00:00
modified: 2021-02-18T12:00:00+00:00
broader: motorcykelsport

græsbane
type: Concept
definition: Minder om speedway men finder sted på græsbaner.
in scheme: mediatopic
created: 2009-10-22T02:00:00+00:00
retired: 2017-07-04T12:00:00+00:00
modified: 2021-02-18T12:00:00+00:00
broader: motorcykelsport

motorbold
type: Concept
definition: Ligner fodbold, hvor de spillerne kører på en motorcykel udendørs. Målmanden har ingen motorcykel.
in scheme: mediatopic
created: 2009-10-22T02:00:00+00:00
retired: 2017-07-04T12:00:00+00:00
modified: 2021-02-18T12:00:00+00:00
broader: motorcykelsport

motorcross
type: Concept
definition: Motorcykelløb på en bane med grus og store hop.
in scheme: mediatopic
created: 2009-10-22T02:00:00+00:00
retired: 2017-07-04T12:00:00+00:00
modified: 2021-02-18T12:00:00+00:00
broader: motorcykelsport

motorcykel grand prix
type: Concept
definition: Motorcykelløb på asfaltbane, ofte de samme spor, der bruges til tilsvarende billøb.
in scheme: mediatopic
created: 2009-10-22T02:00:00+00:00
retired: 2017-07-04T12:00:00+00:00
modified: 2021-02-18T12:00:00+00:00
broader: motorcykelsport

motorcykel rally
type: Concept
definition: Motorcykelløb på almindelige veje.
in scheme: mediatopic
created: 2009-10-22T02:00:00+00:00
retired: 2017-07-04T12:00:00+00:00
modified: 2021-02-18T12:00:00+00:00
broader: motorcykelsport

sidevognscross
type: Concept
definition: Motorcykelkonkurrence, hvor motorcyklen har en sidevogn monteret og en passager hjælper med, at holde balance.
in scheme: mediatopic
created: 2009-10-22T02:00:00+00:00
retired: 2017-07-04T12:00:00+00:00
modified: 2021-05-05T12:00:00+00:00
broader: motorcykelsport

speedway
type: Concept
definition: Motorcykelkonkurrence på en oval bane med normalt fire konkurrenter pr. løb. En konkurrence består af flere heats, hvor hver rytter er inkluderet i nogle heats. De konkurrerer både individuelt og i hold. Motorcyklerne har kun et gear og ingen bremse.
in scheme: mediatopic
created: 2009-10-22T02:00:00+00:00
retired: 2017-07-04T12:00:00+00:00
modified: 2021-02-18T12:00:00+00:00
broader: motorcykelsport

motorcykel terrænløb
type: Concept
definition: Et løb af konsistens og udholdenhed over varieret terræn.
in scheme: mediatopic
created: 2009-10-22T02:00:00+00:00
retired: 2017-07-04T12:00:00+00:00
modified: 2021-02-18T12:00:00+00:00
broader: motorcykelsport

naginata
type: Concept
definition: Japansk kampsport, hvor våbnet er en stang med et skarpt blad i enden.
in scheme: mediatopic
created: 2009-10-22T02:00:00+00:00
modified: 2021-02-18T12:00:00+00:00
broader: kampsport

skiorientering
type: Concept
definition: Orienteringsløb hvor konkurrenterne har ski på fødderne. Ved hjælp af et kort og kompas finder skiløberen et antal poster.
in scheme: mediatopic
created: 2009-10-22T02:00:00+00:00
modified: 2021-02-18T12:00:00+00:00
broader: orienteringsløb

bareback bronc
type: Concept
definition: Rider på en sadelløs hest, som forsøger at kaste rytteren af. Disciplinen er oprindeligt skabt til heste, der skulle rides til af den professionelle cowboy.
in scheme: mediatopic
created: 2009-10-22T02:00:00+00:00
modified: 2021-07-12T12:00:00+00:00
broader: rodeo

barrel racing
type: Concept
definition: Konkurrence, hvor rytteren rider sin hest på en bane på tid.
in scheme: mediatopic
created: 2009-10-22T02:00:00+00:00
modified: 2021-07-12T12:00:00+00:00
broader: rodeo

bull riding
type: Concept
definition: Konkurrence, hvor rytteren rider på en tyr.
in scheme: mediatopic
created: 2009-10-22T02:00:00+00:00
modified: 2021-07-12T12:00:00+00:00
broader: rodeo

bulldogging
type: Concept
definition: Konkurrence, hvor rytteren hopper af sin hest og kæmper mod en ung tyr ved, at gribe dets horn.
in scheme: mediatopic
created: 2009-10-22T02:00:00+00:00
modified: 2021-07-12T12:00:00+00:00
broader: rodeo

calf roping
type: Concept
definition: At fange kalve ved hjælp af en lasso, oprindeligt skabt til at fange kalve til mærkning og lignende.
in scheme: mediatopic
created: 2009-10-22T02:00:00+00:00
modified: 2021-07-12T12:00:00+00:00
broader: rodeo

goat roping
type: Concept
definition: At fange geder ved hjælp af en lasso, oprindeligt skabt til at fange geder til mærkning og lignende.
in scheme: mediatopic
created: 2009-10-22T02:00:00+00:00
modified: 2021-07-12T12:00:00+00:00
broader: rodeo

saddle bronc
type: Concept
definition: At ride på hest med sadel, som forsøger at kaste rytteren af. Oprindeligt skabt til heste, der skal rides af den professionelle cowboy.
in scheme: mediatopic
created: 2009-10-22T02:00:00+00:00
modified: 2021-07-12T12:00:00+00:00
broader: rodeo

rulleskøjtehockey
type: Concept
definition: Selve spillet er som ishockey, men konkurrenterne har rulleskøjter (inliners) på og underlaget er ikke is.
in scheme: mediatopic
created: 2009-10-22T02:00:00+00:00
modified: 2021-02-18T12:00:00+00:00
broader: rullesport

firer med styrmand
type: Concept
definition: Firepersoners både med kun een åre til hver person og med en styrmand til at sætte kursen.
in scheme: mediatopic
created: 2009-10-22T02:00:00+00:00
retired: 2015-02-24T12:00:00+00:00
modified: 2021-12-21T12:00:00+00:00
broader: roning
broad match: http://cv.iptc.org/newscodes/subjectcode/15047000

toer med styrmand
type: Concept
definition: Topersoners både med kun een åre til hver person og med en styrmand til at sætte kursen.
in scheme: mediatopic
created: 2009-10-22T02:00:00+00:00
retired: 2015-02-24T12:00:00+00:00
modified: 2021-12-21T12:00:00+00:00
broader: roning
broad match: http://cv.iptc.org/newscodes/subjectcode/15047000

firer uden styrmand
type: Concept
definition: Firepersoners både med kun een åre til hver person og uden en styrmand til at sætte kursen.
in scheme: mediatopic
created: 2009-10-22T02:00:00+00:00
retired: 2015-02-24T12:00:00+00:00
modified: 2021-12-21T12:00:00+00:00
broader: roning

toer uden styrmand
type: Concept
definition: Topersoners både med kun een åre til hver person og uden en styrmand til at sætte kursen.
in scheme: mediatopic
created: 2009-10-22T02:00:00+00:00
retired: 2015-02-24T12:00:00+00:00
modified: 2021-12-21T12:00:00+00:00
broader: roning

dobbeltsculler
type: Concept
definition: Topersoners båd med to årer hver.
in scheme: mediatopic
created: 2009-10-22T02:00:00+00:00
retired: 2015-02-24T12:00:00+00:00
modified: 2021-12-21T12:00:00+00:00
broader: roning

otter med styrmand
type: Concept
definition: Otte-personers både med kun een åre til hver person og med en styrmand til at sætte kursen.
in scheme: mediatopic
created: 2009-10-22T02:00:00+00:00
retired: 2015-02-24T12:00:00+00:00
modified: 2021-12-21T12:00:00+00:00
broader: roning
broad match: http://cv.iptc.org/newscodes/subjectcode/15047006

dobbeltfirer
type: Concept
definition: Firepersoners båd med to årer hver uden styrmand.
in scheme: mediatopic
created: 2009-10-22T02:00:00+00:00
retired: 2015-02-24T12:00:00+00:00
modified: 2021-12-21T12:00:00+00:00
broader: roning

singlesculler
type: Concept
definition: Enpersons båd med to årer hver uden styrmand.
in scheme: mediatopic
created: 2009-10-22T02:00:00+00:00
retired: 2015-02-24T12:00:00+00:00
modified: 2021-12-21T12:00:00+00:00
broader: roning

rugby league (13-mands rugby)
type: Concept
definition: En type rugby, hvor to hold af 13 konkurrerer på en bane ved, at løbe med og kaste en oval bold. Point scores ved at føre bolden bag mållinjen eller sparke den mellem målstolperne. Styret af Rugby League International Føderation.
in scheme: mediatopic
created: 2009-10-22T02:00:00+00:00
modified: 2021-07-12T12:00:00+00:00
broader: rugby

rugby union (15-mands rugby)
type: Concept
definition: En type rugby, hvor to hold af 15 konkurrerer på en bane ved, at løbe med og kaste en oval bold. Point scores ved at føre bolden bag mållinjen eller sparke den mellem målstolperne. Styret af Rugby League International Federation.
in scheme: mediatopic
created: 2009-10-22T02:00:00+00:00
modified: 2021-02-18T12:00:00+00:00
broader: rugby

rugby sevens (7-mands rugby)
type: Concept
definition: En type rugby, hvor to hold af 7 konkurrerer på en bane ved, at løbe med og kaste en oval bold. Point scores ved at føre bolden bag mållinjen eller sparke den mellem målstolperne. Styret af Rugby League International Føderation.
in scheme: mediatopic
created: 2009-10-22T02:00:00+00:00
modified: 2021-07-12T12:00:00+00:00
broader: rugby

multihull
type: Concept
definition: Sejlbåde med flere skrog.
in scheme: mediatopic
created: 2009-10-22T02:00:00+00:00
retired: 2017-07-04T12:00:00+00:00
modified: 2021-05-05T12:00:00+00:00
broader: sejlsport

jolle
type: Concept
definition: Konkurrencer med en sejlbåd med midterbord i stedet for fast køl.
in scheme: mediatopic
created: 2009-10-22T02:00:00+00:00
retired: 2017-07-04T12:00:00+00:00
modified: 2021-02-18T12:00:00+00:00
broader: sejlsport
broad match: http://cv.iptc.org/newscodes/subjectcode/15050013

kølbåd
type: Concept
definition: Enkelt skrog med fast køl.
in scheme: mediatopic
created: 2009-10-22T02:00:00+00:00
retired: 2017-07-04T12:00:00+00:00
modified: 2021-05-05T12:00:00+00:00
broader: sejlsport
broad match: http://cv.iptc.org/newscodes/subjectcode/15050013

regattasejlads
type: Concept
definition: En enkelt eller en række sejlads-konkurrencer.
in scheme: mediatopic
created: 2009-10-22T02:00:00+00:00
retired: 2017-07-04T12:00:00+00:00
modified: 2021-05-05T12:00:00+00:00
broader: sejlsport
broad match: http://cv.iptc.org/newscodes/subjectcode/15050000

oceansejllads
type: Concept
definition: Konkurrencer med sejlskibe over eet eller flere oceaner.
in scheme: mediatopic
created: 2009-10-22T02:00:00+00:00
retired: 2017-07-04T12:00:00+00:00
modified: 2021-05-05T12:00:00+00:00
broader: sejlsport
broad match: http://cv.iptc.org/newscodes/subjectcode/15050000

verdensomsejling
type: Concept
definition: Sejlkonkurrencer rundt om jorden.
in scheme: mediatopic
created: 2009-10-22T02:00:00+00:00
retired: 2017-07-04T12:00:00+00:00
modified: 2021-05-05T12:00:00+00:00
broader: sejlsport

solo oceansejlads
type: Concept
definition: Sejlkonkurrencer, hvor sejleren skal være alene.
in scheme: mediatopic
created: 2009-10-22T02:00:00+00:00
retired: 2017-07-04T12:00:00+00:00
modified: 2021-05-05T12:00:00+00:00
broader: sejlsport
broad match: http://cv.iptc.org/newscodes/subjectcode/15050000

non-stop solo løb
type: Concept
definition: Sejlkonkurrence rundt om jorden, hvor sejleren skal være alene og ikke have tilladelse til at lægge til i nogen havn på vejen.
in scheme: mediatopic
created: 2009-10-22T02:00:00+00:00
retired: 2017-07-04T12:00:00+00:00
modified: 2021-02-18T12:00:00+00:00
broader: sejlsport
broad match: http://cv.iptc.org/newscodes/subjectcode/15050012

pistolskydning
type: Concept
definition: En skydedisciplin, hvor man anvender pistol.
in scheme: mediatopic
created: 2009-10-22T02:00:00+00:00
retired: 2017-07-04T12:00:00+00:00
modified: 2021-02-18T12:00:00+00:00
broader: skydning
broad match: http://cv.iptc.org/newscodes/subjectcode/15051001

riffelskydning
type: Concept
definition: En skydedisciplin, hvor man anvender en riffel.
in scheme: mediatopic
created: 2009-10-22T02:00:00+00:00
retired: 2017-07-04T12:00:00+00:00
modified: 2021-05-05T12:00:00+00:00
broader: skydning
broad match: http://cv.iptc.org/newscodes/subjectcode/15051002

skydning efter bevægeligt mål
type: Concept
definition: En skydedisciplin, med luftpistol mod bevægelige mål på forskellige lange målbaner og på tid.
in scheme: mediatopic
created: 2009-10-22T02:00:00+00:00
retired: 2017-07-04T12:00:00+00:00
modified: 2021-05-05T12:00:00+00:00
broader: skydning
broad match: http://cv.iptc.org/newscodes/subjectcode/15051003

skeetskydning
type: Concept
definition: En skydedisciplin, hvor man anvender haglgevær.
in scheme: mediatopic
created: 2009-10-22T02:00:00+00:00
retired: 2017-07-04T12:00:00+00:00
modified: 2021-05-05T12:00:00+00:00
broader: skydning
broad match: http://cv.iptc.org/newscodes/subjectcode/15051004

flugtskydning
type: Concept
definition: En skydedisciplin, der involverer skydning mod specielle flyvende mål, kendt som lerduer eller lermål.
in scheme: mediatopic
created: 2009-10-22T02:00:00+00:00
retired: 2017-07-04T12:00:00+00:00
modified: 2021-05-05T12:00:00+00:00
broader: skydning
broad match: http://cv.iptc.org/newscodes/subjectcode/15051005

alpint skiløb
type: Concept
definition: Skiløb i snedækket skrående bjergterræn ved hjælp af alpin teknik og udstyr. Pisterne har markerede porte, der er anbragt forskelligt afhængigt af typen skiløb.
in scheme: mediatopic
created: 2009-10-22T02:00:00+00:00
modified: 2021-02-18T12:00:00+00:00
broader: skiløb
has facet: alpineskiingtype

freestyle skiløb
type: Concept
definition: Alternativ form for skiløb i alpint miljø. Konkurrenterne kører på pukkelpister, foretager kunstneriske spring eller udfører kunstneriske bevægelser på vej ned ad bakken. Kombination af tid og dommerpoint.
in scheme: mediatopic
created: 2009-10-22T02:00:00+00:00
modified: 2022-02-03T12:00:00+00:00
broader: skiløb
has facet: freestyleskiingtype

skiløb på græs
type: Concept
definition: Alpint skiløb med rulleski på græs.
in scheme: mediatopic
created: 2009-10-22T02:00:00+00:00
modified: 2021-02-18T12:00:00+00:00
broader: skiløb

nordisk disciplin
type: Concept
definition: Skiløb i præparerede stier i forskellige afstande gennem forskellige terræn.
in scheme: mediatopic
created: 2009-10-22T02:00:00+00:00
retired: 2019-08-01T12:00:00+00:00
modified: 2021-02-18T12:00:00+00:00
broader: skiløb
has facet: nordicskiingtype

skihop
type: Concept
definition: Konkurrenter kører ned ad en snedækket forhøjet rampe på ski og forsøger at hoppe væk fra den så langt som muligt og modtager point for afstand, flyvemåde og landing.
in scheme: mediatopic
created: 2009-10-22T02:00:00+00:00
modified: 2021-02-18T12:00:00+00:00
broader: skiløb

langrend
type: Concept
definition: Nordisk skiløb hvor der konkurreres i relativt fladt, snedækket landskab på smalle ski.
in scheme: mediatopic
created: 2014-01-17T12:00:00+00:00
modified: 2021-02-18T12:00:00+00:00
broader: skiløb

nordisk kombineret
type: Concept
definition: En kombination, hvor skiløberne både konkurrerer i langrend og skihop.
in scheme: mediatopic
created: 2014-01-20T12:00:00+00:00
modified: 2021-02-18T12:00:00+00:00
broader: skiløb

Telemark skiløb
type: Concept
definition: Løb, der kombinerer alpint og langrendsskiløb med unikke Telemarks teknikker og udstyr.
in scheme: mediatopic
created: 2014-11-07T12:00:00+00:00
modified: 2021-07-12T12:00:00+00:00
broader: skiløb

http://cv.iptc.org/newscodes/mediatopic/20001390
type: Concept
in scheme: mediatopic
created: 2025-03-31T12:00:00+00:00
modified: 2025-03-31T12:00:00+00:00
broader: skiløb

http://cv.iptc.org/newscodes/mediatopic/20001393
type: Concept
in scheme: mediatopic
created: 2025-10-09T12:00:00+00:00
modified: 2025-10-09T12:00:00+00:00
broader: fodbold

http://cv.iptc.org/newscodes/mediatopic/20001394
type: Concept
in scheme: mediatopic
created: 2025-10-09T12:00:00+00:00
modified: 2025-10-09T12:00:00+00:00
broader: fodbold

rygcrawl
type: Concept
definition: Svømmedisciplin på ryggen, hvor benene bevæger sig i flappende bevægelse, mens armene driver svømmeren fremad.
in scheme: mediatopic
created: 2009-10-22T02:00:00+00:00
retired: 2015-02-24T12:00:00+00:00
modified: 2021-12-21T12:00:00+00:00
broader: svømning
broad match: http://cv.iptc.org/newscodes/subjectcode/15062000

brystsvømning
type: Concept
definition: Svømmedisciplin på maven, hvor man kommer frem ved bevægelser udad og bagud med armene, mens benene skubbes udad og bagud.
in scheme: mediatopic
created: 2009-10-22T02:00:00+00:00
retired: 2015-02-24T12:00:00+00:00
modified: 2021-12-21T12:00:00+00:00
broader: svømning
broad match: http://cv.iptc.org/newscodes/subjectcode/15062000

butterfly
type: Concept
definition: Svømmedisciplin, på maven hvor skuldrene forbliver parallelle med vandet og begge arme bevæger sig samtidigt over hovedet som en vindmølle. Benene forbliver sammen og bevæges i en klappende bevægelse op og ned. Den mest fysiske af alle stilarter.
in scheme: mediatopic
created: 2009-10-22T02:00:00+00:00
retired: 2015-02-24T12:00:00+00:00
modified: 2021-12-21T12:00:00+00:00
broader: svømning
broad match: http://cv.iptc.org/newscodes/subjectcode/15062000

freestyle (fri stil)
type: Concept
definition: Enhver svømmedisciplin kan anvendes i den frie stil, selvom crawl er universelt anvendt.
in scheme: mediatopic
created: 2009-10-22T02:00:00+00:00
retired: 2015-02-24T12:00:00+00:00
modified: 2021-12-21T12:00:00+00:00
broader: svømning

medley
type: Concept
definition: En kombination af fire forskellige svømmetyper i et løb.
in scheme: mediatopic
created: 2009-10-22T02:00:00+00:00
retired: 2015-02-24T12:00:00+00:00
modified: 2021-12-21T12:00:00+00:00
broader: svømning
broad match: http://cv.iptc.org/newscodes/subjectcode/15062000

åbent vand
type: Concept
definition: Langdistancesvømning i åbent vand.
in scheme: mediatopic
created: 2009-10-22T02:00:00+00:00
modified: 2021-07-12T12:00:00+00:00
broader: svømning
broad match: http://cv.iptc.org/newscodes/subjectcode/15062000

freestyle stafet
type: Concept
definition: Hold af svømmere, som svømmer en stafet i en svømmestil efter eget valg.
in scheme: mediatopic
created: 2009-10-22T02:00:00+00:00
retired: 2015-02-24T12:00:00+00:00
modified: 2021-12-21T12:00:00+00:00
broader: svømning
broad match: http://cv.iptc.org/newscodes/subjectcode/15062000

medley stafet
type: Concept
definition: Holdstafetløb, der involverer en kombination af fire forskellige svømmestile.
in scheme: mediatopic
created: 2009-10-22T02:00:00+00:00
retired: 2015-02-24T12:00:00+00:00
modified: 2021-12-21T12:00:00+00:00
broader: svømning
broad match: http://cv.iptc.org/newscodes/subjectcode/15062000

kortbane
type: Concept
definition: Svømmekonkurrence på en 25 meter lang kortbane.
in scheme: mediatopic
created: 2009-10-22T02:00:00+00:00
retired: 2015-02-24T12:00:00+00:00
modified: 2021-12-21T12:00:00+00:00
broader: svømning
broad match: http://cv.iptc.org/newscodes/subjectcode/15062000

synkronsvømning fri rutine
type: Concept
definition: Musiksvømning, hvor kunstneren udfører bevægelser til musik i fri stil og får point fra dommerne. Programmet er ikke forudbestemt.
in scheme: mediatopic
created: 2009-10-22T02:00:00+00:00
modified: 2021-02-18T12:00:00+00:00
broader: synkronsvømning

synkronsvømning teknisk rutine
type: Concept
definition: Figursvømning, hvor kunstneren skal udføre en bestemt række bevægelser og modtage point fra dommerne.
in scheme: mediatopic
created: 2009-10-22T02:00:00+00:00
modified: 2021-02-18T12:00:00+00:00
broader: synkronsvømning

taekwondo
type: Concept
definition: Kampsport med koreansk oprindelse. Deltagerne vil med spark og slag slå særligt markerede steder på modstanderen. Det er forbudt at slå og sparke på hovedet.
in scheme: mediatopic
created: 2009-10-22T02:00:00+00:00
modified: 2021-02-18T12:00:00+00:00
broader: kampsport

beachvolley
type: Concept
definition: Selve spillet er som volleyball, men spilles på sand med to personer på hvert hold.
in scheme: mediatopic
created: 2009-10-22T02:00:00+00:00
modified: 2021-02-18T12:00:00+00:00
broader: volleyball

stød
type: Concept
definition: Stangen løftes først op på skuldrene og løftes derefter over hovedet og holdes der i strakte arme, mens du holder benene stille.
in scheme: mediatopic
created: 2009-10-22T02:00:00+00:00
retired: 2017-07-04T12:00:00+00:00
modified: 2021-07-12T12:00:00+00:00
broader: vægtløftning

styrkeløft
type: Concept
definition: En styrketest, hvor konkurrenter løfter en så tung vægt som muligt.
in scheme: mediatopic
created: 2009-10-22T02:00:00+00:00
retired: 2017-07-04T12:00:00+00:00
modified: 2021-02-18T12:00:00+00:00
broader: vægtløftning

træk
type: Concept
definition: Stangen løftes fra gulvet til over hovedet i én bevægelse.
in scheme: mediatopic
created: 2009-10-22T02:00:00+00:00
retired: 2017-07-04T12:00:00+00:00
modified: 2021-07-12T12:00:00+00:00
broader: vægtløftning

fristilsbrydning
type: Concept
definition: En variant af brydning, hvor benene kan bruges.
in scheme: mediatopic
created: 2009-10-22T02:00:00+00:00
modified: 2021-02-18T12:00:00+00:00
broader: brydning

græsk-romersk brydning
type: Concept
definition: En variant af brydning, hvor man kun kan tage greb mellem talje og hoved.
in scheme: mediatopic
created: 2009-10-22T02:00:00+00:00
modified: 2021-02-18T12:00:00+00:00
broader: brydning

schweizisk brydning
type: Concept
definition: En schweizisk variant af brydning.
in scheme: mediatopic
created: 2009-10-22T02:00:00+00:00
modified: 2021-02-18T12:00:00+00:00
broader: brydning

wushu
type: Concept
definition: Kinesisk traditionel kampsport.
in scheme: mediatopic
created: 2009-10-22T02:00:00+00:00
modified: 2021-02-18T12:00:00+00:00
broader: kampsport

doping
type: Concept
definition: Ulovlig brug af stoffer for at øge præstationen i en sportsgren.
in scheme: mediatopic
created: 2009-10-22T02:00:00+00:00
retired: 2022-09-23T12:00:00+00:00
modified: 2022-09-23T12:00:00+00:00
broader: stofbrug i sport
broad match: http://cv.iptc.org/newscodes/subjectcode/15000000

dopingtest
type: Concept
definition: Test til undersøgelse af brugen af lovlige og ulovlige stoffer i sport.
in scheme: mediatopic
created: 2009-10-22T02:00:00+00:00
retired: 2022-09-23T12:00:00+00:00
modified: 2022-09-23T12:00:00+00:00
broader: stofbrug i sport
broad match: http://cv.iptc.org/newscodes/subjectcode/15000000

medicinsk stofbrug i sport
type: Concept
definition: Brug af godkendte lægemidler.
in scheme: mediatopic
created: 2009-10-22T02:00:00+00:00
retired: 2022-09-23T12:00:00+00:00
modified: 2022-09-23T12:00:00+00:00
broader: stofbrug i sport
broad match: http://cv.iptc.org/newscodes/subjectcode/15000000

kontinentalt mesterskab (EM)
type: Concept
definition: Mesterskaber, hvor atleter eller hold fra forskellige lande på et bestemt kontinent kan deltage.
in scheme: mediatopic
created: 2009-10-22T02:00:00+00:00
retired: 2021-12-17T12:00:00+00:00
modified: 2021-12-17T12:00:00+00:00
broader: sportsbegivenhed
broad match: http://cv.iptc.org/newscodes/subjectcode/15073028

kontinental pokalturnering
type: Concept
definition: Pokal, hvor atleter eller hold fra forskellige lande på et bestemt kontinent kan deltage.
in scheme: mediatopic
created: 2009-10-22T02:00:00+00:00
retired: 2021-12-17T12:00:00+00:00
modified: 2021-12-17T12:00:00+00:00
broader: sportsbegivenhed

kontinentale lege
type: Concept
definition: Konkurrence, hvor atleter eller hold fra forskellige lande på et bestemt kontinent kan deltage.
in scheme: mediatopic
created: 2009-10-22T02:00:00+00:00
retired: 2021-12-17T12:00:00+00:00
modified: 2021-12-17T12:00:00+00:00
broader: sportsbegivenhed
broad match: http://cv.iptc.org/newscodes/subjectcode/15073000

internationalt mesterskab
type: Concept
definition: Mesterskaber, hvor atleter eller hold fra forskellige lande kan deltage.
in scheme: mediatopic
created: 2009-10-22T02:00:00+00:00
retired: 2021-12-17T12:00:00+00:00
modified: 2021-12-17T12:00:00+00:00
broader: sportsbegivenhed
broad match: http://cv.iptc.org/newscodes/subjectcode/15073000

international pokal
type: Concept
definition: Pokal, hvor atleter eller hold fra forskellige lande kan deltage.
in scheme: mediatopic
created: 2009-10-22T02:00:00+00:00
retired: 2021-12-17T12:00:00+00:00
modified: 2021-12-17T12:00:00+00:00
broader: sportsbegivenhed

internationale lege
type: Concept
definition: Konkurrence, hvor atleter eller hold fra forskellige lande kan deltage.
in scheme: mediatopic
created: 2009-10-22T02:00:00+00:00
retired: 2021-12-17T12:00:00+00:00
modified: 2021-12-17T12:00:00+00:00
broader: sportsbegivenhed
broad match: http://cv.iptc.org/newscodes/subjectcode/15073000

nationalt mesterskab
type: Concept
definition: Mesterskaber, hvor atleter eller hold fra et bestemt land kan deltage.
in scheme: mediatopic
created: 2009-10-22T02:00:00+00:00
retired: 2021-12-17T12:00:00+00:00
modified: 2021-12-17T12:00:00+00:00
broader: sportsbegivenhed
broad match: http://cv.iptc.org/newscodes/subjectcode/15073000

national pokalturnering
type: Concept
definition: Pokal, hvor atleter eller hold fra et bestemt land kan deltage.
in scheme: mediatopic
created: 2009-10-22T02:00:00+00:00
retired: 2021-12-17T12:00:00+00:00
modified: 2021-12-17T12:00:00+00:00
broader: sportsbegivenhed

nationale lege
type: Concept
definition: Konkurrence, hvor atleter eller hold fra et bestemt land kan deltage.
in scheme: mediatopic
created: 2009-10-22T02:00:00+00:00
retired: 2021-12-17T12:00:00+00:00
modified: 2021-12-17T12:00:00+00:00
broader: sportsbegivenhed
broad match: http://cv.iptc.org/newscodes/subjectcode/15073000

regionalt mesterskab
type: Concept
definition: Mesterskaber, hvor atleter eller hold fra en bestemt del af landet kan deltage.
in scheme: mediatopic
created: 2009-10-22T02:00:00+00:00
retired: 2021-12-17T12:00:00+00:00
modified: 2021-12-17T12:00:00+00:00
broader: sportsbegivenhed

regional pokal
type: Concept
definition: Pokal, hvor atleter eller hold fra en bestemt del af landet kan deltage.
in scheme: mediatopic
created: 2009-10-22T02:00:00+00:00
retired: 2021-12-17T12:00:00+00:00
modified: 2021-12-17T12:00:00+00:00
broader: sportsbegivenhed

regionale lege
type: Concept
definition: Konkurrence, hvor atleter eller hold fra en bestemt del af landet kan deltage.
in scheme: mediatopic
created: 2009-10-22T02:00:00+00:00
retired: 2021-12-17T12:00:00+00:00
modified: 2021-12-17T12:00:00+00:00
broader: sportsbegivenhed
broad match: http://cv.iptc.org/newscodes/subjectcode/15073000

verdensmesterskab
type: Concept
definition: Mesterskaber, hvor atleter eller hold fra alle kontinenter kan deltage.
in scheme: mediatopic
created: 2009-10-22T02:00:00+00:00
retired: 2021-12-17T12:00:00+00:00
modified: 2021-12-17T12:00:00+00:00
broader: sportsbegivenhed

World Cup
type: Concept
definition: Pokal, hvor atleter eller hold fra alle kontinenter kan deltage.
in scheme: mediatopic
created: 2009-10-22T02:00:00+00:00
retired: 2021-12-17T12:00:00+00:00
modified: 2021-12-17T12:00:00+00:00
broader: sportsbegivenhed

verdenslege
type: Concept
definition: Konkurrence, hvor atleter eller hold fra alle kontinenter kan deltage.
in scheme: mediatopic
created: 2009-10-22T02:00:00+00:00
retired: 2021-12-17T12:00:00+00:00
modified: 2021-12-17T12:00:00+00:00
broader: sportsbegivenhed

Olympiske Lege (OL)
type: Concept
definition: Sportslege arrangeret af Den Internationale Olympiske Komité og afholdt hvert 4. år om sommeren eller vinteren.
in scheme: mediatopic
created: 2016-08-24T12:00:00+00:00
modified: 2021-12-17T12:00:00+00:00
broader: sportsbegivenhed

Paralympiske Lege
type: Concept
definition: Sportslege for handicappede atleter arrangeret af Den Internationale Paralympiske Komité og afholdt hvert 4. år om vinteren eller sommeren.
in scheme: mediatopic
created: 2016-08-24T12:00:00+00:00
modified: 2021-12-17T12:00:00+00:00
broader: sportsbegivenhed

http://cv.iptc.org/newscodes/mediatopic/20001341
type: Concept
in scheme: mediatopic
created: 2021-12-17T12:00:00+00:00
modified: 2021-12-21T12:00:00+00:00
broader: sportsbegivenhed

http://cv.iptc.org/newscodes/mediatopic/20001342
type: Concept
in scheme: mediatopic
created: 2021-12-17T12:00:00+00:00
modified: 2021-12-21T12:00:00+00:00
broader: sportsbegivenhed

http://cv.iptc.org/newscodes/mediatopic/20001343
type: Concept
in scheme: mediatopic
created: 2021-12-17T12:00:00+00:00
modified: 2021-12-21T12:00:00+00:00
broader: sportsbegivenhed

messe
type: Concept
definition: Større udstilling med bestemt type varer fra flere forskellige leverandører, normalt beregnet til detailhandlere.
in scheme: mediatopic
created: 2012-10-04T12:00:00+00:00
modified: 2023-03-31T12:00:00+00:00
broader: http://cv.iptc.org/newscodes/mediatopic/20001371

købsanbefaling
type: Concept
definition: En analytikers anbefaling om at købe en bestemt aktie
in scheme: mediatopic
created: 2012-10-04T12:00:00+00:00
retired: 2023-03-31T12:00:00+00:00
modified: 2023-03-31T12:00:00+00:00
broader: aktieanbefaling

holdanbefaling
type: Concept
definition: En analytikers anbefaling om at bevare en bestemt aktie.
in scheme: mediatopic
created: 2012-10-04T12:00:00+00:00
retired: 2023-03-31T12:00:00+00:00
modified: 2023-03-31T12:00:00+00:00
broader: aktieanbefaling

salgsanbefaling
type: Concept
definition: En analytikers anbefaling om at sælge en bestemt aktie.
in scheme: mediatopic
created: 2012-10-04T12:00:00+00:00
retired: 2023-03-31T12:00:00+00:00
modified: 2023-03-31T12:00:00+00:00
broader: aktieanbefaling

skateboarding
type: Concept
definition: Deltagerne bruger et skateboard (træplade med fire hjul) og udfører forskellige tricks på bane eller rampe.
in scheme: mediatopic
created: 2014-11-07T12:00:00+00:00
modified: 2021-07-12T12:00:00+00:00
broader: rullesport

mixed martial arts (MMA)
type: Concept
definition: En fuld kontaktkampsport ved hjælp af teknikker fra forskellige kampsportsdiscipliner, hvor stort set alt er tilladt. Foregår i et ottekantet bur.
in scheme: mediatopic
created: 2019-04-06T12:00:00+00:00
modified: 2021-07-12T12:00:00+00:00
broader: kampsport

krav maga
type: Concept
definition: Kampsport og selvforsvarsteknik, der indeholder elementer fra andre kampsportsgrene.
in scheme: mediatopic
created: 2021-02-18T12:00:00+00:00
modified: 2021-07-12T12:00:00+00:00
broader: kampsport

kickboksning
type: Concept
definition: En kampsport, der foregår i en boksering, hvor man både må slå og sparke.
in scheme: mediatopic
created: 2021-02-18T12:00:00+00:00
modified: 2021-07-12T12:00:00+00:00
broader: kampsport

sambo
type: Concept
definition: Sovjettisk kampsport, der minder om brydning.
in scheme: mediatopic
created: 2021-02-18T12:00:00+00:00
modified: 2021-07-12T12:00:00+00:00
broader: kampsport

kapitalforvaltning
type: Concept
definition: Tjenester til vækst af aktiver gennem investering i aktier, gensidige fonde og lignende.
in scheme: mediatopic
created: 2016-04-04T12:00:00+00:00
modified: 2023-03-31T12:00:00+00:00
broader: http://cv.iptc.org/newscodes/mediatopic/20001370

betalingstjeneste
type: Concept
definition: Tjenester til udførelse af betalinger inklusive kontanter, check, kreditkort, betalingskort, direkte debet, elektronisk pengeoverførsel, internetbank, elektronisk og mobil betaling.
in scheme: mediatopic
created: 2016-04-04T12:00:00+00:00
modified: 2023-03-31T12:00:00+00:00
broader: http://cv.iptc.org/newscodes/mediatopic/20001371

medicinsk udstyr
type: Concept
definition: Fremstilling af medicinske eller kirurgiske produkter, der anvendes til diagnose og behandling af syge.
in scheme: mediatopic
created: 2016-04-04T12:00:00+00:00
modified: 2023-03-31T12:00:00+00:00
broader: http://cv.iptc.org/newscodes/mediatopic/20001354

influencer
type: Concept
definition: Personer, der udgiver noget online, får mange tilhængere og dermed påvirker dem.
in scheme: mediatopic
created: 2019-04-06T12:00:00+00:00
modified: 2021-07-12T12:00:00+00:00
broader: socialt medie

træning og fitness
type: Concept
definition: Fysisk aktivitet, som har til formål at forbedre en persons fysiske tilstand, men også fungerer som adspredelse.
in scheme: mediatopic
created: 2019-06-26T12:00:00+00:00
modified: 2021-12-17T12:00:00+00:00
broader: http://cv.iptc.org/newscodes/mediatopic/20001339

fjernvarme og fjernkøling
type: Concept
definition: Levering af varme eller køling til private eller offentlige ejendomme.
in scheme: mediatopic
created: 2020-08-05T12:00:00+00:00
modified: 2023-03-31T12:00:00+00:00
broader: forsyningsvirksomheder

piercing
type: Concept
definition: En form for kropsudsmykning, hvor man gennemhuller eller skærer i dele af den menneskelige krop.
in scheme: mediatopic
created: 2019-07-30T12:00:00+00:00
modified: 2021-07-12T12:00:00+00:00
broader: kropsmodifikation

tatovering
type: Concept
definition: En form for kropsudsmykning, hvor man tilfører huden blæk med det formål at ændre dens farve permanent.
in scheme: mediatopic
created: 2019-07-30T12:00:00+00:00
modified: 2021-07-12T12:00:00+00:00
broader: kropsmodifikation

sportsrekord
type: Concept
definition: Den hidtil bedste præstation til dato blandt alle atleter eller hold.
in scheme: mediatopic
created: 2021-02-18T12:00:00+00:00
modified: 2022-09-23T12:00:00+00:00
broader: sportspræstation

sportsmedalje
type: Concept
definition: Æresbevisning eller hæder, som tildeles en atlet eller et hold , der har placeret sig blandt de bedste i en konkurrence.
in scheme: mediatopic
created: 2021-02-18T12:00:00+00:00
modified: 2022-09-23T12:00:00+00:00
broader: sportspræstation
broad match: Q15229207

sportskåring
type: Concept
definition: Æresbevisning eller hæder, som tildeles en atlet eller et hold på baggrund af dennes præstationer.
in scheme: mediatopic
created: 2021-02-18T12:00:00+00:00
modified: 2022-09-23T12:00:00+00:00
broader: sportspræstation

http://cv.iptc.org/newscodes/mediatopic/20001340
type: Concept
in scheme: mediatopic
created: 2021-12-17T12:00:00+00:00
modified: 2021-12-21T12:00:00+00:00
broader: http://cv.iptc.org/newscodes/mediatopic/20001339

http://cv.iptc.org/newscodes/mediatopic/20001378
type: Concept
in scheme: mediatopic
created: 2024-03-28T12:00:00+00:00
retired: 2024-07-01T12:00:00+00:00
modified: 2024-03-28T12:00:00+00:00
broader: http://cv.iptc.org/newscodes/mediatopic/20001377