mediatopic
type: ConceptScheme
pref scheme alias: medtop
authority: http://www.iptc.org
rights holder: IPTC, International Press Telecommunications Council - https://iptc.org
licence link: http://creativecommons.org/licenses/by/4.0/
date released: 2025-10-09T12:00:00+00:00
has top concept: Konst, kultur och nöje
has top concept: Brott, lag och rätt
has top concept: Katastrofer och olyckor
has top concept: Ekonomi, affärer, finans
has top concept: Utbildning
has top concept: Miljö och natur
has top concept: Medicin och hälsa
has top concept: Mänskligt
has top concept: Arbete
has top concept: Fritid och livsstil
has top concept: Politik och statsskick
has top concept: Religion
has top concept: Teknik och vetenskap
has top concept: Samhälle
has top concept: Sport
has top concept: Krig, konflikter och oroligheter
has top concept: Väder

Konst, kultur och nöje
type: Concept
definition: Ämnen som rör utveckling och förfining av det mänskliga medvetandet, av intressen, färdigheter, smak och känslor, inklusive sådant som språk, radio, och tv.
in scheme: mediatopic
created: 2009-10-22T02:00:00+00:00
modified: 2021-02-18T12:00:00+00:00
narrower: Konst och underhållning
narrower: Kultur
narrower: Massmedier

Konst och underhållning
type: Concept
definition: Alla former av konst och underhållning som inte hör till nöje.
in scheme: mediatopic
created: 2009-10-22T02:00:00+00:00
modified: 2021-02-18T12:00:00+00:00
broader: Konst, kultur och nöje
narrower: Animation
narrower: Serieteckningar
narrower: Film
narrower: Dans
narrower: Mode
narrower: Litteratur
narrower: Musik
narrower: Teater
narrower: Visuella konstformer
narrower: Serie
narrower: Festivaler
broad match: http://cv.iptc.org/newscodes/subjectcode/01000000

Kultur
type: Concept
definition: Gemensamma idéer, seder, traditioner och konst hos en grupp människor.
in scheme: mediatopic
created: 2009-10-22T02:00:00+00:00
modified: 2021-02-18T12:00:00+00:00
broader: Konst, kultur och nöje
narrower: Kulturhistoria
narrower: Seder och traditioner
narrower: Kulturell fest eller händelse
narrower: Språk
narrower: Bibliotek och museum
narrower: Kulturarv
narrower: Konstutställning

Massmedier
type: Concept
definition: Text, ljud och bild som satts ihop för att presenteras för en större publik.
in scheme: mediatopic
created: 2009-10-22T02:00:00+00:00
modified: 2021-02-18T12:00:00+00:00
broader: Konst, kultur och nöje
narrower: Nyhetsmedier
narrower: Tidningar
narrower: Internetmedier
narrower: Periodiska tidskrifter
narrower: Radio
narrower: Tv
narrower: Sociala medier
narrower: Desinformation

Brott, lag och rätt
type: Concept
definition: Etablering och/eller konstaterande av samhällets regler, dessa reglers genomförande, brott mot reglerna och bestraffning av förbrytarna. Organisationer och myndigheter inblandade i dessa aktiviteter. Brott, domstolsväsende, polis, straff, fängelse.
in scheme: mediatopic
created: 2009-10-22T02:00:00+00:00
modified: 2021-05-05T12:00:00+00:00
narrower: Brottslighet
narrower: Rättssystem
narrower: Rättvisa och rättigheter
narrower: Lag
narrower: Brottsbekämpning

Brottslighet
type: Concept
definition: När individer, företag eller organisationer bryter mot gällande lagar.
in scheme: mediatopic
created: 2009-10-22T02:00:00+00:00
modified: 2021-02-18T12:00:00+00:00
broader: Brott, lag och rätt
narrower: Folkmord
narrower: Anlagd brand
narrower: Överfall
narrower: IT-brott
narrower: Ekobrott
narrower: Korruption
narrower: Narkotikabrott
narrower: Bedrägeri
narrower: Kapning
narrower: Dråp
narrower: Kidnappning
narrower: Organiserad brottslighet
narrower: Terrorism
narrower: Stöld
narrower: Krigsbrott
narrower: Trafikbrott
narrower: Människosmuggling och trafficking
narrower: Vandalism
narrower: Skjutningar
narrower: Djurplågeri
narrower: Tortyr

Rättssystem
type: Concept
definition: De instanser i ett samhälle som bidrar till att upprätthålla lagen och straffa dem som bryter mot lagen.
in scheme: mediatopic
created: 2009-10-22T02:00:00+00:00
modified: 2021-02-18T12:00:00+00:00
broader: Brott, lag och rätt
narrower: Domstol
narrower: Förlikningar
narrower: Åtal

Rättvisa och rättigheter
type: Concept
definition: Att ett samhälle sköts så att medborgarna åtnjuter det som stadgas i landets lagar.
in scheme: mediatopic
created: 2009-10-22T02:00:00+00:00
retired: 2023-10-02T12:00:00+00:00
modified: 2023-10-02T12:00:00+00:00
broader: Brott, lag och rätt

Lag
type: Concept
definition: Regler som bestämts av ett lands lagstadgande instans.
in scheme: mediatopic
created: 2009-10-22T02:00:00+00:00
modified: 2021-02-18T12:00:00+00:00
broader: Brott, lag och rätt
narrower: Civilrätt
narrower: Brottsbalken
narrower: Internationell rätt
narrower: Förvaltningsrätt

Brottsbekämpning
type: Concept
definition: Olika aktiviteter för att minimera brottslighet.
in scheme: mediatopic
created: 2009-10-22T02:00:00+00:00
modified: 2021-02-18T12:00:00+00:00
broader: Brott, lag och rätt
narrower: Frihetsberövande
narrower: Förundersökning
narrower: Polis
narrower: Övervakning

Katastrofer och olyckor
type: Concept
definition: Naturliga eller av människan skapade händelser som orsakar död eller skada för människor eller skador på ting och egendomar.
in scheme: mediatopic
created: 2009-10-22T02:00:00+00:00
modified: 2021-05-05T12:00:00+00:00
narrower: Olyckor och akuta händelser
narrower: Katastrofer
narrower: http://cv.iptc.org/newscodes/mediatopic/20000160
narrower: Beredskapsplanering
narrower: Katastrofhjälp

Olyckor och akuta händelser
type: Concept
definition: Mer eller mindre akuta oönskade händelser.
in scheme: mediatopic
created: 2009-10-22T02:00:00+00:00
modified: 2021-02-18T12:00:00+00:00
broader: Katastrofer och olyckor
narrower: Explosioner
narrower: Arbetsplatsolyckor
narrower: Transportolyckor
narrower: Byggnadsolyckor
narrower: Drunkning

Katastrofer
type: Concept
definition: Mer allvarliga akuta oönskade händelser.
in scheme: mediatopic
created: 2009-10-22T02:00:00+00:00
modified: 2021-02-18T12:00:00+00:00
broader: Katastrofer och olyckor
narrower: Svält
narrower: Brand
narrower: Naturkatastrofer

http://cv.iptc.org/newscodes/mediatopic/20000160
type: Concept
in scheme: mediatopic
created: 2009-10-22T02:00:00+00:00
retired: 2015-08-27T12:00:00+00:00
modified: 2021-12-21T12:00:00+00:00
broader: Katastrofer och olyckor
narrower: http://cv.iptc.org/newscodes/mediatopic/20000162

Beredskapsplanering
type: Concept
definition: Planer för aktiviteter som vidtar vid plötsligt uppkomna krissituationer.
in scheme: mediatopic
created: 2009-10-22T02:00:00+00:00
retired: 2019-12-11T12:00:00+00:00
modified: 2021-02-18T12:00:00+00:00
broader: Katastrofer och olyckor

Katastrofhjälp
type: Concept
definition: Organisationer som har som syfte att hjälpa personer utan hem, mat och vatten vid plötsligt uppkomna krissituationer.
in scheme: mediatopic
created: 2009-10-22T02:00:00+00:00
modified: 2021-02-18T12:00:00+00:00
broader: Katastrofer och olyckor
broad match: http://cv.iptc.org/newscodes/subjectcode/03012000

Ekonomi, affärer, finans
type: Concept
definition: Allt som rör planering, produktion och utbyte av egendom. Jordbruk, dator- och IT-teknik, byggbransch och mark, energi och resurser, finans och affär, varutransport, makroekonomi, media, turism, transporter generellt.
in scheme: mediatopic
created: 2009-10-22T02:00:00+00:00
modified: 2021-07-12T12:00:00+00:00
narrower: Företagsinformation
narrower: Näringsliv
narrower: Ekonomi
narrower: Företag
narrower: Marknader och börser

Företagsinformation
type: Concept
definition: Information om enskilda företag, stiftelser, ekonomiska föreningar med mera.
in scheme: mediatopic
created: 2009-10-22T02:00:00+00:00
modified: 2021-05-05T12:00:00+00:00
broader: Ekonomi, affärer, finans
narrower: Företagsekonomi
narrower: Nyemissioner
narrower: Personal
narrower: Marknadsföringsstrategi
narrower: Bolagsstyrning
narrower: Delårsrapport
narrower: Företagsombildning

Näringsliv
type: Concept
definition: Gruppering av ekonomiska aktiviteter indelade efter produkter eller tjänster.
in scheme: mediatopic
created: 2009-10-22T02:00:00+00:00
modified: 2023-03-31T12:00:00+00:00
broader: Ekonomi, affärer, finans
narrower: Naturbruk
narrower: Fiskerinäring
narrower: Skogsbruk
narrower: Kemisk industri
narrower: Plaster och syntetiska kemikalier
narrower: Informationsteknologi
narrower: Fastighets- och byggnadsindustri
narrower: Konsumentvaror
narrower: Energi och naturtillgångar
narrower: Finans- och affärstjänster
narrower: Verkstadsindustri
narrower: Medier
narrower: Metaller och mineraler
narrower: Processindustri
narrower: Turistindustri
narrower: Transport
narrower: Samhällsservice
narrower: Försäljningskanaler
narrower: Hälsovårdsproduktion
narrower: Finansiella tjänster
narrower: Företagsservice
broad match: http://cv.iptc.org/newscodes/subjectcode/04000000

Ekonomi
type: Concept
definition: Saker som rör handel och ekonomin.
in scheme: mediatopic
created: 2009-10-22T02:00:00+00:00
modified: 2024-03-28T12:00:00+00:00
broader: Ekonomi, affärer, finans
narrower: Makroekonomi
narrower: Centralbanker
narrower: Valutor
narrower: Branschorganisationer
narrower: Tillväxtmarknad
narrower: Internationella ekonomiska organisationer
narrower: Internationell handel
narrower: Penningpolitik
narrower: Fonder
narrower: Delningsekonomi

Företag
type: Concept
definition: Självständig ekonomisk organisation för produktion av varor eller tjänster för vinnings skull.
in scheme: mediatopic
created: 2009-10-22T02:00:00+00:00
modified: 2024-03-28T12:00:00+00:00
broader: Ekonomi, affärer, finans
narrower: Entreprenörskap
narrower: Små och medelstora företag
narrower: Kooperativ

Marknader och börser
type: Concept
definition: Organiserad handel med aktier, valutor, råvaror med mera.
in scheme: mediatopic
created: 2009-10-22T02:00:00+00:00
modified: 2024-03-28T12:00:00+00:00
broader: Ekonomi, affärer, finans
narrower: Råvarumarknad
narrower: Obligationsmarknad
narrower: Valutamarknad
narrower: Lånemarknad

Utbildning
type: Concept
definition: Allt som rör mänskligt lärande från födsel till död. Vuxenutbildning, vidareutbildning, föräldraorganisationer, förskolor, skolor, lärarfack, universitet, etc.
in scheme: mediatopic
created: 2009-10-22T02:00:00+00:00
modified: 2021-09-30T12:00:00+00:00
narrower: Föräldraföreningar
narrower: Religiös utbildning
narrower: Skola
narrower: Uppfostran
narrower: Undervisning och lärande
narrower: Läroplan
narrower: Prov
narrower: Antagningsprov
narrower: Elever
narrower: Lärare
narrower: Yrkesutbildning
narrower: Betyg
narrower: Distansundervisning

Föräldraföreningar
type: Concept
definition: Förskola som startats av en föräldraförening och sköts genom en, av denna, vald styrelse.
in scheme: mediatopic
created: 2009-10-22T02:00:00+00:00
modified: 2021-09-30T12:00:00+00:00
broader: Utbildning

Religiös utbildning
type: Concept
definition: Förmedling av kunskaper om en religion, vanligtvis, men inte alltid, i skolor som drivs av religiösa organisationer.
in scheme: mediatopic
created: 2009-10-22T02:00:00+00:00
modified: 2021-09-30T12:00:00+00:00
broader: Utbildning

Skola
type: Concept
definition: Institution där undervisning bedrivs.
in scheme: mediatopic
created: 2009-10-22T02:00:00+00:00
modified: 2021-09-30T12:00:00+00:00
broader: Utbildning
narrower: Låg- och mellanstadium
narrower: Vidareutbildning
narrower: Vuxenutbildning
narrower: Gymnasium
narrower: Högre utbildning
narrower: Högstadium
narrower: Förskola
narrower: Religiösa skolor
narrower: Kommunal skola
narrower: Privatskola
narrower: Friskola

Uppfostran
type: Concept
definition: Överföring av normer och värderingar från en generation till nästa.
in scheme: mediatopic
created: 2009-10-22T02:00:00+00:00
modified: 2024-07-01T12:00:00+00:00
broader: Utbildning
broad match: http://cv.iptc.org/newscodes/subjectcode/05008000

Undervisning och lärande
type: Concept
definition: Förmedling av kunskaper i organiserad form och på systematiskt sätt, särskilt i skola, och mottagandet av denna förmedling.
in scheme: mediatopic
created: 2009-10-22T02:00:00+00:00
retired: 2021-09-30T12:00:00+00:00
modified: 2021-09-30T12:00:00+00:00
broader: Utbildning

Läroplan
type: Concept
definition: Övergripande anvisningar om skolundervisningens innehåll, mål och metoder.
in scheme: mediatopic
created: 2009-10-22T02:00:00+00:00
modified: 2021-09-30T12:00:00+00:00
broader: Utbildning

Prov
type: Concept
definition: Formell utfrågning för fastställande av en elevs kunskapsnivå.
in scheme: mediatopic
created: 2009-10-22T02:00:00+00:00
modified: 2021-09-30T12:00:00+00:00
broader: Utbildning
broad match: http://cv.iptc.org/newscodes/subjectcode/05010004

Antagningsprov
type: Concept
definition: Tester för att komma in på olika utbildningar.
in scheme: mediatopic
created: 2009-10-22T02:00:00+00:00
modified: 2021-09-30T12:00:00+00:00
broader: Utbildning

Elever
type: Concept
definition: Person som får undervisning.
in scheme: mediatopic
created: 2009-10-22T02:00:00+00:00
modified: 2021-09-30T12:00:00+00:00
broader: Utbildning

Lärare
type: Concept
definition: Person som yrkesmässigt ägnar sig åt undervisning, mest i skola eller under skolliknande former.
in scheme: mediatopic
created: 2009-10-22T02:00:00+00:00
modified: 2021-09-30T12:00:00+00:00
broader: Utbildning

Yrkesutbildning
type: Concept
definition: Utbildning som är planerad och genomförs för att ge de studerande kunskaper att direkt kunna utföra ett specifikt yrke.
in scheme: mediatopic
created: 2019-04-06T12:00:00+00:00
modified: 2021-09-30T12:00:00+00:00
broader: Utbildning

Betyg
type: Concept
definition: Värdera elevers kunskaper i olika ämnen efter det system och mätmetoder som gäller. Vanligt förekommande är bokstäver eller siffror.
in scheme: mediatopic
created: 2019-04-06T12:00:00+00:00
modified: 2021-09-30T12:00:00+00:00
broader: Utbildning

Distansundervisning
type: Concept
definition: Former av utbildning där läraren och eleven befinner sig på olika platser. Kan ske synkront med digitala hjälpmedel eller asynkront med inspelat eller förberett material.
in scheme: mediatopic
created: 2021-09-30T12:00:00+00:00
modified: 2021-12-21T12:00:00+00:00
broader: Utbildning

Miljö och natur
type: Concept
definition: Alla aspekter av skydd, skador och hälsa hos planetens ekosystem, med omnejd. Alternativa energikällor, bevarande av arter, energisparande, miljöpolitik, miljöförstöring, naturtillgångar, naturen, befolkningsfrågor, avfall, vattentillgångar.
in scheme: mediatopic
created: 2009-10-22T02:00:00+00:00
modified: 2025-10-09T12:00:00+00:00
narrower: Klimatförändringar
narrower: Naturvård
narrower: Föroreningar
narrower: Naturresurser
narrower: Natur
narrower: Hållbarhet

Klimatförändringar
type: Concept
definition: Förändring hos klimatet (temperatur, nederbörd, vind) på en enstaka plats, i en region eller på jorden som helhet, över en längre period.
in scheme: mediatopic
created: 2009-10-22T02:00:00+00:00
modified: 2025-06-30T12:00:00+00:00
broader: Miljö och natur
narrower: Global uppvärmning

Naturvård
type: Concept
definition: Förebyggande skydd och vård av naturen.
in scheme: mediatopic
created: 2009-10-22T02:00:00+00:00
modified: 2025-06-30T12:00:00+00:00
broader: Miljö och natur
narrower: Energibesparing
narrower: Nationalparker och naturreservat

Föroreningar
type: Concept
definition: Ämnen som blivit över när man framställt något eller använt det och som sprids där man inte vill ha det, i vatten, mark och luft.
in scheme: mediatopic
created: 2009-10-22T02:00:00+00:00
modified: 2025-10-09T12:00:00+00:00
broader: Miljö och natur
narrower: Luftföroreningar
narrower: Miljösanering
narrower: Farligt avfall
narrower: Avfall
narrower: Vattenföroreningar

Naturresurser
type: Concept
definition: Miljöfrågor som rör användbara tillgångar i naturen.
in scheme: mediatopic
created: 2009-10-22T02:00:00+00:00
modified: 2025-06-30T12:00:00+00:00
broader: Miljö och natur
narrower: Energiresurser
narrower: Landresurser
narrower: Befolkningstillväxt
narrower: Förnybar energi
narrower: Vatten

Natur
type: Concept
definition: Allt som har med den naturliga världen att göra.
in scheme: mediatopic
created: 2009-10-22T02:00:00+00:00
modified: 2025-10-09T12:00:00+00:00
broader: Miljö och natur
narrower: Skogar
narrower: Berg
narrower: Hav
narrower: Floder, älvar och åar
narrower: Våtmarker
narrower: Ekosystem
narrower: Utrotningshotade arter
narrower: Invasiva arter
narrower: Djur
narrower: Växter

Hållbarhet
type: Concept
definition: Åtgärder av företag, myndigheter och personer för att motverka miljöförstöring, klimatförändring och liknande.
in scheme: mediatopic
created: 2023-10-02T12:00:00+00:00
modified: 2025-10-09T12:00:00+00:00
broader: Miljö och natur

Medicin och hälsa
type: Concept
definition: Ämnen som rör människors fysiska och mentala hälsa.
in scheme: mediatopic
created: 2009-10-22T02:00:00+00:00
modified: 2022-06-14T12:00:00+00:00
narrower: Sjukdomar och sjukdomstillstånd
narrower: Vårdinrättningar
narrower: Hälsovårdsorganisationer
narrower: Behandlingar
narrower: Offentlig sjukvård
narrower: Sjukförsäkringar
narrower: Privat sjukvård
narrower: Vårdyrken
narrower: Icke-mänskliga sjukdomar
narrower: Folkhälsa

Sjukdomar och sjukdomstillstånd
type: Concept
definition: Alla skadliga eller destruktiva hälsotillstånd som påverkar människor.
in scheme: mediatopic
created: 2009-10-22T02:00:00+00:00
modified: 2022-06-14T12:00:00+00:00
broader: Medicin och hälsa
narrower: Cancer
narrower: Smittsamma sjukdomar
narrower: Hjärt- och kärlsjukdomar
narrower: Åkommor
narrower: Kroppsskador
narrower: Medicinska tillstånd
narrower: Psykisk ohälsa
narrower: Förgiftning
narrower: Funktionsnedsättning
broad match: http://cv.iptc.org/newscodes/subjectcode/07001000

Vårdinrättningar
type: Concept
definition: Inrättningar som används för alla former av hälso- och sjukvård.
in scheme: mediatopic
created: 2009-10-22T02:00:00+00:00
modified: 2022-06-14T12:00:00+00:00
broader: Medicin och hälsa
narrower: Sjukhus och kliniker
narrower: Primärvård
broad match: http://cv.iptc.org/newscodes/subjectcode/07010000

Hälsovårdsorganisationer
type: Concept
definition: Specifika organsationer inriktade på hälso- och sjukvård, såsom yrkesorganisationer och internationella grupperingar.
in scheme: mediatopic
created: 2009-10-22T02:00:00+00:00
modified: 2022-06-14T12:00:00+00:00
broader: Medicin och hälsa

Behandlingar
type: Concept
definition: Aktiv vård av människa som lider av sjukdom.
in scheme: mediatopic
created: 2009-10-22T02:00:00+00:00
modified: 2022-06-14T12:00:00+00:00
broader: Medicin och hälsa
narrower: Diet
narrower: Mediciner
narrower: Receptbelagda mediciner
narrower: Medicinska tester
narrower: Medicin
narrower: Fysisk kondition
narrower: Förebyggande medicin
narrower: Vacciner
narrower: Terapi
narrower: Missbruksvård
narrower: Akutsjukvård
narrower: Kirurgi (ingrepp)

Offentlig sjukvård
type: Concept
definition: Sjukvård som tillhandahålles av staten.
in scheme: mediatopic
created: 2009-10-22T02:00:00+00:00
modified: 2022-06-14T12:00:00+00:00
broader: Medicin och hälsa
narrower: Medicaid
narrower: Medicare

Sjukförsäkringar
type: Concept
definition: Privat försäkring som vid sjukdom och olycksfall ger ersättning för kostnader som läkararvoden, sjukhusvård, operation med mera.
in scheme: mediatopic
created: 2009-10-22T02:00:00+00:00
modified: 2022-06-14T12:00:00+00:00
broader: Medicin och hälsa

Privat sjukvård
type: Concept
definition: Sjukvård som tillhandahålles av privat finansierade eller försäkrade organisationer.
in scheme: mediatopic
created: 2009-10-22T02:00:00+00:00
modified: 2022-06-14T12:00:00+00:00
broader: Medicin och hälsa

Vårdyrken
type: Concept
definition: Profession som kräver formell träning i studiet, diagnosticeringen, behandlingen och förebyggandet av sjukdom eller skada.
in scheme: mediatopic
created: 2009-10-22T02:00:00+00:00
modified: 2022-06-14T12:00:00+00:00
broader: Medicin och hälsa
narrower: Medicinska hjälpmedel
narrower: Medicinsk specialisering
narrower: Sjukvårdspersonal
broad match: http://cv.iptc.org/newscodes/subjectcode/07006000

Icke-mänskliga sjukdomar
type: Concept
definition: Skadliga eller destruktiva hälsotillstånd som drabbar djur, växter och mikroorganismer.
in scheme: mediatopic
created: 2009-10-22T02:00:00+00:00
retired: 2022-06-14T12:00:00+00:00
modified: 2022-06-14T12:00:00+00:00
broader: Medicin och hälsa
broad match: http://cv.iptc.org/newscodes/subjectcode/07001000

Folkhälsa
type: Concept
definition: Offentliga eller privat organiserade åtgärder för att förebygga sjukdomar, förbättra hälsan och öka livslängden hos befolkningen.
in scheme: mediatopic
created: 2022-06-14T12:00:00+00:00
modified: 2022-06-14T12:00:00+00:00
broader: Medicin och hälsa

Mänskligt
type: Concept
definition: Lättare berättelser om individer, grupper av människor, djur eller ting.
in scheme: mediatopic
created: 2009-10-22T02:00:00+00:00
modified: 2021-05-05T12:00:00+00:00
narrower: Prestationer
narrower: Utmärkelser och priser
narrower: Rekord
narrower: Ceremonier
narrower: Människor
narrower: Mänsklig olycka
narrower: Societeten
narrower: Kändisar
narrower: Jubileum
narrower: Födelsedag

Prestationer
type: Concept
definition: Bedrift av person eller grupp, djur, växter eller andra objekt, t ex att vinna en tävling.
in scheme: mediatopic
created: 2009-10-22T02:00:00+00:00
retired: 2021-05-05T12:00:00+00:00
modified: 2021-05-05T12:00:00+00:00
broader: Mänskligt

Utmärkelser och priser
type: Concept
definition: Hedersbetygelser och belöning för viss prestation, inklusive sådana utdelade av staten.
in scheme: mediatopic
created: 2009-10-22T02:00:00+00:00
modified: 2021-05-05T12:00:00+00:00
broader: Mänskligt

Rekord
type: Concept
definition: Resultat som överträffar tidigare presterade och som oftast kan anges i siffror, men som inte har med sport att göra.
in scheme: mediatopic
created: 2009-10-22T02:00:00+00:00
modified: 2021-05-05T12:00:00+00:00
broader: Mänskligt

Ceremonier
type: Concept
definition: Icke-religiösa ritualer såsom kransnedläggning, skeppsdop och liknande.
in scheme: mediatopic
created: 2009-10-22T02:00:00+00:00
modified: 2021-05-05T12:00:00+00:00
broader: Mänskligt
narrower: Namngivning
narrower: Examen & student
narrower: Begravning
narrower: Bröllop

Människor
type: Concept
definition: Nyheter om individer eller grupper av människor där fokus ligger på känslomässiga saker.
in scheme: mediatopic
created: 2009-10-22T02:00:00+00:00
retired: 2021-05-05T12:00:00+00:00
modified: 2021-02-18T12:00:00+00:00
broader: Mänskligt

Mänsklig olycka
type: Concept
definition: Dumma mänskliga misstag.
in scheme: mediatopic
created: 2009-10-22T02:00:00+00:00
modified: 2021-05-12T12:00:00+00:00
broader: Mänskligt

Societeten
type: Concept
definition: Nyheter om och beskrivningar av den högsta samhällsklassen, framför allt dess sällskapsliv.
in scheme: mediatopic
created: 2009-10-22T02:00:00+00:00
modified: 2021-05-05T12:00:00+00:00
broader: Mänskligt
narrower: Kungligt

Kändisar
type: Concept
definition: Nyheter om och beskrivningar av kända människor.
in scheme: mediatopic
created: 2009-10-22T02:00:00+00:00
modified: 2021-05-05T12:00:00+00:00
broader: Mänskligt

Jubileum
type: Concept
definition: Årsdag av en persons födelse, eller åminnelse av en händelse vid något intervall, typ 50 år sedan eller 75 år sedan
in scheme: mediatopic
created: 2019-06-26T12:00:00+00:00
modified: 2021-07-12T12:00:00+00:00
broader: Mänskligt

Födelsedag
type: Concept
definition: Årsdag av en persons födelse.
in scheme: mediatopic
created: 2019-06-26T12:00:00+00:00
modified: 2021-07-12T12:00:00+00:00
broader: Mänskligt

Arbete
type: Concept
definition: Sociala aspekter, organisationer, regler och förhållanden kring mänskliga ansträngningar för att generera inkomst, eller förse med service, samt ekonomisk ersättning till arbetslösa. Fackliga frågor, arbetslagstiftning, pensioner, arbetslöshet mm.
in scheme: mediatopic
created: 2009-10-22T02:00:00+00:00
modified: 2021-02-18T12:00:00+00:00
narrower: Anställning
narrower: Arbetsrätt
narrower: Arbetsmarknad
narrower: Anställningsförhållanden
narrower: Pensionstiden
narrower: Arbetslöshet
narrower: Fackföreningar

Anställning
type: Concept
definition: En avtalad rättighet för någon att mot betalning utföra vissa arbetsuppgifter för arbetsgivare under kortare eller vanligen under längre tid.
in scheme: mediatopic
created: 2009-10-22T02:00:00+00:00
modified: 2021-02-18T12:00:00+00:00
broader: Arbete
narrower: Pendling
narrower: Lärlingar
narrower: Barnarbete
narrower: Arbetstagare
narrower: Arbetsgivare
narrower: Yrkesträning
narrower: Yrken
narrower: Löner och förmåner
narrower: Egenföretagande
narrower: Föräldraledighet
narrower: Ideellt arbete

Arbetsrätt
type: Concept
definition: Rättsregler som berör förhållandet mellan arbetstagare och arbetsgivare.
in scheme: mediatopic
created: 2009-10-22T02:00:00+00:00
modified: 2021-02-18T12:00:00+00:00
broader: Arbete
narrower: Arbetsmiljöfrågor
broad match: http://cv.iptc.org/newscodes/subjectcode/09005000

Arbetsmarknad
type: Concept
definition: Den marknad där arbetsgivarna efterfrågar arbetskraft mot betalning, och där individerna utbjuder arbetskraft mot erhållande av lön.
in scheme: mediatopic
created: 2009-10-22T02:00:00+00:00
modified: 2021-02-18T12:00:00+00:00
broader: Arbete
narrower: Gig-ekonomi

Anställningsförhållanden
type: Concept
definition: Förhandlingar mellan arbetsgivare och arbetstagare.
in scheme: mediatopic
created: 2009-10-22T02:00:00+00:00
modified: 2021-02-18T12:00:00+00:00
broader: Arbete
narrower: Kollektivavtal
narrower: Arbetskonflikt
broad match: http://cv.iptc.org/newscodes/subjectcode/09012000

Pensionstiden
type: Concept
definition: Åren efter arbetslivet.
in scheme: mediatopic
created: 2009-10-22T02:00:00+00:00
modified: 2021-02-18T12:00:00+00:00
broader: Arbete
narrower: Pensions

Arbetslöshet
type: Concept
definition: Förhållande som råder när personer kan och vill arbeta och är aktivt arbetssökande men inte finner arbete.
in scheme: mediatopic
created: 2009-10-22T02:00:00+00:00
modified: 2021-02-18T12:00:00+00:00
broader: Arbete
narrower: Uppsägningar
narrower: Arbetslöshetsersättning

Fackföreningar
type: Concept
definition: Sammanslutning av löntagare i syfte att tillvarata deras intressen och därmed utgöra motpart till arbetsgivare, på lokal eller riksomfattande nivå
in scheme: mediatopic
created: 2009-10-22T02:00:00+00:00
modified: 2021-02-18T12:00:00+00:00
broader: Arbete

Fritid och livsstil
type: Concept
definition: Aktiviteter ägnade att ge njutning, avslappning, rekreation utanför betald arbetstid, inklusive mat och resor. Spel, tips och lotterier, gastronomi, hobbyer, semester, turism.
in scheme: mediatopic
created: 2009-10-22T02:00:00+00:00
modified: 2021-05-05T12:00:00+00:00
narrower: Fritid
narrower: Livsstil
narrower: Friskvård

Fritid
type: Concept
definition: Aktiviteter som utförs under en persons fritid och utan organiserade tävlingsinslag.
in scheme: mediatopic
created: 2009-10-22T02:00:00+00:00
modified: 2021-02-18T12:00:00+00:00
broader: Fritid och livsstil
narrower: Klubbar och föreningar
narrower: Spel
narrower: Spel och lotteri
narrower: Hobby
narrower: Semester
narrower: Nöjeslokal
narrower: Fritidsaktiviteter
narrower: Resor
broad match: http://cv.iptc.org/newscodes/subjectcode/10010000

Livsstil
type: Concept
definition: Yttre sätt att leva sitt liv.
in scheme: mediatopic
created: 2009-10-22T02:00:00+00:00
modified: 2021-02-18T12:00:00+00:00
broader: Fritid och livsstil
narrower: Ekologisk mat
narrower: Hem och trädgård
narrower: Trender
narrower: Fester
narrower: http://cv.iptc.org/newscodes/mediatopic/20001391
broad match: http://cv.iptc.org/newscodes/subjectcode/10000000

Friskvård
type: Concept
definition: Att aktivt arbeta för att förbättra bra mental och fysisk hälsa.
in scheme: mediatopic
created: 2021-12-17T12:00:00+00:00
modified: 2021-12-21T12:00:00+00:00
broader: Fritid och livsstil
narrower: Motion & hälsa
narrower: Mentalt välbefinnande

Politik och statsskick
type: Concept
definition: Politiskt arbete och maktutövning på alla nivåer, samt relationer mellan stater och regeringar.
in scheme: mediatopic
created: 2009-10-22T02:00:00+00:00
modified: 2025-03-31T12:00:00+00:00
narrower: Val
narrower: Regering och riksdag
narrower: Regeringsförklaring
narrower: Internationella relationer
narrower: Icke-statlig organisation (NGO)
narrower: Politiska kriser
narrower: Politiska fångar och dissidenter
narrower: Politiska processer

Val
type: Concept
definition: Valet av politiska företrädare genom avgivandet av röster av befolkningen
in scheme: mediatopic
created: 2009-10-22T02:00:00+00:00
modified: 2024-09-26T12:00:00+00:00
broader: Politik och statsskick
narrower: Medborgarinitiativ
narrower: Valsystem
narrower: Mellanstatliga val
narrower: Lokalval
narrower: Nationella val
narrower: Politiska kampanjer
narrower: Kampanjbidrag
narrower: Politiska kandidater
narrower: Primärval
narrower: Folkomröstning
narrower: Regionala val
narrower: Röstning
narrower: Kyrkoval
narrower: Politiska debatter
narrower: Fyllnadsval
narrower: Misstroendevotum
narrower: Koalition

Regering och riksdag
type: Concept
definition: Systemet för att styra ett land.
in scheme: mediatopic
created: 2009-10-22T02:00:00+00:00
modified: 2025-03-31T12:00:00+00:00
broader: Politik och statsskick
narrower: Offentlig verksamhet
narrower: Offentliganställd
narrower: Förtroendevald
narrower: Grundlag
narrower: Nationell säkerhet
narrower: Verkställande statsmakt
narrower: Statsbudget
narrower: Departement
narrower: Statschef
narrower: Riksrättsförfarande
narrower: Lokala myndigheter
narrower: Minister eller statsråd
narrower: Regeringen
narrower: Riksdagen
narrower: Regional myndighet
narrower: Lobbyverksamhet
narrower: Politiska partier och rörelser
narrower: Politisk utveckling
narrower: Politiska system
narrower: Tillsynsmyndigheter
narrower: Partikongress
narrower: Politisk kommitté
narrower: Regeringschef
narrower: Offentlig utredning
narrower: Politiskt ledarskap
narrower: http://cv.iptc.org/newscodes/mediatopic/20001384
narrower: http://cv.iptc.org/newscodes/mediatopic/20001385

Regeringsförklaring
type: Concept
definition: Den plan och inriktning som en regering har för att påverka och styra beslut och åtgärder mot ett önskat resultat.
in scheme: mediatopic
created: 2009-10-22T02:00:00+00:00
modified: 2025-03-31T12:00:00+00:00
broader: Politik och statsskick
narrower: Ekonomisk politik
narrower: Miljöpolitik
narrower: Hälso- och sjukvårdspolitik
narrower: Medborgerlig säkerhet
narrower: Skattepolitik
narrower: Inrikespolitik
narrower: Datasäkerhetspolitik
narrower: Bostadspolitik och stadsplanering
narrower: Minoritetspolitik
narrower: Social välfärd
narrower: Persondatalagstiftning
narrower: Vapenlagstiftning
narrower: Byggprojektering
narrower: Migrationspolitik
narrower: Kärnkraftspolitik
narrower: Branschlagstiftning
narrower: Kulturpolitik
narrower: Integrationspolitik
narrower: Idrottspolitik
narrower: Regionalpolitik
narrower: Infrastrukturpolitik
narrower: Lokalpolitik
narrower: Utbildningspolitik
narrower: http://cv.iptc.org/newscodes/mediatopic/20001383
broad match: http://cv.iptc.org/newscodes/subjectcode/11006000

Internationella relationer
type: Concept
definition: Staters utrikespolitik och ömsesidiga relationer, t ex förhandlingar, avtal och diplomati.
in scheme: mediatopic
created: 2009-10-22T02:00:00+00:00
modified: 2025-03-31T12:00:00+00:00
broader: Politik och statsskick
narrower: Diplomati
narrower: Ekonomiska sanktioner
narrower: Utlandsbistånd
narrower: Internationella organisation
narrower: Flykting
narrower: Gränskonflikt

Icke-statlig organisation (NGO)
type: Concept
definition: Organisation eller grupp som fristående från staten och myndigheter utför arbete och agerar i allmänhetens intresse.
in scheme: mediatopic
created: 2009-10-22T02:00:00+00:00
modified: 2025-03-31T12:00:00+00:00
broader: Politik och statsskick

Politiska kriser
type: Concept
definition: Konflikter som når nivåer där regeringar kan avsättas.
in scheme: mediatopic
created: 2009-10-22T02:00:00+00:00
retired: 2025-03-31T12:00:00+00:00
modified: 2025-03-31T12:00:00+00:00
broader: Politik och statsskick
broad match: http://cv.iptc.org/newscodes/subjectcode/16011000

Politiska fångar och dissidenter
type: Concept
definition: Personer med åsikter som avviker från de av staten förhärskande samt de som fängslats utifrån att de uttryckt oppositionella åsikter.
in scheme: mediatopic
created: 2009-10-22T02:00:00+00:00
modified: 2025-03-31T12:00:00+00:00
broader: Politik och statsskick

Politiska processer
type: Concept
definition: Deltagande i driften av en regering, en stat eller ett politiskt parti.
in scheme: mediatopic
created: 2009-10-22T02:00:00+00:00
retired: 2025-03-31T12:00:00+00:00
modified: 2025-03-31T12:00:00+00:00
broader: Politik och statsskick

Religion
type: Concept
definition: Allt som rör den mänskliga existensen i förhållande till teologi, filosofi, etik och andlighet. Sekter, tro, frimurare, kyrkliga och religiösa organisationer.
in scheme: mediatopic
created: 2009-10-22T02:00:00+00:00
modified: 2021-12-21T12:00:00+00:00
narrower: Religiös tro
narrower: Interreligiös dialog
narrower: Religiösa konflikter
narrower: Religiösa händelser
narrower: Religiösa högtider
narrower: Religiösa ritualer
narrower: Religiösa byggnader
narrower: Relation mellan stat och religiösa institutioner
narrower: Religiösa ledare
narrower: Religiösa texter

Religiös tro
type: Concept
definition: Tro är ofta ett grundelement i det religiösa livet som innebär att föreställningar om det transcendentala erkänns som sanna, dels tillit till en eller flera gudar.
in scheme: mediatopic
created: 2009-10-22T02:00:00+00:00
modified: 2021-12-21T12:00:00+00:00
broader: Religion
narrower: Buddhism
narrower: Kristendom
narrower: Konfucianism
narrower: Kulter och sekter
narrower: Frimureri
narrower: Hinduism
narrower: Islam
narrower: Jainism
narrower: Judendom
narrower: Naturreligioner
narrower: Zoroastrism
narrower: Scientologi
narrower: Shintoism
narrower: Sikhism
narrower: Daoism
narrower: Moonrörelsen
narrower: Atheism och Agnosticism

Interreligiös dialog
type: Concept
definition: Alla former av kommunikation mellan olika religioner.
in scheme: mediatopic
created: 2009-10-22T02:00:00+00:00
retired: 2021-12-17T12:00:00+00:00
modified: 2021-02-18T12:00:00+00:00
broader: Religion

Religiösa konflikter
type: Concept
definition: Konflikter som blandar in religiösa meningsskiljaktigheter.
in scheme: mediatopic
created: 2009-10-22T02:00:00+00:00
modified: 2021-02-18T12:00:00+00:00
broader: Religion

Religiösa händelser
type: Concept
definition: Händelser som berör en religion, men inte religiösa högtider.
in scheme: mediatopic
created: 2009-10-22T02:00:00+00:00
retired: 2021-12-17T12:00:00+00:00
modified: 2021-07-12T12:00:00+00:00
broader: Religion

Religiösa högtider
type: Concept
definition: Helig eller högtidlighållen dag inom en religion, som ibland också är en allmän helgdag.
in scheme: mediatopic
created: 2009-10-22T02:00:00+00:00
modified: 2021-12-17T12:00:00+00:00
broader: Religion
narrower: Jul
narrower: Påsk
narrower: Pingst
narrower: Ramadan
narrower: Jom kippur
narrower: Alla helgons dag
narrower: Sista april
narrower: Eid al-Adha
narrower: Chanukka

Religiösa ritualer
type: Concept
definition: Etablerade religösa riter, såsom mässa, dop och bönemöten.
in scheme: mediatopic
created: 2009-10-22T02:00:00+00:00
modified: 2021-12-17T12:00:00+00:00
broader: Religion
narrower: Dop
narrower: Bar mitzvah
narrower: Helgonförklaring

Religiösa byggnader
type: Concept
definition: En anläggning där en grupp kan utföra religiösa riter, t ex en moské, en kyrka, ett hus eller ett tält.
in scheme: mediatopic
created: 2009-10-22T02:00:00+00:00
modified: 2021-12-17T12:00:00+00:00
broader: Religion
narrower: Kyrkor
narrower: Moskeér
narrower: Synagogor
narrower: Tempel
broad match: http://cv.iptc.org/newscodes/subjectcode/12000000

Relation mellan stat och religiösa institutioner
type: Concept
definition: Den lagliga och sociala fördelningen mellan religiösa institutioner och statsangelägenheter.
in scheme: mediatopic
created: 2009-10-22T02:00:00+00:00
modified: 2024-07-01T12:00:00+00:00
broader: Religion

Religiösa ledare
type: Concept
definition: Personer som har en rituell, juridisk eller annan ledande roll i sin kyrka eller religion.
in scheme: mediatopic
created: 2009-10-22T02:00:00+00:00
modified: 2021-02-18T12:00:00+00:00
broader: Religion
narrower: Påven

Religiösa texter
type: Concept
definition: Texter som anses heliga eller viktiga för en kyrka eller religion.
in scheme: mediatopic
created: 2009-10-22T02:00:00+00:00
modified: 2021-12-17T12:00:00+00:00
broader: Religion
narrower: Bibeln
narrower: Koranen
narrower: Toran

Teknik och vetenskap
type: Concept
definition: Allt som rör den mänskliga förståelsen av naturen och den fysiska världen, utveckling och användning av denna kunskap. Vetenskaplig praktik, ingenjörskonst, human- och naturvetenskap, filosofi, research, vetenskapliga undersökningar, rymdfart.
in scheme: mediatopic
created: 2009-10-22T02:00:00+00:00
modified: 2021-02-18T12:00:00+00:00
narrower: Biomedicin
narrower: Matematik
narrower: Naturvetenskap
narrower: Vetenskaplig forskning
narrower: Forskningsinstitutioner
narrower: Samhällsvetenskap
narrower: Vetenskaplig standard
narrower: Teknik och ingenjörskonst

Biomedicin
type: Concept
definition: Applicerandet av biologibaserad forskning på medicinska områden, såsom forskning, kontroll av hälsotillstånd eller medicinsk behandling.
in scheme: mediatopic
created: 2009-10-22T02:00:00+00:00
modified: 2021-02-18T12:00:00+00:00
broader: Teknik och vetenskap
narrower: Bioteknologi
broad match: http://cv.iptc.org/newscodes/subjectcode/13019000

Matematik
type: Concept
definition: Vetenskapen om struktur, volym, förändring och abstrakta tal, ofta genom användning av symbolisk logik och språk och inkluderande ämnen såsom trigonometri, geometri och algebra.
in scheme: mediatopic
created: 2009-10-22T02:00:00+00:00
modified: 2021-02-18T12:00:00+00:00
broader: Teknik och vetenskap

Naturvetenskap
type: Concept
definition: Den sammanfattande benämningen på de vetenskaper som studerar naturen, dess delar eller verkningar, t ex fysik, kemi, biologi och astronomi.
in scheme: mediatopic
created: 2009-10-22T02:00:00+00:00
modified: 2021-02-18T12:00:00+00:00
broader: Teknik och vetenskap
narrower: Astronomi
narrower: Biologi
narrower: Kemi
narrower: Kosmologi
narrower: Geologi
narrower: Hortikultur
narrower: Oceanografi
narrower: Meteorologi
narrower: Fysik

Vetenskaplig forskning
type: Concept
definition: Process som genom systematiskt arbete kan frambringa nya kunskaper och ökat vetande.
in scheme: mediatopic
created: 2009-10-22T02:00:00+00:00
modified: 2021-02-18T12:00:00+00:00
broader: Teknik och vetenskap
narrower: Upptäckter och uppfinningar
narrower: Medicinsk forskning
narrower: Vetenskaplig expedition
narrower: Vetenskaplig avhandling

Forskningsinstitutioner
type: Concept
definition: Institutioner som genomför eller styr vetenskapligt arbete.
in scheme: mediatopic
created: 2009-10-22T02:00:00+00:00
modified: 2021-02-18T12:00:00+00:00
broader: Teknik och vetenskap

Samhällsvetenskap
type: Concept
definition: Vetenskap som studerar samhället ur olika synvinklar.
in scheme: mediatopic
created: 2009-10-22T02:00:00+00:00
modified: 2021-02-18T12:00:00+00:00
broader: Teknik och vetenskap
narrower: Antropologi
narrower: Arkeologi
narrower: Ekonomivetenskap
narrower: Geografi
narrower: Historia
narrower: Informationsvetenskap
narrower: Juridik
narrower: Lingvistik
narrower: Filosofi
narrower: Statsvetenskap
narrower: Psykologi
narrower: Sociologi

Vetenskaplig standard
type: Concept
definition: Nationella eller internationella regler som styr vetenskapliga och tekniska studier och utveckling, såsom kalibreringsstandarder för vetenskapliga instrument.
in scheme: mediatopic
created: 2009-10-22T02:00:00+00:00
modified: 2021-02-18T12:00:00+00:00
broader: Teknik och vetenskap

Teknik och ingenjörskonst
type: Concept
definition: Studiet och bruket av industriella eller tillämpade vetenskaper såsom teknisk fysik, hydrodynamik och termodynamik.
in scheme: mediatopic
created: 2009-10-22T02:00:00+00:00
modified: 2021-02-18T12:00:00+00:00
broader: Teknik och vetenskap
narrower: Maskinteknik
narrower: Flyg- och rymdteknik
narrower: Jordbruksteknik
narrower: Väg- och vattenbyggnadsteknik
narrower: Elektronik
narrower: Identifieringsteknik
narrower: IT/datavetenskap
narrower: Materialvetenskap
narrower: Mikrovetenskap
broad match: http://cv.iptc.org/newscodes/subjectcode/13000000

Samhälle
type: Concept
definition: Mänskligt uppträdande som rör eller påverkar den allmänna livskvaliteten. Missbruk, filantropi, demografi, handikappfrågor, eutanasi, familj, socialförsäkringar, hemlöshet, minoriteter, fattigdom, socialbidrag, pornografi, prostitution, rasism.
in scheme: mediatopic
created: 2009-10-22T02:00:00+00:00
modified: 2021-02-18T12:00:00+00:00
narrower: Grundläggande rättigheter
narrower: Gemenskaper
narrower: Demografi
narrower: Immigration
narrower: Emigranter
narrower: Diskriminering
narrower: Familjefrågor
narrower: Mänskligheten
narrower: Social situation
narrower: Sociala problem
narrower: Sociala värderingar
narrower: Socialhjälp
narrower: http://cv.iptc.org/newscodes/mediatopic/20001373

Grundläggande rättigheter
type: Concept
definition: De politiska, sociala, kulturella och ekonomiska rättigheter som alla människor har rätt till, vanligtvis upprätthållna i lag
in scheme: mediatopic
created: 2009-10-22T02:00:00+00:00
modified: 2024-09-26T12:00:00+00:00
broader: Samhälle
narrower: Medborgerliga rättigheter
narrower: Censur och yttrandefrihet
narrower: Religionsfrihet
narrower: Tryckfrihet
narrower: Mänskliga rättigheter
narrower: Personlig integritet
narrower: Jämställdhet
broad match: http://cv.iptc.org/newscodes/subjectcode/02007000

Gemenskaper
type: Concept
definition: En grupp personer som delar ett gemensamt intresse eller gemensamma värderingar.
in scheme: mediatopic
created: 2009-10-22T02:00:00+00:00
modified: 2021-02-18T12:00:00+00:00
broader: Samhälle
narrower: Socialt nätverkande
narrower: http://cv.iptc.org/newscodes/mediatopic/20001360
broad match: http://cv.iptc.org/newscodes/subjectcode/14024000

Demografi
type: Concept
definition: Vetenskapen om mänskliga befolkningars struktur och utveckling, särskilt kvantitativt.
in scheme: mediatopic
created: 2009-10-22T02:00:00+00:00
modified: 2021-02-18T12:00:00+00:00
broader: Samhälle
narrower: Folk och folkräkning

Immigration
type: Concept
definition: Personers rörelse från ett land till ett annat.
in scheme: mediatopic
created: 2009-10-22T02:00:00+00:00
modified: 2021-02-18T12:00:00+00:00
broader: Samhälle
narrower: Illegala immigranter

Emigranter
type: Concept
definition: Personer som lämnar sitt ursprungsland, dessa personers relation till ursprungslandet och andra personer som har lämnat ursprungslandet.
in scheme: mediatopic
created: 2009-10-22T02:00:00+00:00
modified: 2021-07-12T12:00:00+00:00
broader: Samhälle

Diskriminering
type: Concept
definition: Särbehandling av individer eller grupper, vilken innebär ett avsteg från principen att lika fall ska behandlas lika, på grund av etnicitet, hudfärg, sexuell läggning, religion och så vidare..
in scheme: mediatopic
created: 2009-10-22T02:00:00+00:00
modified: 2021-02-18T12:00:00+00:00
broader: Samhälle
narrower: Åldersdiskriminering
narrower: Rasism
narrower: Religiös diskriminering
narrower: Könsdiskriminering

Familjefrågor
type: Concept
definition: En grupp individer med relation via släktskap eller juridiska bindningar, exempelvis vigsel.
in scheme: mediatopic
created: 2009-10-22T02:00:00+00:00
modified: 2021-02-18T12:00:00+00:00
broader: Samhälle
narrower: Adoption
narrower: Uppvaktning
narrower: Skilsmässor
narrower: Familjeplanering
narrower: Gifta
narrower: Föräldrar
narrower: Graviditet och förlossning

Mänskligheten
type: Concept
definition: Sammanfattningen av alla människor genom alla tider eller vid en viss tidpunkt.
in scheme: mediatopic
created: 2009-10-22T02:00:00+00:00
modified: 2025-06-30T12:00:00+00:00
broader: Samhälle
narrower: Vuxna
narrower: Barn
narrower: funktionsvariation
narrower: HBTQ
narrower: Kön
narrower: Spädbarn
narrower: Minoriteter
narrower: Kärnkraftsmotståndare
narrower: Pensionärer
narrower: Tonåringar
narrower: Ursprungsbefolkning
narrower: Kvinnor
narrower: Män

Social situation
type: Concept
definition: Det tillstånd folk lever i gällande bostad, vattentillgång, möjlighet till utbildning med mera.
in scheme: mediatopic
created: 2009-10-22T02:00:00+00:00
modified: 2021-05-05T12:00:00+00:00
broader: Samhälle
narrower: Hemlöshet
narrower: Fattigdom

Sociala problem
type: Concept
definition: Brister i en befolknings levnadsförhållanden som gäller så många människor att staten eller enskilda organisationer anses böra ingripa.
in scheme: mediatopic
created: 2009-10-22T02:00:00+00:00
modified: 2021-02-18T12:00:00+00:00
broader: Samhälle
narrower: Kränkande beteende
narrower: Beroenden
narrower: Ungdomsbrottslighet
narrower: Prostitution
narrower: Slaveri
narrower: Sexuellt ofredande
narrower: Mobbning
broad match: http://cv.iptc.org/newscodes/subjectcode/14025002

Sociala värderingar
type: Concept
definition: Allmänt delade, men många gånger underförstådda, regler och förväntningar på beteende som gäller inom en mindre social gemenskap eller i samhället i stort.
in scheme: mediatopic
created: 2009-10-22T02:00:00+00:00
modified: 2021-02-18T12:00:00+00:00
broader: Samhälle
narrower: Korrupta metoder
narrower: Livets slutskede
narrower: Etik
narrower: Pornografi
narrower: Sexuellt beteende

Socialhjälp
type: Concept
definition: Hjälp till personer i behov av mat, bostad, sjukvård och andra tjänster.
in scheme: mediatopic
created: 2009-10-22T02:00:00+00:00
modified: 2021-02-18T12:00:00+00:00
broader: Samhälle
narrower: Välgörenhet
narrower: Långvård
narrower: Socialtjänst
narrower: Äldrevård
narrower: Nödboende
narrower: Barnomsorg

http://cv.iptc.org/newscodes/mediatopic/20001373
type: Concept
in scheme: mediatopic
created: 2023-03-31T12:00:00+00:00
modified: 2023-03-31T12:00:00+00:00
broader: Samhälle

Sport
type: Concept
definition: Generellt om idrott och andra fysiska aktiveter samt de organisationer och myndigheter som är inblandade i detta.
in scheme: mediatopic
created: 2009-10-22T02:00:00+00:00
modified: 2021-02-18T12:00:00+00:00
narrower: Tävlingsidrott
narrower: Idrottslig bestraffning
narrower: Idrottsmedicin
narrower: Idrottshändelse
narrower: Sportindustri
narrower: Idrottsorganisationer
narrower: Idrottsarenor
narrower: Transfermarknad
narrower: Sportsliga framgång
narrower: Tränare
narrower: Administratörer
narrower: Domare (Tävling)

Tävlingsidrott
type: Concept
definition: De sporter där det sker tävlingar.
in scheme: mediatopic
created: 2009-10-22T02:00:00+00:00
modified: 2021-02-18T12:00:00+00:00
broader: Sport
narrower: Amerikansk fotboll
narrower: Bågskytte
narrower: Friidrott
narrower: Australisk fotboll
narrower: Badminton
narrower: Bandy
narrower: Baseboll
narrower: Basket
narrower: Skidskytte
narrower: Biljard
narrower: Bob
narrower: Boule
narrower: Boxning
narrower: Tjurfäktning
narrower: Kanadensisk fotboll
narrower: Kanot (kanadensare)
narrower: Casting
narrower: Klättring
narrower: Sportklättring
narrower: Cricket
narrower: Krocket
narrower: Curling
narrower: Cykel
narrower: Danssport
narrower: Dart
narrower: Simhopp
narrower: Undervattenssport
narrower: Hundsport
narrower: Duathlon
narrower: Ridsport
narrower: Fäktning
narrower: Landhockey
narrower: Konståkning
narrower: Fistboll
narrower: Innebandy
narrower: Frisbee
narrower: Gaelisk fotboll
narrower: Golf
narrower: Gymnastik
narrower: Handboll
narrower: Hornussen
narrower: Galopp
narrower: Hurling
narrower: Ishockey
narrower: Inlines
narrower: Pelota
narrower: Kabaddi
narrower: Kanot (kajak)
narrower: Lacrosse
narrower: Rodel
narrower: Maraton
narrower: Modern femkamp
narrower: Båtsport
narrower: Motorsport
narrower: MC-sport
narrower: Nätboll
narrower: Orientering
narrower: Fallskärmshoppning
narrower: Hästpolo
narrower: Pool
narrower: Båtracing
narrower: Rodeo
narrower: Rodd
narrower: Segling
narrower: Sepak takraw
narrower: Shinty
narrower: Sportskytte
narrower: Skeleton
narrower: Skidor
narrower: Sky diving
narrower: Snooker
narrower: Snowboard
narrower: Fotboll

Idrottslig bestraffning
type: Concept
definition: Åtgärder, t ex böter och avstängning, som påförs av idrottsorganisationer eller idrottslag.
in scheme: mediatopic
created: 2009-10-22T02:00:00+00:00
modified: 2021-02-18T12:00:00+00:00
broader: Sport

Idrottsmedicin
type: Concept
definition: Användning av läkemedel inom idrotten.
in scheme: mediatopic
created: 2009-10-22T02:00:00+00:00
modified: 2022-09-23T12:00:00+00:00
broader: Sport
narrower: Dopning
narrower: Dopningskontroll
narrower: Tillåtna läkemedel
broad match: http://cv.iptc.org/newscodes/subjectcode/15000000

Idrottshändelse
type: Concept
definition: En tillställning med en eller flera sporttävlingar.
in scheme: mediatopic
created: 2009-10-22T02:00:00+00:00
modified: 2021-07-12T12:00:00+00:00
broader: Sport
narrower: Kontinentala mästerskap
narrower: Kontinental cup
narrower: Kontinentala spel
narrower: Internationella mästerskap
narrower: Internationella cuper
narrower: Internationella spel
narrower: Nationella mästerskap
narrower: Nationell cup
narrower: Nationella spel
narrower: Distriktsmästerskap
narrower: Distriktscup
narrower: Distriktstävlingar
narrower: Världsmästerskap
narrower: Världscup
narrower: World Games
narrower: Olympiska spel
narrower: Paralympics
narrower: Seriespel
narrower: Slutspel
narrower: Final

Sportindustri
type: Concept
definition: Kommersiella händelser relaterade till sport.
in scheme: mediatopic
created: 2009-10-22T02:00:00+00:00
modified: 2021-02-18T12:00:00+00:00
broader: Sport
broad match: http://cv.iptc.org/newscodes/subjectcode/15000000

Idrottsorganisationer
type: Concept
definition: Ett samlande namn på institutioner och organisationer som ägnar sig åt idrott, såsom lokala idrottsföreningar, idrottsförbund och idrottsfederationer.
in scheme: mediatopic
created: 2009-10-22T02:00:00+00:00
modified: 2023-10-02T12:00:00+00:00
broader: Sport

Idrottsarenor
type: Concept
definition: Kommersiell fastighet för idrottsevenemang.
in scheme: mediatopic
created: 2009-10-22T02:00:00+00:00
modified: 2021-03-31T12:00:00+00:00
broader: Sport
broad match: http://cv.iptc.org/newscodes/subjectcode/15000000

Transfermarknad
type: Concept
definition: Marknaden där spelare byter från ett lag till ett annat.
in scheme: mediatopic
created: 2012-10-04T12:00:00+00:00
modified: 2021-07-12T12:00:00+00:00
broader: Sport

Sportsliga framgång
type: Concept
definition: Notering av en idrottares framgångar under karriären
in scheme: mediatopic
created: 2021-02-18T12:00:00+00:00
modified: 2021-07-12T12:00:00+00:00
broader: Sport
narrower: Rekord (sport och idrott)
narrower: Medaljer
narrower: Sportutmärkelser

Tränare
type: Concept
definition: Personer som är anlitade för att leda idrottares träning och tävling.
in scheme: mediatopic
created: 2021-05-05T12:00:00+00:00
modified: 2021-12-21T12:00:00+00:00
broader: Sport

Administratörer
type: Concept
definition: Personer som äger och/eller leder lag och idrottare på en mer övergripande nivå än tränare.
in scheme: mediatopic
created: 2021-05-05T12:00:00+00:00
modified: 2021-12-21T12:00:00+00:00
broader: Sport

Domare (Tävling)
type: Concept
definition: Personer som på olika sätt ser till att tävlingar sker enligt den sportens regler.
in scheme: mediatopic
created: 2021-05-05T12:00:00+00:00
modified: 2024-03-28T12:00:00+00:00
broader: Sport

Krig, konflikter och oroligheter
type: Concept
definition: Socialt eller politiskt motiverade protester och/eller våldshandlingar. Terrorism, väpnade konflikter, social oro, statskupper, Gerillaaktiviteter, massakrer, upplopp, våldsamma demonstrationer, krig.
in scheme: mediatopic
created: 2009-10-22T02:00:00+00:00
modified: 2021-02-18T12:00:00+00:00
narrower: Terrorhandling
narrower: Militära konflikter
narrower: Oroligheter
narrower: Statskupp
narrower: Massaker
narrower: Fredsprocess
narrower: Återuppbyggnad
narrower: Cyberkrigföring
narrower: Krigsoffer
broad match: http://cv.iptc.org/newscodes/subjectcode/16000000

Terrorhandling
type: Concept
definition: Organiserade våldshandlingar som väcker skräck och fasa, ofta utförda i politiskt syfte och av mindre grupper.
in scheme: mediatopic
created: 2009-10-22T02:00:00+00:00
modified: 2021-02-18T12:00:00+00:00
broader: Krig, konflikter och oroligheter
narrower: Biologisk terrorism
narrower: Bombdåd

Militära konflikter
type: Concept
definition: Dispyter mellan väpnade trupper, inte nödvändigtvis formella krig.
in scheme: mediatopic
created: 2009-10-22T02:00:00+00:00
modified: 2021-02-18T12:00:00+00:00
broader: Krig, konflikter och oroligheter
narrower: Gerillakrig
narrower: Internationell militär intervention
narrower: Ockupation
narrower: Krig

Oroligheter
type: Concept
definition: Missnöje bland befolkningen som yttrar sig som strejker, massmöten, demonstrationer eller sabotage.
in scheme: mediatopic
created: 2009-10-22T02:00:00+00:00
modified: 2021-02-18T12:00:00+00:00
broader: Krig, konflikter och oroligheter
narrower: Demonstrationer och protester
narrower: Uppror
narrower: Revolution
narrower: Upplopp

Statskupp
type: Concept
definition: Plötsligt och (vanligen) med våld genomfört maktskifte i en stat, vanligtvis av (del av) krigsmakten och utan folkets deltagande.
in scheme: mediatopic
created: 2009-10-22T02:00:00+00:00
modified: 2021-02-18T12:00:00+00:00
broader: Krig, konflikter och oroligheter

Massaker
type: Concept
definition: Samtidigt dödande av många människor, ofta civila, under krigstid.
in scheme: mediatopic
created: 2009-10-22T02:00:00+00:00
modified: 2021-02-18T12:00:00+00:00
broader: Krig, konflikter och oroligheter

Fredsprocess
type: Concept
definition: Åtgärder för att göra slut på ett krig eller en konflikt, ofta genom fredssamtal eller -avtal.
in scheme: mediatopic
created: 2009-10-22T02:00:00+00:00
modified: 2021-02-18T12:00:00+00:00
broader: Krig, konflikter och oroligheter
narrower: Fredsbevarande styrkor
narrower: Fredsmäklare
narrower: Fredsplan
narrower: Fredssamtal
narrower: Nedrustning
broad match: http://cv.iptc.org/newscodes/subjectcode/11002003

Återuppbyggnad
type: Concept
definition: Åtgärder för att återskapa samhället, ekonomin och det politiska systemet i ett krigshärjat område.
in scheme: mediatopic
created: 2009-10-22T02:00:00+00:00
modified: 2021-02-18T12:00:00+00:00
broader: Krig, konflikter och oroligheter
narrower: Minröjning/Röjning av krigsmateriel
broad match: http://cv.iptc.org/newscodes/subjectcode/11002000

Cyberkrigföring
type: Concept
definition: Angrepp, eller misstänkta angrepp mot ett lands it-infrastruktur och försvar mot sådana angrepp.
in scheme: mediatopic
created: 2022-09-23T12:00:00+00:00
modified: 2022-09-23T12:00:00+00:00
broader: Krig, konflikter och oroligheter

Krigsoffer
type: Concept
definition: Personer, både civila och militära, som skadats eller dödats i samband med krig eller militära konflikter.
in scheme: mediatopic
created: 2024-03-28T12:00:00+00:00
modified: 2024-03-28T12:00:00+00:00
broader: Krig, konflikter och oroligheter
narrower: Saknad i krig
narrower: Krigsfångar

Väder
type: Concept
definition: Meteorologiska studier, rapporteringar och förutsägelser. Väderrapporter, globala förändringar i vädret, statistik, varningar
in scheme: mediatopic
created: 2009-10-22T02:00:00+00:00
modified: 2021-02-18T12:00:00+00:00
narrower: Väderprognos
narrower: Väderfenomen
narrower: Väderstatistik
narrower: Vädervarning

Väderprognos
type: Concept
definition: Förutsägelse om vädret baserad på vetenskaplig grund.
in scheme: mediatopic
created: 2009-10-22T02:00:00+00:00
modified: 2021-02-18T12:00:00+00:00
broader: Väder

Väderfenomen
type: Concept
definition: Speciella meteorologiska väderförhållanden, som är värda att studera, rapportera eller varna för.
in scheme: mediatopic
created: 2009-10-22T02:00:00+00:00
modified: 2021-05-05T12:00:00+00:00
broader: Väder
broad match: http://cv.iptc.org/newscodes/subjectcode/17003001

Väderstatistik
type: Concept
definition: Numeriska fakta om vädret, såsom temperatur, hög- och lågtryck, luftfuktighet och liknande.
in scheme: mediatopic
created: 2009-10-22T02:00:00+00:00
modified: 2021-02-18T12:00:00+00:00
broader: Väder

Vädervarning
type: Concept
definition: Larm när vädret väntas innebära risker för allmänheten och störningar i samhällsfunktioner.
in scheme: mediatopic
created: 2009-10-22T02:00:00+00:00
modified: 2021-02-18T12:00:00+00:00
broader: Väder

Animation
type: Concept
definition: Rörlig bild skapad av en serie teckningar, lerfigurer etc med små förändringar från en bild till nästa.
in scheme: mediatopic
created: 2009-10-22T02:00:00+00:00
modified: 2021-03-15T12:00:00+00:00
broader: Konst och underhållning

Serieteckningar
type: Concept
definition: Bilder framställda på andra sätt än med kamera. Enstaka bilder eller serier av bilder, ofta i form av satir eller komik.
in scheme: mediatopic
created: 2009-10-22T02:00:00+00:00
modified: 2021-02-18T12:00:00+00:00
broader: Konst och underhållning

Film
type: Concept
definition: Rörliga bilder med en handling som uttrycker en känsla eller överför ett budskap.
in scheme: mediatopic
created: 2009-10-22T02:00:00+00:00
modified: 2021-02-18T12:00:00+00:00
broader: Konst och underhållning

Dans
type: Concept
definition: Personer som rör sig och uttrycker en känsla eller överför ett budskap.
in scheme: mediatopic
created: 2009-10-22T02:00:00+00:00
modified: 2021-02-18T12:00:00+00:00
broader: Konst och underhållning
narrower: Balett
narrower: Modern dans
narrower: Traditionell dans

Mode
type: Concept
definition: Design av kläder och tillbehör för att uttrycka en känsla eller överföra ett budskap.
in scheme: mediatopic
created: 2009-10-22T02:00:00+00:00
modified: 2021-02-18T12:00:00+00:00
broader: Konst och underhållning
narrower: Accessoarer och smycken
narrower: Kosmetika
narrower: Frisyrer

Litteratur
type: Concept
definition: Uttryck av känslor eller överförande av budskap via skriftspråk.
in scheme: mediatopic
created: 2009-10-22T02:00:00+00:00
modified: 2021-02-18T12:00:00+00:00
broader: Konst och underhållning
narrower: Drama
narrower: Skönlitteratur
narrower: Facklitteratur
narrower: Poesi

Musik
type: Concept
definition: Uttryck av känslor eller överförande av budskap genom att använda röst och/eller instrument med olika ljud, toner och harmonier.
in scheme: mediatopic
created: 2009-10-22T02:00:00+00:00
modified: 2021-02-18T12:00:00+00:00
broader: Konst och underhållning
narrower: Musikinstrument
narrower: Musikframträdande
narrower: Musikgenre

Teater
type: Concept
definition: Uttryck av känslor eller överförande av budskap via en historia som framförs genom dialog, musik, och/eller fysiska uttryck.
in scheme: mediatopic
created: 2009-10-22T02:00:00+00:00
modified: 2021-02-18T12:00:00+00:00
broader: Konst och underhållning
narrower: Opera
narrower: Musikteater
narrower: Musikal
narrower: Operett
narrower: Dramatisk teater
narrower: Stand up comedy
narrower: Revy

Visuella konstformer
type: Concept
definition: Olika former av verk som i första hand appelerar till det visuella, såsom keramik, teckningar, skulpturer, foto och video.
in scheme: mediatopic
created: 2009-10-22T02:00:00+00:00
modified: 2021-02-18T12:00:00+00:00
broader: Konst och underhållning
narrower: Arkitektur
narrower: Design
narrower: Teckning
narrower: Måleri
narrower: Fotografi
narrower: Skulptur
narrower: Textil
narrower: Träsnide
narrower: Smide
broad match: http://cv.iptc.org/newscodes/subjectcode/01000000

Serie
type: Concept
definition: Ett sammanhållet set av program som sänds under samma titel, ibland över flera säsonger.
in scheme: mediatopic
created: 2017-11-16T12:00:00+00:00
modified: 2021-07-12T12:00:00+00:00
broader: Konst och underhållning

Festivaler
type: Concept
definition: Tillställningar där flera framträdanden inom en eller flera konstformer samlas på samma ställe. Tillställningarna är ofta återkommande på samma plats år efter år.
in scheme: mediatopic
created: 2018-04-09T12:00:00+00:00
modified: 2021-07-12T12:00:00+00:00
broader: Konst och underhållning
narrower: Filmfestivaler

Filmfestivaler
type: Concept
definition: Nationella eller internationella samlingar där filmer visas, priser delas ut och branschfolk träffas.
in scheme: mediatopic
created: 2009-10-22T02:00:00+00:00
modified: 2021-02-18T12:00:00+00:00
broader: Festivaler

Balett
type: Concept
definition: Klassisk dansstil med steg, positioner och gester.
in scheme: mediatopic
created: 2009-10-22T02:00:00+00:00
modified: 2021-02-18T12:00:00+00:00
broader: Dans
broad match: http://cv.iptc.org/newscodes/subjectcode/01006000

Modern dans
type: Concept
definition: Teatralisk dansstil som inte är begränsad till klassiska uttryck.
in scheme: mediatopic
created: 2009-10-22T02:00:00+00:00
modified: 2021-02-18T12:00:00+00:00
broader: Dans
broad match: http://cv.iptc.org/newscodes/subjectcode/01006000

Traditionell dans
type: Concept
definition: En dansstil som oftast förekommer som en social aktivitet, ibland kopplad till lokala kulturella traditioner.
in scheme: mediatopic
created: 2009-10-22T02:00:00+00:00
modified: 2021-02-18T12:00:00+00:00
broader: Dans
broad match: http://cv.iptc.org/newscodes/subjectcode/01006000

Accessoarer och smycken
type: Concept
definition: Accessoarer till kläder, såsom ringar, halsband och örhängen.
in scheme: mediatopic
created: 2009-10-22T02:00:00+00:00
modified: 2021-02-18T12:00:00+00:00
broader: Mode

Kosmetika
type: Concept
definition: Produkter som används på kroppen för att förbättra utseendet som exempelvis läppstick och mascara.
in scheme: mediatopic
created: 2019-07-30T12:00:00+00:00
modified: 2021-07-12T12:00:00+00:00
broader: Mode

Frisyrer
type: Concept
definition: Trender kring att klippa, färga och styla hår.
in scheme: mediatopic
created: 2019-07-30T12:00:00+00:00
modified: 2021-07-12T12:00:00+00:00
broader: Mode

Drama
type: Concept
definition: Skrivna berättelser som är avsedda att framföras av skådespelare.
in scheme: mediatopic
created: 2009-10-22T02:00:00+00:00
modified: 2021-02-18T12:00:00+00:00
broader: Litteratur
broad match: http://cv.iptc.org/newscodes/subjectcode/01010000

Skönlitteratur
type: Concept
definition: Skrivna berättelser som inte bygger på fakta utan på författarens fantasi.
in scheme: mediatopic
created: 2009-10-22T02:00:00+00:00
modified: 2021-02-18T12:00:00+00:00
broader: Litteratur

Facklitteratur
type: Concept
definition: Skrivna texter som baseras på fakta.
in scheme: mediatopic
created: 2009-10-22T02:00:00+00:00
modified: 2021-02-18T12:00:00+00:00
broader: Litteratur
broad match: http://cv.iptc.org/newscodes/subjectcode/01010000

Poesi
type: Concept
definition: Skrivna texter som förutom innehåll även förmedlar en känsla via formatet, som kan följa ett visst versmått eller vara fritt.
in scheme: mediatopic
created: 2009-10-22T02:00:00+00:00
modified: 2021-02-18T12:00:00+00:00
broader: Litteratur

Musikinstrument
type: Concept
definition: Objekt som används för att skapa ljud i ett konstnärligt syfte.
in scheme: mediatopic
created: 2009-10-22T02:00:00+00:00
modified: 2021-02-18T12:00:00+00:00
broader: Musik
broad match: http://cv.iptc.org/newscodes/subjectcode/01011000

Musikframträdande
type: Concept
definition: Framföra sång och/eller musik inför publik.
in scheme: mediatopic
created: 2009-10-22T02:00:00+00:00
modified: 2021-02-18T12:00:00+00:00
broader: Musik
broad match: http://cv.iptc.org/newscodes/subjectcode/01011000

Musikgenre
type: Concept
definition: En vedertagen genre inom musik.
in scheme: mediatopic
created: 2009-10-22T02:00:00+00:00
modified: 2021-02-18T12:00:00+00:00
broader: Musik
narrower: Klassisk musik
narrower: Country
narrower: Folkmusik
narrower: Jazz
narrower: Pop
narrower: Rock
narrower: Hip Hop
narrower: R&B
narrower: Metal
narrower: Dansband
narrower: Elektronisk dansmusik (EDM)
narrower: Barnmusik
broad match: http://cv.iptc.org/newscodes/subjectcode/01011000

Klassisk musik
type: Concept
definition: Musik som följer klassiska metoder och uttryck när det gäller harmonier och rytmer.
in scheme: mediatopic
created: 2009-10-22T02:00:00+00:00
modified: 2021-02-18T12:00:00+00:00
broader: Musikgenre

Country
type: Concept
definition: En musikstil med rötter i södra USA, ofta bestående av ballader eller dansmelodier och spelade på stränginstrument.
in scheme: mediatopic
created: 2009-10-22T02:00:00+00:00
modified: 2021-02-18T12:00:00+00:00
broader: Musikgenre

Folkmusik
type: Concept
definition: Musik som härstammar från äldre folkliga traditioner och som ofta berättar en historia.
in scheme: mediatopic
created: 2009-10-22T02:00:00+00:00
modified: 2021-02-18T12:00:00+00:00
broader: Musikgenre

Jazz
type: Concept
definition: Musik med blandade harmonier, ofta improviserat.
in scheme: mediatopic
created: 2009-10-22T02:00:00+00:00
modified: 2021-02-18T12:00:00+00:00
broader: Musikgenre

Pop
type: Concept
definition: Musikstil som är allmänt tillgänglig och komponerad för att locka många lyssnare.
in scheme: mediatopic
created: 2009-10-22T02:00:00+00:00
modified: 2021-02-18T12:00:00+00:00
broader: Musikgenre

Rock
type: Concept
definition: Musikstil som utvecklades i USA under slutet av 1940-talet och början av 1950-talet. Den blandade influenser från tidigare afro-amerikanska musikstilar som gospel, blues, jazz, boogie woogie och rythm'n'blues.
in scheme: mediatopic
created: 2009-10-22T02:00:00+00:00
modified: 2021-02-18T12:00:00+00:00
broader: Musikgenre

Hip Hop
type: Concept
definition: En musikstil som utvecklades av afro-amerikaner i amerikansks storstäder under 1970-talet. Rap är en form av rytmiskt tal.
in scheme: mediatopic
created: 2019-04-06T12:00:00+00:00
modified: 2021-07-12T12:00:00+00:00
broader: Musikgenre

R&B
type: Concept
definition: En musikstil som utvecklades bland afro-amerikaner under 1940-talet. Benämningen har levt kvar, men skiftat i betydelse.
in scheme: mediatopic
created: 2019-04-06T12:00:00+00:00
modified: 2021-07-12T12:00:00+00:00
broader: Musikgenre

Metal
type: Concept
definition: En musikstil som utvecklades främst i Storbritannien under sena 60-talet och tidiga 70-talet. Med rötter i blues och rock blev ljudbilden tyngre och snabbare.
in scheme: mediatopic
created: 2019-04-06T12:00:00+00:00
modified: 2021-07-12T12:00:00+00:00
broader: Musikgenre

Dansband
type: Concept
definition: Svensk term för lättlyssnad musik som passar bra att dansa par-dans till.
in scheme: mediatopic
created: 2019-04-06T12:00:00+00:00
modified: 2021-07-12T12:00:00+00:00
broader: Musikgenre

Elektronisk dansmusik (EDM)
type: Concept
definition: En bred genre av elektroniskt baserad dans-musik.
in scheme: mediatopic
created: 2019-04-06T12:00:00+00:00
modified: 2021-07-12T12:00:00+00:00
broader: Musikgenre

Barnmusik
type: Concept
definition: Musik som är gjord speciellt för barn. Lätta melodier och texter som är enkla att följa med i. Ofta med rörelser till.
in scheme: mediatopic
created: 2019-04-06T12:00:00+00:00
modified: 2021-07-12T12:00:00+00:00
broader: Musikgenre

Opera
type: Concept
definition: Framförande av musikaliska verk, ofta dramatiska, av klassiskt skolade sångare och musiker.
in scheme: mediatopic
created: 2009-10-22T02:00:00+00:00
modified: 2021-09-30T12:00:00+00:00
broader: Teater
broad match: http://cv.iptc.org/newscodes/subjectcode/01017001

Musikteater
type: Concept
definition: Uttryck av känslor eller överförande av budskap via en historia som framförs genom dialog, musik eller fysiska uttryck, såsom musikaler och operetter.
in scheme: mediatopic
created: 2009-10-22T02:00:00+00:00
retired: 2021-09-30T12:00:00+00:00
modified: 2021-09-30T12:00:00+00:00
broader: Teater

Musikal
type: Concept
definition: Teater där musik och sång är en betydelsefull del av själva historieberättandet.
in scheme: mediatopic
created: 2012-10-04T12:00:00+00:00
modified: 2021-09-30T12:00:00+00:00
broader: Teater

Operett
type: Concept
definition: Påminner om opera men där både handling och musik är mer lättsamt och humoristiskt.
in scheme: mediatopic
created: 2012-10-04T12:00:00+00:00
modified: 2021-09-30T12:00:00+00:00
broader: Teater

Dramatisk teater
type: Concept
definition: En teatergenre där ett drama eller en komedi framförs uteslutande med tal och agerande av skådespelare på en scen.
in scheme: mediatopic
created: 2018-04-09T12:00:00+00:00
modified: 2021-07-12T12:00:00+00:00
broader: Teater

Stand up comedy
type: Concept
definition: Typ av underhållning, där en person står på scen och pratar till publiken. Ofta skämtsamt men med en allvarlig underton och ibland svidande satir.
in scheme: mediatopic
created: 2019-04-06T12:00:00+00:00
modified: 2021-07-12T12:00:00+00:00
broader: Teater

Revy
type: Concept
definition: Dramaföreställningar som är en satir över något som hänt under det gångna året
in scheme: mediatopic
created: 2019-04-06T12:00:00+00:00
modified: 2021-09-30T12:00:00+00:00
broader: Teater

Arkitektur
type: Concept
definition: Den mer visuella delen av att bestämma hur byggnadsverk, monument och anlagda områden ska se ut.
in scheme: mediatopic
created: 2009-10-22T02:00:00+00:00
modified: 2021-02-18T12:00:00+00:00
broader: Visuella konstformer

Design
type: Concept
definition: När man artistiskt bestämmer hur något ska se ut, kan vara så vitt skilda saker som smycken och interiörer.
in scheme: mediatopic
created: 2009-10-22T02:00:00+00:00
modified: 2021-02-18T12:00:00+00:00
broader: Visuella konstformer
broad match: http://cv.iptc.org/newscodes/subjectcode/01000000

Teckning
type: Concept
definition: En form av visuell konst där pennor, kritor och liknande används.
in scheme: mediatopic
created: 2009-10-22T02:00:00+00:00
modified: 2021-02-18T12:00:00+00:00
broader: Visuella konstformer
broad match: http://cv.iptc.org/newscodes/subjectcode/01000000

Måleri
type: Concept
definition: En form av visuell konst där pensel och olika färger används.
in scheme: mediatopic
created: 2009-10-22T02:00:00+00:00
modified: 2021-02-18T12:00:00+00:00
broader: Visuella konstformer

Fotografi
type: Concept
definition: En form av visuell konst där avbildande utrustning används, t ex analog eller digital kamera.
in scheme: mediatopic
created: 2009-10-22T02:00:00+00:00
modified: 2021-02-18T12:00:00+00:00
broader: Visuella konstformer

Skulptur
type: Concept
definition: En form av visuell konst där föremål framställs av någon form av fast material som exempelvis sten, trä eller lera.
in scheme: mediatopic
created: 2009-10-22T02:00:00+00:00
modified: 2021-05-05T12:00:00+00:00
broader: Visuella konstformer

Textil
type: Concept
definition: Hantverk där olika former av fiber används för att producera praktiska och/eller dekorativa objekt.
in scheme: mediatopic
created: 2019-04-06T12:00:00+00:00
modified: 2021-07-12T12:00:00+00:00
broader: Visuella konstformer

Träsnide
type: Concept
definition: Hantverk där man använder trä och olika verktyg för att producera föremål eller detaljer till föremål. För nytta eller prydnad.
in scheme: mediatopic
created: 2019-04-06T12:00:00+00:00
modified: 2021-07-12T12:00:00+00:00
broader: Visuella konstformer

Smide
type: Concept
definition: Hantverk där man bearbetar upphettad metall med verktyg för att tillverka nyttoföremål eller prydnadsföremål.
in scheme: mediatopic
created: 2019-04-06T12:00:00+00:00
modified: 2021-07-12T12:00:00+00:00
broader: Visuella konstformer

Kulturhistoria
type: Concept
definition: Hur kultur utvecklats under olika tidsperioder.
in scheme: mediatopic
created: 2009-10-22T02:00:00+00:00
modified: 2021-02-18T12:00:00+00:00
broader: Kultur

Seder och traditioner
type: Concept
definition: Beteende hos en grupp människor som utvecklats över tid.
in scheme: mediatopic
created: 2009-10-22T02:00:00+00:00
modified: 2021-02-18T12:00:00+00:00
broader: Kultur

Kulturell fest eller händelse
type: Concept
definition: En händelse som firas av en grupp personer med samma intresse och som fokuserar på en karakteristisk aspekt av gruppen och dess traditioner.
in scheme: mediatopic
created: 2009-10-22T02:00:00+00:00
modified: 2021-02-18T12:00:00+00:00
broader: Kultur

Språk
type: Concept
definition: En metod för mänsklig kommunikation, antingen skriftlig eller muntlig, som består av ord som sätts samman på ett sätt som utvecklats över tid inom en grupp människor som därmed kan kommunicera med varandra.
in scheme: mediatopic
created: 2009-10-22T02:00:00+00:00
modified: 2021-02-18T12:00:00+00:00
broader: Kultur

Bibliotek och museum
type: Concept
definition: Institutioner som samlar böcker, musikinspelningar, filmer, konstverk och gamla saker från olika tidsepoker och låter intresserade titta på dessa och i vissa fall låna hem dem.
in scheme: mediatopic
created: 2009-10-22T02:00:00+00:00
modified: 2021-05-05T12:00:00+00:00
broader: Kultur

Kulturarv
type: Concept
definition: Platser med någon form av påminnelse för att något hänt där eller befunnit sig där. Kan också vara en plats som utsetts för att vara ett minnesmärke för något som hänt någon annanstans.
in scheme: mediatopic
created: 2009-10-22T02:00:00+00:00
modified: 2021-05-05T12:00:00+00:00
broader: Kultur
narrower: Renovering

Konstutställning
type: Concept
definition: Ett tillfälle då en eller flera konstverk visas upp i en lokal, vanligtvis under en avgränsad period.
in scheme: mediatopic
created: 2012-10-04T12:00:00+00:00
modified: 2023-03-31T12:00:00+00:00
broader: Kultur

Renovering
type: Concept
definition: Återställande av en byggnad i ett tekniskt skick som motsvarar nyskick.
in scheme: mediatopic
created: 2009-10-22T02:00:00+00:00
modified: 2023-03-31T12:00:00+00:00
broader: Kulturarv

Nyhetsmedier
type: Concept
definition: Massmedier som har som första syfte att samla in och presentera sådant som är nytt för sin respektive publik.
in scheme: mediatopic
created: 2009-10-22T02:00:00+00:00
modified: 2021-02-18T12:00:00+00:00
broader: Massmedier

Tidningar
type: Concept
definition: Regelbundet producerade publikationer som innehåller nyheter och andra saker som är av intresse för läsarna. Var tidigare uteslutande distribuerat i pappersform, men nya tekniska lösningar används numera.
in scheme: mediatopic
created: 2009-10-22T02:00:00+00:00
modified: 2021-02-18T12:00:00+00:00
broader: Massmedier

Internetmedier
type: Concept
definition: Nyheter som distribueras via internet.
in scheme: mediatopic
created: 2009-10-22T02:00:00+00:00
modified: 2021-05-05T12:00:00+00:00
broader: Massmedier
broad match: http://cv.iptc.org/newscodes/subjectcode/01026000

Periodiska tidskrifter
type: Concept
definition: Sammanställningar av material som är mer specialicerat och som publiceras regelbundet, men mer sällan än tidningar.
in scheme: mediatopic
created: 2009-10-22T02:00:00+00:00
modified: 2021-02-18T12:00:00+00:00
broader: Massmedier

Radio
type: Concept
definition: Program som bara består av ljud och distribueras trådlöst eller via internet.
in scheme: mediatopic
created: 2009-10-22T02:00:00+00:00
modified: 2021-02-18T12:00:00+00:00
broader: Massmedier

Tv
type: Concept
definition: Program som har både ljud och bild och distribueras trådlöst eller via internet.
in scheme: mediatopic
created: 2009-10-22T02:00:00+00:00
modified: 2021-02-18T12:00:00+00:00
broader: Massmedier

Sociala medier
type: Concept
definition: Innehåll som görs tillgängligt av både företag och enskilda via forum på internet.
in scheme: mediatopic
created: 2018-04-09T12:00:00+00:00
modified: 2021-07-12T12:00:00+00:00
broader: Massmedier
narrower: Influencers

Desinformation
type: Concept
definition: Spridande av falsk information oavsett avsikt.
in scheme: mediatopic
created: 2021-02-18T12:00:00+00:00
modified: 2021-07-12T12:00:00+00:00
broader: Massmedier

Biologisk terrorism
type: Concept
definition: Attacker med biologiska ämnen för att öka rädslan hos folk.
in scheme: mediatopic
created: 2009-10-22T02:00:00+00:00
modified: 2021-02-18T12:00:00+00:00
broader: Terrorhandling

Bombdåd
type: Concept
definition: Avsiktligt användande av sprängmedel med personer eller byggnader som mål.
in scheme: mediatopic
created: 2009-10-22T02:00:00+00:00
modified: 2023-03-31T12:00:00+00:00
broader: Terrorhandling

Gerillakrig
type: Concept
definition: Krigföring som avser att beröva motståndaren en etablerad kontroll över ett område, främst genom rörlig strid av talrika mindre förband, vilka under lång tid utför sabotage och eldöverfall.
in scheme: mediatopic
created: 2009-10-22T02:00:00+00:00
modified: 2021-02-18T12:00:00+00:00
broader: Militära konflikter

Internationell militär intervention
type: Concept
definition: Tillfälligt användande av internationella trupper i ett land eller en region, som behöver hjälp från utsidan för att lösa en kris.
in scheme: mediatopic
created: 2009-10-22T02:00:00+00:00
modified: 2021-02-18T12:00:00+00:00
broader: Militära konflikter

Ockupation
type: Concept
definition: Ta över kontrollen över ett land eller område med militära medel.
in scheme: mediatopic
created: 2009-10-22T02:00:00+00:00
modified: 2021-02-18T12:00:00+00:00
broader: Militära konflikter
broad match: http://cv.iptc.org/newscodes/subjectcode/16000000

Krig
type: Concept
definition: Tillstånd av väpnad kamp i stor skala mellan nationer eller andra geopolitiska entiteter.
in scheme: mediatopic
created: 2009-10-22T02:00:00+00:00
modified: 2021-02-18T12:00:00+00:00
broader: Militära konflikter
narrower: Inbördeskrig
narrower: Krigsbrott

Fredsbevarande styrkor
type: Concept
definition: Militära trupper från olika länder som under ett samlande internationellt styre upprätthåller freden i konfliktområden.
in scheme: mediatopic
created: 2009-10-22T02:00:00+00:00
modified: 2024-03-28T12:00:00+00:00
broader: Fredsprocess

Saknad i krig
type: Concept
definition: Personer, både civila och militära, som saknas under och efter ett krig.
in scheme: mediatopic
created: 2009-10-22T02:00:00+00:00
modified: 2024-07-01T12:00:00+00:00
broader: Krigsoffer

Inbördeskrig
type: Concept
definition: Krig mellan olika grupper inom en och samma nation, ibland med målet att dela landet.
in scheme: mediatopic
created: 2009-10-22T02:00:00+00:00
modified: 2021-02-18T12:00:00+00:00
broader: Krig

Krigsbrott
type: Concept
definition: Svåra överträdelser av krigets lagar, exempelvis genom användning av förbjudna vapen, order om eller deltagande i tortyr eller annan svår misshandel av krigsfångar eller civila.
in scheme: mediatopic
created: 2009-10-22T02:00:00+00:00
retired: 2016-04-05T12:00:00+00:00
modified: 2021-05-05T12:00:00+00:00
broader: Krig

Demonstrationer och protester
type: Concept
definition: Offentlig kollektiv meningsyttring, särskilt i form av massmarsch med slagord på plakat och banderoller.
in scheme: mediatopic
created: 2009-10-22T02:00:00+00:00
modified: 2021-02-18T12:00:00+00:00
broader: Oroligheter

Uppror
type: Concept
definition: Organiserat angrepp mot statsmakten av någon grupp i samma land med syfte att störta regeringen och ändra det politiska systemet.
in scheme: mediatopic
created: 2009-10-22T02:00:00+00:00
modified: 2021-02-18T12:00:00+00:00
broader: Oroligheter

Revolution
type: Concept
definition: Större, väpnad, organiserad omstörtning av det bestående samhället.
in scheme: mediatopic
created: 2009-10-22T02:00:00+00:00
modified: 2021-02-18T12:00:00+00:00
broader: Oroligheter

Upplopp
type: Concept
definition: Tillfälligt våldsamt uppträdande av folkmassa utanför myndigheternas kontroll.
in scheme: mediatopic
created: 2009-10-22T02:00:00+00:00
modified: 2021-02-18T12:00:00+00:00
broader: Oroligheter

Folkmord
type: Concept
definition: Systematiskt dödande av en folkgrupp eller delar av en folkgrupp.
in scheme: mediatopic
created: 2009-10-22T02:00:00+00:00
modified: 2024-03-28T12:00:00+00:00
broader: Brottslighet

Fredsmäklare
type: Concept
definition: Person eller organisation som initierar och genomför en fredsprocess.
in scheme: mediatopic
created: 2009-10-22T02:00:00+00:00
modified: 2021-07-12T12:00:00+00:00
broader: Fredsprocess
broad match: http://cv.iptc.org/newscodes/subjectcode/11002003

Fredsplan
type: Concept
definition: En strategi för att uppnå fred i ett krigs- eller konfliktområde.
in scheme: mediatopic
created: 2009-10-22T02:00:00+00:00
modified: 2021-02-18T12:00:00+00:00
broader: Fredsprocess
broad match: http://cv.iptc.org/newscodes/subjectcode/11002003

Fredssamtal
type: Concept
definition: Diskussioner mellan länder, regioner eller geopolitiska entiteter i krig eller konflikt, ofta med en medlare, med målet att uppnå en lösning som leder till fred.
in scheme: mediatopic
created: 2009-10-22T02:00:00+00:00
modified: 2021-05-05T12:00:00+00:00
broader: Fredsprocess
broad match: http://cv.iptc.org/newscodes/subjectcode/11002003

Nedrustning
type: Concept
definition: Göra slut på eller dra ned på ett lands vapenarsenal.
in scheme: mediatopic
created: 2009-10-22T02:00:00+00:00
modified: 2024-03-28T12:00:00+00:00
broader: Fredsprocess
broad match: http://cv.iptc.org/newscodes/subjectcode/11002000

Minröjning/Röjning av krigsmateriel
type: Concept
definition: Borttagande eller neutraliserande av minor och klusterbomber efter ett krig eller en konflikt.
in scheme: mediatopic
created: 2009-10-22T02:00:00+00:00
modified: 2021-02-18T12:00:00+00:00
broader: Återuppbyggnad

Krigsfångar
type: Concept
definition: Personer som har blivit tillfångatagna och fängslade under krig.
in scheme: mediatopic
created: 2009-10-22T02:00:00+00:00
modified: 2024-03-28T12:00:00+00:00
broader: Krigsoffer

Anlagd brand
type: Concept
definition: Att medvetet tända eld på något som man inte har rätt att elda upp.
in scheme: mediatopic
created: 2009-10-22T02:00:00+00:00
modified: 2021-02-18T12:00:00+00:00
broader: Brottslighet

Överfall
type: Concept
definition: Alla former av fysiskt våld mot en eller flera personer.
in scheme: mediatopic
created: 2009-10-22T02:00:00+00:00
modified: 2021-02-18T12:00:00+00:00
broader: Brottslighet
narrower: Våldtäkt

IT-brott
type: Concept
definition: Brottslig aktivitet som främst utförs genom att använda datorer och/eller internet, t ex hacking, phising och identitetsstölder.
in scheme: mediatopic
created: 2009-10-22T02:00:00+00:00
modified: 2023-03-31T12:00:00+00:00
broader: Brottslighet

Ekobrott
type: Concept
definition: När ett företag, eller personer som representerar ett företag, begår ett brott.
in scheme: mediatopic
created: 2009-10-22T02:00:00+00:00
modified: 2021-02-18T12:00:00+00:00
broader: Brottslighet
narrower: Konkurrensbrott
narrower: Avtalsbrott
narrower: Förskingring
narrower: Insiderhandel
narrower: Konkurrensbegränsningar
narrower: Bokföringsbrott

Korruption
type: Concept
definition: Olagliga handlingar av en eller flera personer som utnyttjar sin position i utbyte mot pengar eller annan form av ersättning.
in scheme: mediatopic
created: 2009-10-22T02:00:00+00:00
modified: 2021-02-18T12:00:00+00:00
broader: Brottslighet
narrower: Mutbrott

Narkotikabrott
type: Concept
definition: Aktiviteter som bryter mot lagar kring hantering av narkotiska preparat och utrustning.
in scheme: mediatopic
created: 2009-10-22T02:00:00+00:00
modified: 2021-02-18T12:00:00+00:00
broader: Brottslighet
narrower: Narkotikasmuggling
broad match: http://cv.iptc.org/newscodes/subjectcode/02001000

Bedrägeri
type: Concept
definition: Planerade aktiviteter för att lura till sig pengar eller värdesaker från andra personer, företag eller organisationer.
in scheme: mediatopic
created: 2009-10-22T02:00:00+00:00
modified: 2021-02-18T12:00:00+00:00
broader: Brottslighet
narrower: Skattebrott

Kapning
type: Concept
definition: Att med våld ta över någon form av transportfordon.
in scheme: mediatopic
created: 2009-10-22T02:00:00+00:00
modified: 2021-02-18T12:00:00+00:00
broader: Brottslighet
broad match: http://cv.iptc.org/newscodes/subjectcode/02001000

Dråp
type: Concept
definition: Att döda en annan person.
in scheme: mediatopic
created: 2009-10-22T02:00:00+00:00
modified: 2021-03-31T12:00:00+00:00
broader: Brottslighet

Kidnappning
type: Concept
definition: Att tvinga med sig en annan person mot dess vilja, hålla den personen fången.
in scheme: mediatopic
created: 2009-10-22T02:00:00+00:00
modified: 2021-02-18T12:00:00+00:00
broader: Brottslighet

Organiserad brottslighet
type: Concept
definition: Planerad brottslighet som utförs av en samling kriminella i grupp, exempelvis maffia.
in scheme: mediatopic
created: 2009-10-22T02:00:00+00:00
modified: 2021-02-18T12:00:00+00:00
broader: Brottslighet
narrower: Gängbrott

Terrorism
type: Concept
definition: Våld som är ägnat att skrämma många fler än de som direkt drabbas och med syfta att nå politiska eller ideologiska mål.
in scheme: mediatopic
created: 2009-10-22T02:00:00+00:00
modified: 2021-02-18T12:00:00+00:00
broader: Brottslighet

Stöld
type: Concept
definition: Att olagligt ta någon annans egendom.
in scheme: mediatopic
created: 2009-10-22T02:00:00+00:00
modified: 2021-05-05T12:00:00+00:00
broader: Brottslighet

Krigsbrott
type: Concept
definition: Svåra överträdelser av krigets lagar, exempelvis genom användning av förbjudna vapen, order om eller deltagande i tortyr eller annan svår misshandel av krigsfångar eller civila.
in scheme: mediatopic
created: 2009-10-22T02:00:00+00:00
modified: 2024-03-28T12:00:00+00:00
broader: Brottslighet

Trafikbrott
type: Concept
definition: Händelser i trafiken som lett fram till skador, eller kunnat leda fram till skador, där den ansvarige uppträtt brottsligt. Till skillnad från rena olyckshändelser.
in scheme: mediatopic
created: 2019-04-06T12:00:00+00:00
modified: 2021-07-12T12:00:00+00:00
broader: Brottslighet

Människosmuggling och trafficking
type: Concept
definition: Olaglig förflyttning av människor från ett land till ett annat. Om människorna dessutom tvingas till arbete eller utnyttjas sexuellt rubriceras det som trafficking.
in scheme: mediatopic
created: 2019-11-20T12:00:00+00:00
modified: 2021-07-12T12:00:00+00:00
broader: Brottslighet

Vandalism
type: Concept
definition: Att medvetet förstöra annans egendom.
in scheme: mediatopic
created: 2019-11-20T12:00:00+00:00
modified: 2021-07-12T12:00:00+00:00
broader: Brottslighet

Skjutningar
type: Concept
definition: Våld där skjutvapen används.
in scheme: mediatopic
created: 2021-02-18T12:00:00+00:00
modified: 2021-07-12T12:00:00+00:00
broader: Brottslighet

Djurplågeri
type: Concept
definition: Vanvård eller övergrepp mot egna eller andras djur.
in scheme: mediatopic
created: 2021-02-18T12:00:00+00:00
modified: 2021-07-12T12:00:00+00:00
broader: Brottslighet

Tortyr
type: Concept
definition: Handlingar som via fysisk och/eller psykisk smärta eller lidande ska förmå det utsatte att erkänna, svara på frågor, utföra handlingar eller liknande.
in scheme: mediatopic
created: 2021-05-05T12:00:00+00:00
modified: 2021-12-21T12:00:00+00:00
broader: Brottslighet

Våldtäkt
type: Concept
definition: Sexuellt relaterat våld.
in scheme: mediatopic
created: 2009-10-22T02:00:00+00:00
modified: 2021-02-18T12:00:00+00:00
broader: Överfall

Konkurrensbrott
type: Concept
definition: Åtgärder som bryter mot regler och lagar kring fri konkurrens.
in scheme: mediatopic
created: 2009-10-22T02:00:00+00:00
modified: 2021-05-05T12:00:00+00:00
broader: Ekobrott

Avtalsbrott
type: Concept
definition: Brott mot överenskommelser som satts upp i ett kontrakt mellan två eller flera parter.
in scheme: mediatopic
created: 2009-10-22T02:00:00+00:00
modified: 2021-02-18T12:00:00+00:00
broader: Ekobrott

Förskingring
type: Concept
definition: Medveten stöld eller felaktig användning av pengar som man satts att sköta för någon uppdragsgivare.
in scheme: mediatopic
created: 2009-10-22T02:00:00+00:00
modified: 2021-02-18T12:00:00+00:00
broader: Ekobrott

Insiderhandel
type: Concept
definition: Handel med aktier eller andra värdepapper av personer som har tillgång till information som inte är allmänt känd.
in scheme: mediatopic
created: 2009-10-22T02:00:00+00:00
modified: 2021-02-18T12:00:00+00:00
broader: Ekobrott

Konkurrensbegränsningar
type: Concept
definition: Avtal eller samarbeten mellan företag eller personer som syftar till att begränsa konkurrensen.
in scheme: mediatopic
created: 2009-10-22T02:00:00+00:00
modified: 2021-02-18T12:00:00+00:00
broader: Ekobrott

Bokföringsbrott
type: Concept
definition: Brottslighet som inbegriper felaktigt förda noteringar om ett företags eller organisations ekonomi.
in scheme: mediatopic
created: 2019-04-06T12:00:00+00:00
modified: 2021-07-12T12:00:00+00:00
broader: Ekobrott

Mutbrott
type: Concept
definition: Att erbjuda pengar eller annat i utbyte mot tjänster från en person i beslutande ställning.
in scheme: mediatopic
created: 2009-10-22T02:00:00+00:00
modified: 2021-02-18T12:00:00+00:00
broader: Korruption

Narkotikasmuggling
type: Concept
definition: Att illegalt föra droger mellan olika länder.
in scheme: mediatopic
created: 2009-10-22T02:00:00+00:00
modified: 2021-02-18T12:00:00+00:00
broader: Narkotikabrott

Skattebrott
type: Concept
definition: Brottslighet som innehåller olika åtgärder från enskilda individer, företag eller organisationer för att undvika att betala skatt.
in scheme: mediatopic
created: 2019-04-06T12:00:00+00:00
modified: 2021-07-12T12:00:00+00:00
broader: Bedrägeri

Gängbrott
type: Concept
definition: Brottslighet som sker av grupper som har en sammanhållning via exempelvis områden, språk, etnicitet eller bakgrund. Medlemmarna är ofta identifierade genom exempelvis tatueringar och/eller kläder.
in scheme: mediatopic
created: 2009-10-22T02:00:00+00:00
modified: 2021-05-05T12:00:00+00:00
broader: Organiserad brottslighet

Domstol
type: Concept
definition: En instans där rättsfall tas upp och parterna får lägga fram sin respektive syn innan ett avgörande fälls och eventuell påföljd bestäms.
in scheme: mediatopic
created: 2009-10-22T02:00:00+00:00
modified: 2021-02-18T12:00:00+00:00
broader: Rättssystem
narrower: Överklagande av dom
narrower: Domstolspersonal
narrower: Domare (Rättsväsendet)
narrower: Rättegång
narrower: Högre instans
broad match: http://cv.iptc.org/newscodes/subjectcode/02007000

Förlikningar
type: Concept
definition: När ett tvistemål avgörs genom att parterna kommer överens vid sidan av själva domstolen.
in scheme: mediatopic
created: 2009-10-22T02:00:00+00:00
modified: 2021-05-05T12:00:00+00:00
broader: Rättssystem
narrower: Medling
broad match: http://cv.iptc.org/newscodes/subjectcode/02000000

Åtal
type: Concept
definition: Åtgärder som genomförs av åklagare för att få ett utrett fall behandlat av domstol.
in scheme: mediatopic
created: 2009-10-22T02:00:00+00:00
modified: 2021-03-31T12:00:00+00:00
broader: Rättssystem

Överklagande av dom
type: Concept
definition: Åtgärder från en eller båda parter efter ett utslag från en domstol om de inte är nöjda med utslaget.
in scheme: mediatopic
created: 2009-10-22T02:00:00+00:00
modified: 2021-02-18T12:00:00+00:00
broader: Domstol
broad match: http://cv.iptc.org/newscodes/subjectcode/02000000

Domstolspersonal
type: Concept
definition: Personer som är anställda och arbetar i domstolar.
in scheme: mediatopic
created: 2009-10-22T02:00:00+00:00
retired: 2019-10-07T12:00:00+00:00
modified: 2021-05-05T12:00:00+00:00
broader: Domstol

Domare (Rättsväsendet)
type: Concept
definition: Den person eller de personer som leder förhandlingen i domstolen och fäller avgörandet.
in scheme: mediatopic
created: 2009-10-22T02:00:00+00:00
modified: 2024-03-28T12:00:00+00:00
broader: Domstol

Rättegång
type: Concept
definition: Proceduren då ett rättsfall tas upp i en domstol.
in scheme: mediatopic
created: 2009-10-22T02:00:00+00:00
modified: 2021-02-18T12:00:00+00:00
broader: Domstol
narrower: Domstolsförberedelser
narrower: Svarande
narrower: Tvistemål
narrower: Vittne
narrower: Straff

Högre instans
type: Concept
definition: Frågor som hanteras av en högre juridisk instans.
in scheme: mediatopic
created: 2019-11-25T12:00:00+00:00
modified: 2021-07-12T12:00:00+00:00
broader: Domstol

Domstolsförberedelser
type: Concept
definition: Saker som sker som förberedelse innan rättsfallet tas upp i en domstol.
in scheme: mediatopic
created: 2009-10-22T02:00:00+00:00
modified: 2021-05-05T12:00:00+00:00
broader: Rättegång

Svarande
type: Concept
definition: Den som är åtalad i en rättegång och ska svara på anklagelserna.
in scheme: mediatopic
created: 2009-10-22T02:00:00+00:00
retired: 2019-10-07T12:00:00+00:00
modified: 2021-02-18T12:00:00+00:00
broader: Rättegång

Tvistemål
type: Concept
definition: Om två parter är oense, utan att något brottsligt är inblandat, och inte kan komma överens kan det avgöras i en speciell form av rättsprocess.
in scheme: mediatopic
created: 2009-10-22T02:00:00+00:00
modified: 2021-05-05T12:00:00+00:00
broader: Rättegång

Vittne
type: Concept
definition: En person som framträder i domstolen och berättar om sina iaktagelser kring fallet som avgörs.
in scheme: mediatopic
created: 2009-10-22T02:00:00+00:00
retired: 2019-10-07T12:00:00+00:00
modified: 2021-02-18T12:00:00+00:00
broader: Rättegång

Straff
type: Concept
definition: Påföljd mot personer (eller organisationer) som fällts för brott.
in scheme: mediatopic
created: 2009-10-22T02:00:00+00:00
modified: 2021-02-18T12:00:00+00:00
broader: Rättegång
narrower: Dödsstraff
narrower: Böter
narrower: Fängelse
narrower: Rättspsykiatrisk vård
narrower: Villkorlig dom

Medling
type: Concept
definition: När någon neutral utomstående person eller organisation försöker få två tvistande parter att komma överens.
in scheme: mediatopic
created: 2009-10-22T02:00:00+00:00
modified: 2021-12-21T12:00:00+00:00
broader: Förlikningar

Medborgerliga rättigheter
type: Concept
definition: Skydd för individers frihet från kränkningar av regeringar, politiska och sociala organisationer samt andra individer, oftast reglerade i ett lands lagar eller författningar
in scheme: mediatopic
created: 2009-10-22T02:00:00+00:00
modified: 2021-02-18T12:00:00+00:00
broader: Grundläggande rättigheter

Civilrätt
type: Concept
definition: Den del av ett lands lagar som handlar om förhållanden mellan privatpersoner.
in scheme: mediatopic
created: 2009-10-22T02:00:00+00:00
modified: 2021-03-31T12:00:00+00:00
broader: Lag
narrower: Regler

Brottsbalken
type: Concept
definition: Den del av ett lands lagar som handlar om brottslighet.
in scheme: mediatopic
created: 2009-10-22T02:00:00+00:00
modified: 2021-02-18T12:00:00+00:00
broader: Lag

Internationell rätt
type: Concept
definition: Lagar som gäller i hela världen, eller åtminstone i flera länder och inte bara i ett land.
in scheme: mediatopic
created: 2009-10-22T02:00:00+00:00
modified: 2021-02-18T12:00:00+00:00
broader: Lag
narrower: Utlämning
narrower: Internationell domstol

Förvaltningsrätt
type: Concept
definition: Handlägger mål som främst rör tvister mellan enskilda personer och myndigheter
in scheme: mediatopic
created: 2019-04-06T12:00:00+00:00
modified: 2021-07-12T12:00:00+00:00
broader: Lag

Regler
type: Concept
definition: Bestämmelser som främst har med lagstiftning kring företag att göra.
in scheme: mediatopic
created: 2009-10-22T02:00:00+00:00
modified: 2021-03-31T12:00:00+00:00
broader: Civilrätt
narrower: Konkurrensfrågor
broad match: http://cv.iptc.org/newscodes/subjectcode/02006002

Konkurrensfrågor
type: Concept
definition: Saker som gäller konkurrens mellan företag, såsom regler mot monopol och truster.
in scheme: mediatopic
created: 2009-10-22T02:00:00+00:00
modified: 2021-02-18T12:00:00+00:00
broader: Regler

Utlämning
type: Concept
definition: Att flytta en brottsmisstänkt eller dömd brottsling från ett land till ett annat.
in scheme: mediatopic
created: 2009-10-22T02:00:00+00:00
modified: 2021-02-18T12:00:00+00:00
broader: Internationell rätt

Internationell domstol
type: Concept
definition: En domstol som dömer i fall som gäller brott mot internationell lag.
in scheme: mediatopic
created: 2009-10-22T02:00:00+00:00
modified: 2021-12-17T12:00:00+00:00
broader: Internationell rätt

Frihetsberövande
type: Concept
definition: När en person som är misstänkt för något brott infångas eller hindras från att fly.
in scheme: mediatopic
created: 2009-10-22T02:00:00+00:00
modified: 2021-02-18T12:00:00+00:00
broader: Brottsbekämpning

Förundersökning
type: Concept
definition: Åtgärder som genomförs av förundersökningsledare och polis för att klargöra vad som skett, identifiera en eller flera misstänkta och gripa dessa.
in scheme: mediatopic
created: 2009-10-22T02:00:00+00:00
modified: 2021-02-18T12:00:00+00:00
broader: Brottsbekämpning
narrower: Saknad person
narrower: Nedlagd förundersökning

Polis
type: Concept
definition: En instans i samhället som ser till att ordningen upprätthålls, att brottslighet förhindras och utreds när den inträffar.
in scheme: mediatopic
created: 2009-10-22T02:00:00+00:00
modified: 2021-03-31T12:00:00+00:00
broader: Brottsbekämpning

Övervakning
type: Concept
definition: Med hjälp av kameror och datainsamling försöker polisen förbygga brott och avslöja brottslig verksamhet.
in scheme: mediatopic
created: 2020-08-05T12:00:00+00:00
modified: 2021-07-12T12:00:00+00:00
broader: Brottsbekämpning

Saknad person
type: Concept
definition: En person som saknas sedan en tid och söks, mer eller mindre aktivt.
in scheme: mediatopic
created: 2009-10-22T02:00:00+00:00
modified: 2021-02-18T12:00:00+00:00
broader: Förundersökning

Nedlagd förundersökning
type: Concept
definition: När polis och förundersökningsledare bedömer att det inte finns förutsättningar att komma längre med en utredning.
in scheme: mediatopic
created: 2019-04-06T12:00:00+00:00
modified: 2021-07-12T12:00:00+00:00
broader: Förundersökning

Dödsstraff
type: Concept
definition: Påföljd mot en person som fällts för brott där den skyldige mister livet.
in scheme: mediatopic
created: 2009-10-22T02:00:00+00:00
modified: 2021-02-18T12:00:00+00:00
broader: Straff
broad match: http://cv.iptc.org/newscodes/subjectcode/14025005

Böter
type: Concept
definition: En påföljd som innebär att den som fällts får betala en summa pengar.
in scheme: mediatopic
created: 2009-10-22T02:00:00+00:00
modified: 2021-02-18T12:00:00+00:00
broader: Straff

Fängelse
type: Concept
definition: En påföljd som innebär att den som fällts blir inspärrad för en avgränsad tid, eller tills vidare.
in scheme: mediatopic
created: 2009-10-22T02:00:00+00:00
modified: 2021-03-31T12:00:00+00:00
broader: Straff

Rättspsykiatrisk vård
type: Concept
definition: Dom som innebär att den dömde tvingas till någon form av psykiatrisk vård och den exakta tiden hänger på hur vården fungerar och läkares bedömning.
in scheme: mediatopic
created: 2019-04-06T12:00:00+00:00
modified: 2021-07-12T12:00:00+00:00
broader: Straff

Villkorlig dom
type: Concept
definition: Brottspåföljd för ett brott där påföljden inte bedöms kunna stanna vid böter men den dömde inte behöver avtjäna straffet i fängelse.
in scheme: mediatopic
created: 2019-04-06T12:00:00+00:00
modified: 2021-07-12T12:00:00+00:00
broader: Straff

Explosioner
type: Concept
definition: När någon form av sprängmedel detoneras.
in scheme: mediatopic
created: 2009-10-22T02:00:00+00:00
modified: 2021-05-05T12:00:00+00:00
broader: Olyckor och akuta händelser

Arbetsplatsolyckor
type: Concept
definition: Oönskade händelser på arbetsplatser som leder till att personer och/eller egendom skadas.
in scheme: mediatopic
created: 2009-10-22T02:00:00+00:00
modified: 2021-05-05T12:00:00+00:00
broader: Olyckor och akuta händelser
narrower: Kärnkraftsolyckor

Transportolyckor
type: Concept
definition: Oänskade händelser med transportfordon.
in scheme: mediatopic
created: 2009-10-22T02:00:00+00:00
modified: 2021-05-05T12:00:00+00:00
broader: Olyckor och akuta händelser
narrower: Luftfartsolyckor
narrower: Sjöfartsolyckor
narrower: Tågolyckor
narrower: Trafikolyckor

Byggnadsolyckor
type: Concept
definition: Oönskade händelser med byggnadsverk inblandade.
in scheme: mediatopic
created: 2009-10-22T02:00:00+00:00
modified: 2021-02-18T12:00:00+00:00
broader: Olyckor och akuta händelser

Drunkning
type: Concept
definition: När en persons andningssystem fylls med vätska som hindrar andningen och gör att personen avlider eller skadas.
in scheme: mediatopic
created: 2021-05-05T12:00:00+00:00
modified: 2021-12-21T12:00:00+00:00
broader: Olyckor och akuta händelser

Kärnkraftsolyckor
type: Concept
definition: Oönskade händelser på ställen som ingår i produktion av kärnkraft.
in scheme: mediatopic
created: 2009-10-22T02:00:00+00:00
modified: 2021-02-18T12:00:00+00:00
broader: Arbetsplatsolyckor

Luftfartsolyckor
type: Concept
definition: Oönskade händelser med farkoster i luften eller rymden.
in scheme: mediatopic
created: 2009-10-22T02:00:00+00:00
modified: 2021-02-18T12:00:00+00:00
broader: Transportolyckor

Sjöfartsolyckor
type: Concept
definition: Oönskade händelser med en eller flera fordon på vatten.
in scheme: mediatopic
created: 2009-10-22T02:00:00+00:00
modified: 2021-02-18T12:00:00+00:00
broader: Transportolyckor

Tågolyckor
type: Concept
definition: Oönskade händelser med rälsburna fordon.
in scheme: mediatopic
created: 2009-10-22T02:00:00+00:00
modified: 2021-02-18T12:00:00+00:00
broader: Transportolyckor

Trafikolyckor
type: Concept
definition: Oönskade händelser mellan fordon på vägar.
in scheme: mediatopic
created: 2009-10-22T02:00:00+00:00
modified: 2021-02-18T12:00:00+00:00
broader: Transportolyckor
narrower: Viltolycka

Viltolycka
type: Concept
definition: Trafikolycka där vilda djur är inblandade.
in scheme: mediatopic
created: 2019-04-06T12:00:00+00:00
modified: 2021-07-12T12:00:00+00:00
broader: Trafikolyckor

Svält
type: Concept
definition: När en större mängd människor i ett område blir utan mat så deras hälsa hotas.
in scheme: mediatopic
created: 2009-10-22T02:00:00+00:00
modified: 2021-02-18T12:00:00+00:00
broader: Katastrofer

Brand
type: Concept
definition: Större eld som inte är under kontroll och som uppstått genom en olyckshändelse eller är olovligt anlagd.
in scheme: mediatopic
created: 2009-10-22T02:00:00+00:00
modified: 2021-02-18T12:00:00+00:00
broader: Katastrofer
narrower: Skogsbrand

Naturkatastrofer
type: Concept
definition: Olika former av olyckor och skador som orsakas av händelser i naturen.
in scheme: mediatopic
created: 2009-10-22T02:00:00+00:00
modified: 2021-02-18T12:00:00+00:00
broader: Katastrofer
narrower: Torka
narrower: Jordbävningar
narrower: Översvämning
narrower: Jordskred
narrower: Väderkatastrofer
narrower: Vulkanutbrott
narrower: Tsunami

Skogsbrand
type: Concept
definition: Brand som i huvudsak gäller vegetation (skog) som brinner ner.
in scheme: mediatopic
created: 2019-04-06T12:00:00+00:00
modified: 2021-07-12T12:00:00+00:00
broader: Brand

Torka
type: Concept
definition: När vattnet tar slut i ett område och det går så långt att mark och växter tar skada.
in scheme: mediatopic
created: 2009-10-22T02:00:00+00:00
modified: 2021-02-18T12:00:00+00:00
broader: Naturkatastrofer

Jordbävningar
type: Concept
definition: Rörelser i jordens kontinentalplattor som orsakar skador på ytan. Storleken mäts enligt Richterskalan.
in scheme: mediatopic
created: 2009-10-22T02:00:00+00:00
modified: 2021-02-18T12:00:00+00:00
broader: Naturkatastrofer

Översvämning
type: Concept
definition: När vattennivån stiger över marken intill vattendraget. Kan exempelsvis orsakas av snösmältning, kraftigt regn eller havsvågor.
in scheme: mediatopic
created: 2009-10-22T02:00:00+00:00
modified: 2021-02-18T12:00:00+00:00
broader: Naturkatastrofer

Jordskred
type: Concept
definition: När större mängder jord och/eller grus släpper och rasar ned.
in scheme: mediatopic
created: 2009-10-22T02:00:00+00:00
modified: 2021-02-18T12:00:00+00:00
broader: Naturkatastrofer
narrower: Laviner
broad match: http://cv.iptc.org/newscodes/subjectcode/03015002

Väderkatastrofer
type: Concept
definition: Olika former av olyckor och skador som orsakas av vädret.
in scheme: mediatopic
created: 2009-10-22T02:00:00+00:00
modified: 2021-02-18T12:00:00+00:00
broader: Naturkatastrofer
narrower: Stormar
narrower: Orkan

Vulkanutbrott
type: Concept
definition: Utgjutandet och utslungandet av magmatiskt material på jordytan.
in scheme: mediatopic
created: 2009-10-22T02:00:00+00:00
modified: 2021-07-12T12:00:00+00:00
broader: Naturkatastrofer

Tsunami
type: Concept
definition: En tsunami, även kallad flodvåg, är en typ av vattenvåg som uppkommer vid en vertikal förskjutning av stora vattenmassor, i de flesta fall på grund av seismisk aktivitet på havsbottnen.
in scheme: mediatopic
created: 2022-02-03T12:00:00+00:00
modified: 2022-02-03T12:00:00+00:00
broader: Naturkatastrofer

Laviner
type: Concept
definition: När snö samlats på en sluttning och plötsligt släppper och rasar ned.
in scheme: mediatopic
created: 2009-10-22T02:00:00+00:00
modified: 2021-02-18T12:00:00+00:00
broader: Jordskred
broad match: http://cv.iptc.org/newscodes/subjectcode/03015002

Stormar
type: Concept
definition: Väder med mycket hård vind, ofta med förstörelse som följd.
in scheme: mediatopic
created: 2009-10-22T02:00:00+00:00
modified: 2021-05-05T12:00:00+00:00
broader: Väderkatastrofer

Orkan
type: Concept
definition: En typ av tropisk storm där vindstyrkan överstiger 32,7 m/s.
in scheme: mediatopic
created: 2019-10-07T12:00:00+00:00
modified: 2021-07-12T12:00:00+00:00
broader: Väderkatastrofer

http://cv.iptc.org/newscodes/mediatopic/20000162
type: Concept
in scheme: mediatopic
created: 2009-10-22T02:00:00+00:00
retired: 2015-08-27T12:00:00+00:00
modified: 2021-12-21T12:00:00+00:00
broader: http://cv.iptc.org/newscodes/mediatopic/20000160
narrower: http://cv.iptc.org/newscodes/mediatopic/20000163
narrower: http://cv.iptc.org/newscodes/mediatopic/20000164
narrower: http://cv.iptc.org/newscodes/mediatopic/20000165
narrower: http://cv.iptc.org/newscodes/mediatopic/20000166
broad match: http://cv.iptc.org/newscodes/subjectcode/03010000

http://cv.iptc.org/newscodes/mediatopic/20000163
type: Concept
in scheme: mediatopic
created: 2009-10-22T02:00:00+00:00
retired: 2015-08-27T12:00:00+00:00
modified: 2021-12-21T12:00:00+00:00
broader: http://cv.iptc.org/newscodes/mediatopic/20000162
broad match: http://cv.iptc.org/newscodes/subjectcode/03010003

http://cv.iptc.org/newscodes/mediatopic/20000164
type: Concept
in scheme: mediatopic
created: 2009-10-22T02:00:00+00:00
retired: 2015-08-27T12:00:00+00:00
modified: 2021-12-21T12:00:00+00:00
broader: http://cv.iptc.org/newscodes/mediatopic/20000162
broad match: http://cv.iptc.org/newscodes/subjectcode/03010004

http://cv.iptc.org/newscodes/mediatopic/20000165
type: Concept
in scheme: mediatopic
created: 2009-10-22T02:00:00+00:00
retired: 2015-08-27T12:00:00+00:00
modified: 2021-12-21T12:00:00+00:00
broader: http://cv.iptc.org/newscodes/mediatopic/20000162
broad match: http://cv.iptc.org/newscodes/subjectcode/03010002

http://cv.iptc.org/newscodes/mediatopic/20000166
type: Concept
in scheme: mediatopic
created: 2009-10-22T02:00:00+00:00
retired: 2015-08-27T12:00:00+00:00
modified: 2021-12-21T12:00:00+00:00
broader: http://cv.iptc.org/newscodes/mediatopic/20000162
broad match: http://cv.iptc.org/newscodes/subjectcode/03010001

Företagsekonomi
type: Concept
definition: Ett företags ekonomiska situation.
in scheme: mediatopic
created: 2009-10-22T02:00:00+00:00
retired: 2023-03-31T12:00:00+00:00
modified: 2023-03-31T12:00:00+00:00
broader: Företagsinformation
narrower: Aktieanalyser
broad match: http://cv.iptc.org/newscodes/subjectcode/04000000

Nyemissioner
type: Concept
definition: Erbjudande om försäljning av nyutgivna aktier, till exempel i samband med en börsintroduktion, för att kapitalisera ett bolag.
in scheme: mediatopic
created: 2009-10-22T02:00:00+00:00
modified: 2023-03-31T12:00:00+00:00
broader: Företagsinformation
narrower: Konkurser
narrower: Finansiella svårigheter
narrower: Omstruktureringar
narrower: Säkerheter
narrower: Aktier
narrower: Crowfunding
narrower: Obligation

Personal
type: Concept
definition: Personer som jobbar för ett företag och hur de hanteras.
in scheme: mediatopic
created: 2009-10-22T02:00:00+00:00
modified: 2021-02-18T12:00:00+00:00
broader: Företagsinformation
narrower: Nedskärningar
narrower: Företagsledning
broad match: http://cv.iptc.org/newscodes/subjectcode/09000000

Marknadsföringsstrategi
type: Concept
definition: Planering av ett företags mål och försäljning av dess varor och tjänster för att uppnå målen.
in scheme: mediatopic
created: 2009-10-22T02:00:00+00:00
modified: 2023-03-31T12:00:00+00:00
broader: Företagsinformation
narrower: Affärsavtal
narrower: Global handel
narrower: Licensavtal
narrower: Ny produkt eller tjänst
narrower: Patent, upphovsrätt och varumärke
narrower: Produktåterkallelse
narrower: Forskning och utveckling
narrower: Marknadsundersökningar
narrower: Marknadstrender
narrower: Offentlig upphandling
narrower: Kundvård
narrower: Outsourcing
broad match: http://cv.iptc.org/newscodes/subjectcode/04016029

Bolagsstyrning
type: Concept
definition: Tankegångar och bestämmelser om hur bolag ska ägas och styras.
in scheme: mediatopic
created: 2009-10-22T02:00:00+00:00
modified: 2023-03-31T12:00:00+00:00
broader: Företagsinformation
narrower: Stämmohandlingar
narrower: Aktieägare
narrower: Bolagsstämma
narrower: Årsredovisning
narrower: Bolagsstyrelse
narrower: Hållbarhet
broad match: http://cv.iptc.org/newscodes/subjectcode/04016027

Delårsrapport
type: Concept
definition: Regelbunden redovisning av hur ett företag utvecklas.
in scheme: mediatopic
created: 2023-03-31T12:00:00+00:00
modified: 2023-03-31T12:00:00+00:00
broader: Företagsinformation
narrower: Redovisning och revision
narrower: Kreditvärdering
narrower: Finansiella resultat
narrower: Resultatprognoser
narrower: Bokslut

Företagsombildning
type: Concept
definition: Ändring av ett företags eller organisations struktur.
in scheme: mediatopic
created: 2023-03-31T12:00:00+00:00
modified: 2023-03-31T12:00:00+00:00
broader: Företagsinformation
narrower: Företagsavknoppning
narrower: Samriskföretag
narrower: Företagsuppköp genom lån
narrower: Företagsuppköp av ledningen
narrower: Fusioner och förvärv

Aktieanalyser
type: Concept
definition: Råd om och analyser av aktier och fonder.
in scheme: mediatopic
created: 2009-10-22T02:00:00+00:00
retired: 2023-03-31T12:00:00+00:00
modified: 2023-03-31T12:00:00+00:00
broader: Företagsekonomi

Redovisning och revision
type: Concept
definition: Registrering av ett företags eller en organisations inkomster, utgifter, skulder och tillgångar samt kontroll av detta.
in scheme: mediatopic
created: 2009-10-22T02:00:00+00:00
retired: 2023-03-31T12:00:00+00:00
modified: 2023-03-31T12:00:00+00:00
broader: Delårsrapport

Konkurser
type: Concept
definition: Nyheter om konkursansökningar.
in scheme: mediatopic
created: 2009-10-22T02:00:00+00:00
modified: 2023-03-31T12:00:00+00:00
broader: Nyemissioner

Aktieåterköp
type: Concept
definition: Program där ett bolag köper tillbaka aktier i det egna bolaget från aktieägarna.
in scheme: mediatopic
created: 2009-10-22T02:00:00+00:00
modified: 2023-03-31T12:00:00+00:00
broader: Aktier

Aktier
type: Concept
definition: Andel med fast storlek i aktiebolag lika stor som alla andra andelar, ger rösträtt på bolagsstämma och del i vinst.
in scheme: mediatopic
created: 2009-10-22T02:00:00+00:00
modified: 2024-07-01T12:00:00+00:00
broader: Nyemissioner
narrower: Aktieåterköp
narrower: Aktieutdelningar
narrower: Aktiehändelser
narrower: Börsnotering
narrower: Derivat
narrower: Aktieråd
narrower: Aktierusning

Kreditvärdering
type: Concept
definition: Granskning av en juridisk person för att bedöma dess ekonomiska status och förmåga att klara lån.
in scheme: mediatopic
created: 2009-10-22T02:00:00+00:00
modified: 2023-03-31T12:00:00+00:00
broader: Delårsrapport

Aktieutdelningar
type: Concept
definition: Besked om utbetalning av aktieutdelning.
in scheme: mediatopic
created: 2009-10-22T02:00:00+00:00
modified: 2023-03-31T12:00:00+00:00
broader: Aktier

Finansiella resultat
type: Concept
definition: Rapporter om företags finansiella resultat.
in scheme: mediatopic
created: 2009-10-22T02:00:00+00:00
modified: 2023-03-31T12:00:00+00:00
broader: Delårsrapport

Resultatprognoser
type: Concept
definition: Analytikers förväntningar på företags finansiella resultat.
in scheme: mediatopic
created: 2009-10-22T02:00:00+00:00
retired: 2023-03-31T12:00:00+00:00
modified: 2023-03-31T12:00:00+00:00
broader: Delårsrapport

Bokslut
type: Concept
definition: Sammanställning av en juridisk persons ekonomiska ställning gällande helår eller delar av året.
in scheme: mediatopic
created: 2009-10-22T02:00:00+00:00
modified: 2023-03-31T12:00:00+00:00
broader: Delårsrapport

Stämmohandlingar
type: Concept
definition: Publicering av handlingar inför en bolagsstämma.
in scheme: mediatopic
created: 2009-10-22T02:00:00+00:00
modified: 2023-03-31T12:00:00+00:00
broader: Bolagsstyrning

Finansiella svårigheter
type: Concept
definition: Indikationer på att ett företag har det finansiellt svårt, men inte har ansökt om konkurs ännu.
in scheme: mediatopic
created: 2009-10-22T02:00:00+00:00
modified: 2023-03-31T12:00:00+00:00
broader: Nyemissioner

Omstruktureringar
type: Concept
definition: Förändring av ett företags struktur, exempelvis genom försäljning eller nedläggning av delar av verksamheten.
in scheme: mediatopic
created: 2009-10-22T02:00:00+00:00
retired: 2023-10-02T12:00:00+00:00
modified: 2023-10-02T12:00:00+00:00
broader: Nyemissioner

Säkerheter
type: Concept
definition: Marknad för aktier och obligationer.
in scheme: mediatopic
created: 2009-10-22T02:00:00+00:00
retired: 2023-03-31T12:00:00+00:00
modified: 2023-03-31T12:00:00+00:00
broader: Nyemissioner
narrower: Aktieoptioner

Crowfunding
type: Concept
definition: Metod för att finansiera projekt genom att många personer ställer upp med lite pengar var, ofta i utbyte mot en tidig version av det som ska produceras.
in scheme: mediatopic
created: 2020-08-05T12:00:00+00:00
modified: 2023-03-31T12:00:00+00:00
broader: Nyemissioner

Obligation
type: Concept
definition: Ett räntebärande löpande skuldebrev som visar att innehavaren lånat ut pengar till staten, kommuner eller större företag.
in scheme: mediatopic
created: 2024-03-28T12:00:00+00:00
modified: 2024-03-28T12:00:00+00:00
broader: Nyemissioner

Aktieägare
type: Concept
definition: Innehavare av en eller flera aktier i ett företag.
in scheme: mediatopic
created: 2009-10-22T02:00:00+00:00
modified: 2023-03-31T12:00:00+00:00
broader: Bolagsstyrning

Aktiehändelser
type: Concept
definition: Kungörelser om stora aktiehändelser, såsom delningar, stoppad handel, nya topp- och bottennoteringar med mera.
in scheme: mediatopic
created: 2009-10-22T02:00:00+00:00
modified: 2023-03-31T12:00:00+00:00
broader: Aktier

Börsnotering
type: Concept
definition: Ett företag ger ut aktier till allmänheten för första gången, kallas även börsintroduktion.
in scheme: mediatopic
created: 2009-10-22T02:00:00+00:00
modified: 2021-02-18T12:00:00+00:00
broader: Aktier
broad match: http://cv.iptc.org/newscodes/subjectcode/04016019

Nedskärningar
type: Concept
definition: Planerade eller faktiska minskningar av personalstyrkan.
in scheme: mediatopic
created: 2009-10-22T02:00:00+00:00
modified: 2021-05-05T12:00:00+00:00
broader: Personal

Företagsledning
type: Concept
definition: Nyheter om vd och andra ledande befattningar i ett företag, inklusive nyutnämningar och förändringar.
in scheme: mediatopic
created: 2009-10-22T02:00:00+00:00
modified: 2023-03-31T12:00:00+00:00
broader: Personal
broad match: http://cv.iptc.org/newscodes/subjectcode/04016028

Aktieoptioner
type: Concept
definition: Rätt, men inte skyldighet, för en anställd i ett företag att köpa eller sälja aktier till ett visst pris vid eller före en viss tidpunkt.
in scheme: mediatopic
created: 2009-10-22T02:00:00+00:00
retired: 2023-03-31T12:00:00+00:00
modified: 2023-03-31T12:00:00+00:00
broader: Säkerheter

Affärsavtal
type: Concept
definition: Kontrakt avseende kommersiella aktiviteter.
in scheme: mediatopic
created: 2009-10-22T02:00:00+00:00
modified: 2021-02-18T12:00:00+00:00
broader: Marknadsföringsstrategi

Global handel
type: Concept
definition: Affärer som sker mellan parter i olika länder.
in scheme: mediatopic
created: 2009-10-22T02:00:00+00:00
modified: 2021-02-18T12:00:00+00:00
broader: Marknadsföringsstrategi

Licensavtal
type: Concept
definition: Ett kontrakt som definierar villkoren för användning av någon annans immateriella egendom.
in scheme: mediatopic
created: 2009-10-22T02:00:00+00:00
retired: 2023-03-31T12:00:00+00:00
modified: 2023-03-31T12:00:00+00:00
broader: Marknadsföringsstrategi

Ny produkt eller tjänst
type: Concept
definition: En vara eller tjänst som inte tidigare har erbjudits marknaden.
in scheme: mediatopic
created: 2009-10-22T02:00:00+00:00
modified: 2023-03-31T12:00:00+00:00
broader: Marknadsföringsstrategi
broad match: http://cv.iptc.org/newscodes/subjectcode/04016030

Patent, upphovsrätt och varumärke
type: Concept
definition: Ensamrätt att exploatera en uppfinning, laglig rätt för upphovsman att ensam bestämma över användningen av sitt verk och lagligen skyddat namn eller kännetecken på varor och tjänster från en viss näringsidkare.
in scheme: mediatopic
created: 2009-10-22T02:00:00+00:00
modified: 2023-03-31T12:00:00+00:00
broader: Marknadsföringsstrategi

Produktåterkallelse
type: Concept
definition: Ett beslut av ett företag att ta tillbaka eller reparera en defekt produkt.
in scheme: mediatopic
created: 2009-10-22T02:00:00+00:00
modified: 2021-02-18T12:00:00+00:00
broader: Marknadsföringsstrategi

Forskning och utveckling
type: Concept
definition: Process som genom systematiskt arbete kan frambringa nya kunskaper och ökat vetande kring en produkt eller tjänst.
in scheme: mediatopic
created: 2009-10-22T02:00:00+00:00
modified: 2021-02-18T12:00:00+00:00
broader: Marknadsföringsstrategi

Marknadsundersökningar
type: Concept
definition: Undersökning av möjligheterna att sälja en viss vara eller tjänst.
in scheme: mediatopic
created: 2009-10-22T02:00:00+00:00
modified: 2023-03-31T12:00:00+00:00
broader: Marknadsföringsstrategi

Marknadstrender
type: Concept
definition: Utvecklingsriktning styrd av konsumentbeteende.
in scheme: mediatopic
created: 2009-10-22T02:00:00+00:00
modified: 2023-03-31T12:00:00+00:00
broader: Marknadsföringsstrategi

Offentlig upphandling
type: Concept
definition: Ett avtal, ingått efter ett formaliserat förfarande, om förvärv av varor eller nyttigheter där det allmänna (stat, landsting, kommun eller annan offentlig myndighet) står som beställare.
in scheme: mediatopic
created: 2016-04-04T12:00:00+00:00
modified: 2021-07-12T12:00:00+00:00
broader: Marknadsföringsstrategi

Kundvård
type: Concept
definition: Skapandet och upprätthållandet av relationer till kunder för att öka försäljningen.
in scheme: mediatopic
created: 2016-04-04T12:00:00+00:00
modified: 2023-03-31T12:00:00+00:00
broader: Marknadsföringsstrategi

Outsourcing
type: Concept
definition: Metod där företag eller organisationer anlitar ett annat företag för att sköta vissa delar av den egna verksamheten.
in scheme: mediatopic
created: 2020-08-05T12:00:00+00:00
modified: 2021-07-12T12:00:00+00:00
broader: Marknadsföringsstrategi

Bolagsstämma
type: Concept
definition: Sammanträde med bolagets aktieägare, högsta beslutande organ i ett aktiebolag.
in scheme: mediatopic
created: 2009-10-22T02:00:00+00:00
modified: 2023-03-31T12:00:00+00:00
broader: Bolagsstyrning

Årsredovisning
type: Concept
definition: Sammanställning av ett företags räkenskaper och information om dess förvaltning under ett räkenskapsår.
in scheme: mediatopic
created: 2009-10-22T02:00:00+00:00
modified: 2023-03-31T12:00:00+00:00
broader: Bolagsstyrning

Bolagsstyrelse
type: Concept
definition: Utnämningar till eller förändringar i den grupp som tar de övergripande besluten i ett företag.
in scheme: mediatopic
created: 2009-10-22T02:00:00+00:00
modified: 2023-03-31T12:00:00+00:00
broader: Bolagsstyrning

Företagsavknoppning
type: Concept
definition: Skapandet av nya företag genom avknoppningar från befintliga företag.
in scheme: mediatopic
created: 2009-10-22T02:00:00+00:00
modified: 2023-03-31T12:00:00+00:00
broader: Företagsombildning

Hållbarhet
type: Concept
definition: Ett företags riktlinjer för ansvarsfullt arbete mot samhälle, etik och miljö.
in scheme: mediatopic
created: 2019-04-06T12:00:00+00:00
modified: 2023-03-31T12:00:00+00:00
broader: Bolagsstyrning

Samriskföretag
type: Concept
definition: Ett bolag som samägs av två eller fler företag.
in scheme: mediatopic
created: 2009-10-22T02:00:00+00:00
modified: 2023-03-31T12:00:00+00:00
broader: Företagsombildning

Företagsuppköp genom lån
type: Concept
definition: Att ta kontrollen över ett företag genom att köpa dess aktier för lånade pengar.
in scheme: mediatopic
created: 2009-10-22T02:00:00+00:00
modified: 2023-03-31T12:00:00+00:00
broader: Företagsombildning

Företagsuppköp av ledningen
type: Concept
definition: Att företagsledningen tar kontrollen över ett företag genom att köpa aktierna i företaget.
in scheme: mediatopic
created: 2009-10-22T02:00:00+00:00
modified: 2023-03-31T12:00:00+00:00
broader: Företagsombildning
broad match: http://cv.iptc.org/newscodes/subjectcode/04000000

Fusioner och förvärv
type: Concept
definition: Två eller fler företag som bildar ett nytt företag genom fusion, övertagande eller förvärv.
in scheme: mediatopic
created: 2009-10-22T02:00:00+00:00
modified: 2023-03-31T12:00:00+00:00
broader: Företagsombildning

Naturbruk
type: Concept
definition: Processer kring att framställa naturliga material för konsumtion.
in scheme: mediatopic
created: 2009-10-22T02:00:00+00:00
modified: 2023-03-31T12:00:00+00:00
broader: Näringsliv
narrower: Vattenodling
narrower: Jordbruk
narrower: Djurhållning
narrower: Vinodling

Fiskerinäring
type: Concept
definition: Uppfödning eller insamlande av fisk.
in scheme: mediatopic
created: 2009-10-22T02:00:00+00:00
modified: 2023-03-31T12:00:00+00:00
broader: Näringsliv

Skogsbruk
type: Concept
definition: Verksamhet där skog utnyttjas för produktion av virke för efterföljande bearbetning och användning.
in scheme: mediatopic
created: 2009-10-22T02:00:00+00:00
modified: 2023-03-31T12:00:00+00:00
broader: Näringsliv

Kemisk industri
type: Concept
definition: Naturliga eller skapade ämnen som används för att producera annat material.
in scheme: mediatopic
created: 2009-10-22T02:00:00+00:00
modified: 2021-02-18T12:00:00+00:00
broader: Näringsliv
narrower: Gödningsmedel
narrower: Hälso- och skönhetsprodukter
narrower: Mineraler & metaller
narrower: Organisk kemi
narrower: http://cv.iptc.org/newscodes/mediatopic/20001395

Plaster och syntetiska kemikalier
type: Concept
definition: Naturliga eller skapade ämnen som används för att framställa plast och andra konstgjorda substanser som används inom tillverkningsindustrin.
in scheme: mediatopic
created: 2009-10-22T02:00:00+00:00
modified: 2023-03-31T12:00:00+00:00
broader: Näringsliv

Informationsteknologi
type: Concept
definition: Saker som handlar om databearbetning eller överföring av information mellan datorer.
in scheme: mediatopic
created: 2009-10-22T02:00:00+00:00
modified: 2023-03-31T12:00:00+00:00
broader: Näringsliv
narrower: Hårdvara
narrower: Datanätverk
narrower: Satellitteknik
narrower: Datasäkerhet
narrower: Kretskort och datorkomponenter
narrower: Mjukvara
narrower: Telekomutrustning
narrower: Telekomtjänster
narrower: Trådlös teknik
narrower: Internet of Things

Fastighets- och byggnadsindustri
type: Concept
definition: Allt som handlar om byggnader samt bygge, underhåll, förvaltning, uthyrning och försäljning av dem.
in scheme: mediatopic
created: 2009-10-22T02:00:00+00:00
modified: 2021-02-18T12:00:00+00:00
broader: Näringsliv
narrower: Stadsbyggnad
narrower: Jordbruksfastigheter
narrower: Infrastrukturbyggnad
narrower: Husbyggnad
narrower: Markpriser
narrower: Fastigheter
narrower: Byggmaterial
narrower: Infrastruktur
narrower: Företagsbyggnader
narrower: Bostadsbyggande

Konsumentvaror
type: Concept
definition: Varor som produceras för och säljs till individer.
in scheme: mediatopic
created: 2009-10-22T02:00:00+00:00
modified: 2021-02-18T12:00:00+00:00
broader: Näringsliv
narrower: Drycker
narrower: Kläder
narrower: Mat
narrower: Lyxvaror
narrower: Förbrukningsvaror
narrower: Leksaker
narrower: Livsmedelsindustri
narrower: Inredning och möbler
narrower: Tobak
narrower: Hantverk
narrower: Husdjursprodukter och -tjänster
narrower: Konsumentelektronik

Energi och naturtillgångar
type: Concept
definition: Användning av naturtillgångar för affärsändamål som produktion och energiutvinning.
in scheme: mediatopic
created: 2009-10-22T02:00:00+00:00
modified: 2023-03-31T12:00:00+00:00
broader: Näringsliv
narrower: Alternativ energi
narrower: Kol
narrower: Energiindustri
narrower: Kärnkraft
narrower: Olja och gas, leverans
narrower: Olja och gas, utvinning
narrower: Biobränsle
narrower: Olja och gas

Finans- och affärstjänster
type: Concept
definition: Tjänster som överför, vaktar eller håller koll på pengar och andra finansiella instrument eller utgör backup för kommersiella företag.
in scheme: mediatopic
created: 2009-10-22T02:00:00+00:00
retired: 2023-03-31T12:00:00+00:00
modified: 2023-03-31T12:00:00+00:00
broader: Näringsliv
narrower: Begravningsfirmor
narrower: Privatekonomi
narrower: Privatinkomster
narrower: Tryckerier

Verkstadsindustri
type: Concept
definition: Tillverkare av elektrisk, elektronisk och mekanisk utrustning.
in scheme: mediatopic
created: 2009-10-22T02:00:00+00:00
modified: 2021-02-18T12:00:00+00:00
broader: Näringsliv
narrower: Flyg- och rymdindustri
narrower: Bilindustri
narrower: Försvarsindustri
narrower: Elutrustningar
narrower: Tunga maskiner
narrower: Komponenttillverkning
narrower: Mätinstrumenttillverkning
narrower: Maskintillverkning
narrower: Varvsindustri
narrower: Kapitalvaror
narrower: Järnvägsindustrin

Medier
type: Concept
definition: Olika sätt att distribuera och presentera nyheter för allmänheten.
in scheme: mediatopic
created: 2009-10-22T02:00:00+00:00
modified: 2023-03-31T12:00:00+00:00
broader: Näringsliv
narrower: Reklam
narrower: Förlagsindustrin
narrower: Filmindustrin
narrower: Musikindustrin
narrower: Nyhetsbyråer
narrower: Dagstidningar och magasin
narrower: Internetbaserade medier
narrower: Pr
narrower: Radioindustrin
narrower: Satellit- och kabelleverantörer
narrower: Tv-industrin
narrower: Streamingtjänster
narrower: Podcast
narrower: Nyhetsindustrin

Metaller och mineraler
type: Concept
definition: Anrikning av malm för att producera metaller
in scheme: mediatopic
created: 2009-10-22T02:00:00+00:00
modified: 2023-03-31T12:00:00+00:00
broader: Näringsliv
narrower: Guld och värdefulla metaller
narrower: Järn och stål
narrower: Gruvdrift
narrower: Icke-järnmetall

Processindustri
type: Concept
definition: Den kommersiella verksamhet som omvandlar råmaterial till användbara produkter.
in scheme: mediatopic
created: 2009-10-22T02:00:00+00:00
retired: 2023-03-31T12:00:00+00:00
modified: 2023-03-31T12:00:00+00:00
broader: Näringsliv
narrower: Destillerier och bryggerier
narrower: Papper
narrower: Gummi
narrower: Ej alkoholhaltig dryck
narrower: Kläder och textilier
narrower: E-cigaretter

Turistindustri
type: Concept
definition: Industrin kring turism och fritidssysselsättningar.
in scheme: mediatopic
created: 2009-10-22T02:00:00+00:00
modified: 2023-03-31T12:00:00+00:00
broader: Näringsliv
narrower: Casinon
narrower: Hotell och logi
narrower: Sport- och fritidsprodukter
narrower: Restaurang och catering
narrower: Researrangörer

Transport
type: Concept
definition: Olika sätt att förflytta folk och varor från en plats till en annan.
in scheme: mediatopic
created: 2009-10-22T02:00:00+00:00
modified: 2023-03-31T12:00:00+00:00
broader: Näringsliv
narrower: Flygtransport
narrower: Järnvägstransport
narrower: Vägtransport
narrower: Trafik
narrower: Sjötransport
narrower: Logistik
narrower: Kollektivtrafik
narrower: Taxitjänster
narrower: Mobilitetspool

Samhällsservice
type: Concept
definition: Grundläggande service från det offentliga mot innevånarna, exempelvis vatten, sophämtning mm.
in scheme: mediatopic
created: 2019-07-25T12:00:00+00:00
modified: 2023-03-31T12:00:00+00:00
broader: Näringsliv
narrower: Elproduktion och -distribution
narrower: Avfallshantering och bekämpning av föroreningar
narrower: Färskvattenförsörjning
narrower: Värme och ventilation

Försäljningskanaler
type: Concept
definition: Olika sätt för säljare och leverantörer av varor att nå konsumenterna.
in scheme: mediatopic
created: 2019-11-25T12:00:00+00:00
modified: 2023-03-31T12:00:00+00:00
broader: Näringsliv
narrower: Detaljhandel
narrower: Grossister
narrower: Auktionstjänster

Hälsovårdsproduktion
type: Concept
definition: Tillverkning av hjälpmedel och tjänster för att behandla patienter förebyggande, läkande och palliativt.
in scheme: mediatopic
created: 2022-06-14T12:00:00+00:00
modified: 2022-06-14T12:00:00+00:00
broader: Näringsliv
narrower: Bioteknik
narrower: Läkemedelsproduktion
narrower: Vårdgivare
narrower: Medicinsk utrustning

Finansiella tjänster
type: Concept
definition: Professionella tjänster för att hjälpa till med investeringar, lån och ekonomisk rådgivning.
in scheme: mediatopic
created: 2023-03-31T12:00:00+00:00
modified: 2023-03-31T12:00:00+00:00
broader: Näringsliv
narrower: Bokföring och revision
narrower: Banker
narrower: Försäkringar
narrower: Ekonomisk rådgivning
narrower: Privata investeringar
narrower: Aktiemäklande
narrower: Lån
narrower: Kapitalförvaltare

Företagsservice
type: Concept
definition: Tjänster som erbjuds i första hand företag som exempelvis konsulttjänster, juridisk representation och bemanning.
in scheme: mediatopic
created: 2023-03-31T12:00:00+00:00
modified: 2023-03-31T12:00:00+00:00
broader: Näringsliv
narrower: Konsulter
narrower: Bemanningsföretag
narrower: Fastighetsskötsel
narrower: Juridiska tjänster
narrower: Skönhetsindustri
narrower: Uthyrningsfirmor
narrower: Bud- och transporttjänster
narrower: Bröllopstjänster
narrower: Mässor
narrower: Betalningstjänster

Vattenodling
type: Concept
definition: Odling i vatten av fisk, skaldjur och alger.
in scheme: mediatopic
created: 2009-10-22T02:00:00+00:00
retired: 2023-03-31T12:00:00+00:00
modified: 2023-03-31T12:00:00+00:00
broader: Naturbruk

Jordbruk
type: Concept
definition: Utnyttjande av mark till åkerbruk eller bete för produktion av livsmedel, fodermedel och råvaror till energiändamål eller till vidare industriell förädling eller beredning.
in scheme: mediatopic
created: 2009-10-22T02:00:00+00:00
retired: 2023-03-31T12:00:00+00:00
modified: 2023-03-31T12:00:00+00:00
broader: Naturbruk

Djurhållning
type: Concept
definition: Uppfödning av djur för framställning av mat.
in scheme: mediatopic
created: 2009-10-22T02:00:00+00:00
retired: 2023-03-31T12:00:00+00:00
modified: 2023-03-31T12:00:00+00:00
broader: Naturbruk

Vinodling
type: Concept
definition: Framställandet av vin, från vinrankan till den färdiga produkten.
in scheme: mediatopic
created: 2009-10-22T02:00:00+00:00
retired: 2023-03-31T12:00:00+00:00
modified: 2023-03-31T12:00:00+00:00
broader: Naturbruk

Gödningsmedel
type: Concept
definition: Naturligt eller tillverkat material som på olika sätt och i olika former tillförs jorden för att öka dess avkastning.
in scheme: mediatopic
created: 2009-10-22T02:00:00+00:00
retired: 2023-03-31T12:00:00+00:00
modified: 2023-03-31T12:00:00+00:00
broader: Kemisk industri

Hälso- och skönhetsprodukter
type: Concept
definition: Kemikalier och andra substanser som använd för att framhäva en persons utssende eller doft.
in scheme: mediatopic
created: 2009-10-22T02:00:00+00:00
retired: 2023-03-31T12:00:00+00:00
modified: 2023-03-31T12:00:00+00:00
broader: Kemisk industri

Mineraler & metaller
type: Concept
definition: Den del av kemin som handlar om mineraler och metaller.
in scheme: mediatopic
created: 2009-10-22T02:00:00+00:00
retired: 2023-03-31T12:00:00+00:00
modified: 2023-03-31T12:00:00+00:00
broader: Kemisk industri

Organisk kemi
type: Concept
definition: Den del av kemin som handlar om människor, djur och kolbaserade substanser.
in scheme: mediatopic
created: 2009-10-22T02:00:00+00:00
retired: 2023-03-31T12:00:00+00:00
modified: 2023-03-31T12:00:00+00:00
broader: Kemisk industri

http://cv.iptc.org/newscodes/mediatopic/20001395
type: Concept
in scheme: mediatopic
created: 2025-10-09T12:00:00+00:00
modified: 2025-10-09T12:00:00+00:00
broader: Kemisk industri

Bioteknik
type: Concept
definition: Det tekniska utnyttjandet av celler och cellbeståndsdelar för att framställa eller modifiera produkter, som används inom samhällssektorer som hälsovård, livsmedelshantering och jordbruk.
in scheme: mediatopic
created: 2009-10-22T02:00:00+00:00
modified: 2022-06-14T12:00:00+00:00
broader: Hälsovårdsproduktion

Läkemedelsproduktion
type: Concept
definition: Framställandet av mediciner ur diverse kemikalier och naturliga substanser.
in scheme: mediatopic
created: 2009-10-22T02:00:00+00:00
modified: 2023-03-31T12:00:00+00:00
broader: Hälsovårdsproduktion

Hårdvara
type: Concept
definition: Maskinell utrustning i dataanläggning, det vill säga själva maskinen, skivminnen, terminaler med mera.
in scheme: mediatopic
created: 2009-10-22T02:00:00+00:00
modified: 2023-03-31T12:00:00+00:00
broader: Informationsteknologi

Datanätverk
type: Concept
definition: Kommunikations
in scheme: mediatopic
created: 2009-10-22T02:00:00+00:00
retired: 2023-03-31T12:00:00+00:00
modified: 2023-03-31T12:00:00+00:00
broader: Informationsteknologi

Satellitteknik
type: Concept
definition: Hårdvara och mjukvara som möjliggör kommunikation mellan apparater placerade på jorden och satelliter i omloppsbana runt jorden.
in scheme: mediatopic
created: 2009-10-22T02:00:00+00:00
modified: 2021-05-05T12:00:00+00:00
broader: Informationsteknologi

Datasäkerhet
type: Concept
definition: Allt som rör säkerhet för it-system.
in scheme: mediatopic
created: 2009-10-22T02:00:00+00:00
retired: 2023-03-31T12:00:00+00:00
modified: 2023-03-31T12:00:00+00:00
broader: Informationsteknologi

Kretskort och datorkomponenter
type: Concept
definition: Grundläggande komponenter som tillsammans blir fungerande elektriska apparater som t ex datorer.
in scheme: mediatopic
created: 2009-10-22T02:00:00+00:00
modified: 2023-03-31T12:00:00+00:00
broader: Informationsteknologi

Mjukvara
type: Concept
definition: Datorprogram som, vid installation i hårdvara, utför specificerade funktioner.
in scheme: mediatopic
created: 2009-10-22T02:00:00+00:00
modified: 2023-03-31T12:00:00+00:00
broader: Informationsteknologi

Telekomutrustning
type: Concept
definition: Varor som underlättar överföring av data eller röstmeddelanden, t ex telefoner, växlar och modem.
in scheme: mediatopic
created: 2009-10-22T02:00:00+00:00
retired: 2023-03-31T12:00:00+00:00
modified: 2023-03-31T12:00:00+00:00
broader: Informationsteknologi

Telekomtjänster
type: Concept
definition: Tjänster som tillhandahålls av kommersiella företag för att underlätta kommunikationen mellan telefoner eller datorer.
in scheme: mediatopic
created: 2009-10-22T02:00:00+00:00
modified: 2023-03-31T12:00:00+00:00
broader: Informationsteknologi

Trådlös teknik
type: Concept
definition: Överföring av information på andra sätt än genom kablar.
in scheme: mediatopic
created: 2009-10-22T02:00:00+00:00
modified: 2024-07-01T12:00:00+00:00
broader: Informationsteknologi

Internet of Things
type: Concept
definition: Vardagsföremål som hushållsapparater, kläder och accessoarer, men även maskiner, fordon och byggnader, med inbyggd elektronik och internetuppkoppling, vilket gör att de kan styras eller utbyta data över nätet.
in scheme: mediatopic
created: 2016-04-04T12:00:00+00:00
retired: 2023-03-31T12:00:00+00:00
modified: 2023-03-31T12:00:00+00:00
broader: Informationsteknologi

Stadsbyggnad
type: Concept
definition: Utredning genomförd av ingenjörer och arkitekter som beskriver var och hur något ska byggas, t ex vägar, kontorsbyggnader och fabriker.
in scheme: mediatopic
created: 2009-10-22T02:00:00+00:00
retired: 2023-03-31T12:00:00+00:00
modified: 2023-03-31T12:00:00+00:00
broader: Fastighets- och byggnadsindustri

Jordbruksfastigheter
type: Concept
definition: Jordbruksområden för produktion av livsmedel, inklusive mjölkprodukter, frukt, boskap och fisk.
in scheme: mediatopic
created: 2009-10-22T02:00:00+00:00
retired: 2019-10-07T12:00:00+00:00
modified: 2023-03-31T12:00:00+00:00
broader: Fastighets- och byggnadsindustri

Infrastrukturbyggnad
type: Concept
definition: Storskaliga konstruktionsprojekt, t ex vägar, dammar, kontors- och fabriksbyggnader och arenor.
in scheme: mediatopic
created: 2009-10-22T02:00:00+00:00
retired: 2019-07-25T12:00:00+00:00
modified: 2023-03-31T12:00:00+00:00
broader: Fastighets- och byggnadsindustri

Husbyggnad
type: Concept
definition: Bygge av bostäder för privat bruk.
in scheme: mediatopic
created: 2009-10-22T02:00:00+00:00
retired: 2023-03-31T12:00:00+00:00
modified: 2023-03-31T12:00:00+00:00
broader: Fastighets- och byggnadsindustri

Markpriser
type: Concept
definition: Priset på land för specifik användning (kommersiellt, bostäder, jordbruk).
in scheme: mediatopic
created: 2009-10-22T02:00:00+00:00
retired: 2023-03-31T12:00:00+00:00
modified: 2023-03-31T12:00:00+00:00
broader: Fastighets- och byggnadsindustri

Fastigheter
type: Concept
definition: Köp, försäljning och uthyrning av egendom av alla dess slag.
in scheme: mediatopic
created: 2009-10-22T02:00:00+00:00
retired: 2023-03-31T12:00:00+00:00
modified: 2023-03-31T12:00:00+00:00
broader: Fastighets- och byggnadsindustri

Byggmaterial
type: Concept
definition: Tillverkning av material som används i byggindustrin, såsom väggskivor.
in scheme: mediatopic
created: 2009-10-22T02:00:00+00:00
modified: 2023-03-31T12:00:00+00:00
broader: Fastighets- och byggnadsindustri

Infrastruktur
type: Concept
definition: Planering, anläggning och underhåll av grundläggande saker som vägar, broar, järnvägar, elnät osv.
in scheme: mediatopic
created: 2019-07-25T12:00:00+00:00
modified: 2021-07-12T12:00:00+00:00
broader: Fastighets- och byggnadsindustri

Företagsbyggnader
type: Concept
definition: Planering, bygge och underhåll av byggnader som främst används för kommersiell verksamhet.
in scheme: mediatopic
created: 2019-07-25T12:00:00+00:00
retired: 2023-03-31T12:00:00+00:00
modified: 2023-03-31T12:00:00+00:00
broader: Fastighets- och byggnadsindustri

Företagsbyggnader
type: Concept
definition: Planering, bygge och underhåll av byggnader som främst används för kommersiell verksamhet.
in scheme: mediatopic
created: 2023-03-31T12:00:00+00:00
modified: 2023-03-31T12:00:00+00:00
broader: Fastighets- och byggnadsindustri

Bostadsbyggande
type: Concept
definition: Uppförande och försäljning av fastigheter främst för bostäder.
in scheme: mediatopic
created: 2023-03-31T12:00:00+00:00
modified: 2023-03-31T12:00:00+00:00
broader: Fastighets- och byggnadsindustri

Drycker
type: Concept
definition: Drickbar vätska, med eller utan alkohol.
in scheme: mediatopic
created: 2009-10-22T02:00:00+00:00
retired: 2023-03-31T12:00:00+00:00
modified: 2023-03-31T12:00:00+00:00
broader: Konsumentvaror

Kläder
type: Concept
definition: Plagg som människor bär på kroppen, till exempel tröjor, skjortor, kjolar, klänningar och byxor.
in scheme: mediatopic
created: 2009-10-22T02:00:00+00:00
modified: 2023-03-31T12:00:00+00:00
broader: Konsumentvaror

Mat
type: Concept
definition: Föda som regelbundet måste tillföras kroppen för att livsfunktionerna ska uppehållas.
in scheme: mediatopic
created: 2009-10-22T02:00:00+00:00
retired: 2023-03-31T12:00:00+00:00
modified: 2023-03-31T12:00:00+00:00
broader: Konsumentvaror

Lyxvaror
type: Concept
definition: Varor som säljs till ett högt pris, t ex läderväskor och smycken.
in scheme: mediatopic
created: 2009-10-22T02:00:00+00:00
modified: 2023-03-31T12:00:00+00:00
broader: Konsumentvaror

Förbrukningsvaror
type: Concept
definition: Varor som förbrukas förhållandevis snabbt, t ex tändare, pennor och glas.
in scheme: mediatopic
created: 2009-10-22T02:00:00+00:00
retired: 2023-03-31T12:00:00+00:00
modified: 2023-03-31T12:00:00+00:00
broader: Konsumentvaror

Leksaker
type: Concept
definition: Föremål som är avsett att användas vid lek.
in scheme: mediatopic
created: 2009-10-22T02:00:00+00:00
modified: 2023-03-31T12:00:00+00:00
broader: Konsumentvaror

Livsmedelsindustri
type: Concept
definition: Framtagande, distribution och försäljning av varor som regelbundet måste tillföras kroppen för att livsfunktionerna ska uppehållas.
in scheme: mediatopic
created: 2009-10-22T02:00:00+00:00
modified: 2023-03-31T12:00:00+00:00
broader: Konsumentvaror

Inredning och möbler
type: Concept
definition: Tillverkning av möbler, tapeter, färg och annat material för inomhusdekorering.
in scheme: mediatopic
created: 2009-10-22T02:00:00+00:00
modified: 2023-03-31T12:00:00+00:00
broader: Konsumentvaror

Tobak
type: Concept
definition: Odlandet, producerandet och försäljningen av tobak.
in scheme: mediatopic
created: 2009-10-22T02:00:00+00:00
modified: 2023-03-31T12:00:00+00:00
broader: Konsumentvaror

Hantverk
type: Concept
definition: Produkter eller tjänster som framställs med enkla metoder och verktyg, till skillnad från industriell massproduktion.
in scheme: mediatopic
created: 2016-04-04T12:00:00+00:00
modified: 2023-03-31T12:00:00+00:00
broader: Konsumentvaror

Husdjursprodukter och -tjänster
type: Concept
definition: Hygienprodukter samt omvårdnad och näring till djur som lever under människans vård och kontroll.
in scheme: mediatopic
created: 2016-04-04T12:00:00+00:00
modified: 2023-03-31T12:00:00+00:00
broader: Konsumentvaror

Konsumentelektronik
type: Concept
definition: Varor som datorer, telefoner, tv osv som säljs till privatpersoner för personlig användning.
in scheme: mediatopic
created: 2019-08-02T12:00:00+00:00
modified: 2021-07-12T12:00:00+00:00
broader: Konsumentvaror

Varuhus
type: Concept
definition: Försäljningsställe med stor säljyta och med ett brett varusortiment.
in scheme: mediatopic
created: 2009-10-22T02:00:00+00:00
modified: 2021-02-18T12:00:00+00:00
broader: Detaljhandel

Detaljhandel
type: Concept
definition: Företag som säljer produkter som tillverkats av andra till senare led i tillverknings-, distributions- och konsumtionskedjan.
in scheme: mediatopic
created: 2009-10-22T02:00:00+00:00
modified: 2023-03-31T12:00:00+00:00
broader: Försäljningskanaler
narrower: Varuhus
narrower: E-handel
narrower: Postorder
narrower: Specialbutiker
narrower: Köpcentrum
narrower: Affärsgata

E-handel
type: Concept
definition: Varor som köps eller säljs med hjälp av internettjänster.
in scheme: mediatopic
created: 2009-10-22T02:00:00+00:00
modified: 2023-03-31T12:00:00+00:00
broader: Detaljhandel

Postorder
type: Concept
definition: Varor som säljs genom och leveras med hjälp av posten.
in scheme: mediatopic
created: 2009-10-22T02:00:00+00:00
retired: 2023-03-31T12:00:00+00:00
modified: 2023-03-31T12:00:00+00:00
broader: Detaljhandel

Specialbutiker
type: Concept
definition: Detaljhandlare som specialiserat sig inom en särskild kategori, t ex skor eller verktyg.
in scheme: mediatopic
created: 2009-10-22T02:00:00+00:00
modified: 2021-05-05T12:00:00+00:00
broader: Detaljhandel

Köpcentrum
type: Concept
definition: En stor byggnad, eller sammankopplade byggnader, där många olika affärer, restauranger osv samlas.
in scheme: mediatopic
created: 2020-08-05T12:00:00+00:00
modified: 2021-07-12T12:00:00+00:00
broader: Detaljhandel

Affärsgata
type: Concept
definition: En gata eller område i en stad där många affärer och restauranger är samlade.
in scheme: mediatopic
created: 2020-08-05T12:00:00+00:00
modified: 2021-07-12T12:00:00+00:00
broader: Detaljhandel

Grossister
type: Concept
definition: Distributionsled som förmedlar varor till detaljhandeln och större förbrukare, det vill säga inte till privata konsumenter.
in scheme: mediatopic
created: 2009-10-22T02:00:00+00:00
modified: 2023-03-31T12:00:00+00:00
broader: Försäljningskanaler

Alternativ energi
type: Concept
definition: Den kommersiella verksamhet som framställer energi utan att förstöra miljön.
in scheme: mediatopic
created: 2009-10-22T02:00:00+00:00
modified: 2023-03-31T12:00:00+00:00
broader: Energi och naturtillgångar
narrower: Geotermisk energi
narrower: Solenergi
narrower: Vattenkraft
narrower: Vindkraft

Kol
type: Concept
definition: Utvinning av antracit och bituminöst kol för användning i energiproduktion.
in scheme: mediatopic
created: 2009-10-22T02:00:00+00:00
modified: 2021-02-18T12:00:00+00:00
broader: Energi och naturtillgångar

Energiindustri
type: Concept
definition: Produktionen av energi utan fokus på någon speciell sektor.
in scheme: mediatopic
created: 2009-10-22T02:00:00+00:00
retired: 2019-07-25T12:00:00+00:00
modified: 2021-07-12T12:00:00+00:00
broader: Energi och naturtillgångar

Kärnkraft
type: Concept
definition: Användande av radioaktivt material för produktion av el eller värme.
in scheme: mediatopic
created: 2009-10-22T02:00:00+00:00
modified: 2021-07-12T12:00:00+00:00
broader: Energi och naturtillgångar

Olja och gas, leverans
type: Concept
definition: Allt som rör olja och gas från raffinaderiet till distributionen.
in scheme: mediatopic
created: 2009-10-22T02:00:00+00:00
retired: 2019-07-25T12:00:00+00:00
modified: 2021-05-05T12:00:00+00:00
broader: Energi och naturtillgångar

Olja och gas, utvinning
type: Concept
definition: Allt som rör olja och gas från upphämtningen till raffinaderiet.
in scheme: mediatopic
created: 2009-10-22T02:00:00+00:00
retired: 2019-07-25T12:00:00+00:00
modified: 2021-05-05T12:00:00+00:00
broader: Energi och naturtillgångar

Biobränsle
type: Concept
definition: Bränsle som tillverkas av produkter från biologiska processer istället för bränsle som tillverkas baserat på geologiska processer som fossila bränslen, kol osv.
in scheme: mediatopic
created: 2019-04-06T12:00:00+00:00
modified: 2023-03-31T12:00:00+00:00
broader: Energi och naturtillgångar

Olja och gas
type: Concept
definition: Allt som rör olja och gas från prospektering till leverans och försäljning.
in scheme: mediatopic
created: 2019-07-25T12:00:00+00:00
modified: 2023-03-31T12:00:00+00:00
broader: Energi och naturtillgångar
narrower: Diesel
narrower: Fotogen
narrower: Naturgas
narrower: Bensin

Geotermisk energi
type: Concept
definition: Energi som hämtas från geoteremiska processer där värme lagras i jordskorpan.
in scheme: mediatopic
created: 2019-04-06T12:00:00+00:00
modified: 2023-03-31T12:00:00+00:00
broader: Alternativ energi

Solenergi
type: Concept
definition: Energi som bygger på omvandling av solenergi i någon form.
in scheme: mediatopic
created: 2019-04-06T12:00:00+00:00
modified: 2023-03-31T12:00:00+00:00
broader: Alternativ energi

Vattenkraft
type: Concept
definition: Energi som genereras genom att leda vatten genom turbiner. Vattnet samlas ofta i dammar så flödet kan regleras efter behov.
in scheme: mediatopic
created: 2019-04-06T12:00:00+00:00
modified: 2023-03-31T12:00:00+00:00
broader: Alternativ energi

Vindkraft
type: Concept
definition: Energi som genereras i turbiner som sätts i rörelse av vind som driver någon form av propeller.
in scheme: mediatopic
created: 2019-04-06T12:00:00+00:00
modified: 2023-03-31T12:00:00+00:00
broader: Alternativ energi

Diesel
type: Concept
definition: Bränsle för dieselmotorer och värmeanläggningar bestående av relativt svårflyktiga brännoljor, t ex tjockolja.
in scheme: mediatopic
created: 2009-10-22T02:00:00+00:00
modified: 2023-03-31T12:00:00+00:00
broader: Olja och gas

Elproduktion och -distribution
type: Concept
definition: Elnätet samt försäljningen av el på grossist- och återförsäljarnivå.
in scheme: mediatopic
created: 2009-10-22T02:00:00+00:00
modified: 2023-03-31T12:00:00+00:00
broader: Samhällsservice

Fotogen
type: Concept
definition: En petroleumprodukt som ofta används som motorbränsle i allt från båtar till jetplan, men också som bränsle i lampor.
in scheme: mediatopic
created: 2009-10-22T02:00:00+00:00
retired: 2023-03-31T12:00:00+00:00
modified: 2023-03-31T12:00:00+00:00
broader: Olja och gas

Naturgas
type: Concept
definition: Brännbar gas som erhålls ur jorden och som bildats genom förmultning av organiska ämnen, används som bränsle och industriråvara.
in scheme: mediatopic
created: 2009-10-22T02:00:00+00:00
modified: 2023-03-31T12:00:00+00:00
broader: Olja och gas

Bensin
type: Concept
definition: Typ av lättflyktigt och brandfarligt bränsle för lätta eller snabbgående motorer, särskilt för personbilar.
in scheme: mediatopic
created: 2009-10-22T02:00:00+00:00
modified: 2021-02-18T12:00:00+00:00
broader: Olja och gas

Avfallshantering och bekämpning av föroreningar
type: Concept
definition: Den kommersiella verksamhet som hanterar avfall och bevakar utsläpp.
in scheme: mediatopic
created: 2009-10-22T02:00:00+00:00
modified: 2023-03-31T12:00:00+00:00
broader: Samhällsservice

Färskvattenförsörjning
type: Concept
definition: Den kommersiella verksamhet som förser människor med rent vatten.
in scheme: mediatopic
created: 2009-10-22T02:00:00+00:00
modified: 2023-03-31T12:00:00+00:00
broader: Samhällsservice

Begravningsfirmor
type: Concept
definition: Företag som tillhandahåller tjänster för hantering av avlidna personer.
in scheme: mediatopic
created: 2009-10-22T02:00:00+00:00
retired: 2023-03-31T12:00:00+00:00
modified: 2023-03-31T12:00:00+00:00
broader: Finans- och affärstjänster

Privatekonomi
type: Concept
definition: En individs inkomster, utgifter, tillgångar och skulder.
in scheme: mediatopic
created: 2009-10-22T02:00:00+00:00
retired: 2023-03-31T12:00:00+00:00
modified: 2023-03-31T12:00:00+00:00
broader: Finans- och affärstjänster

Privatinkomster
type: Concept
definition: Pengar som en person tjänar och som står denne fritt att använda.
in scheme: mediatopic
created: 2009-10-22T02:00:00+00:00
retired: 2023-03-31T12:00:00+00:00
modified: 2023-03-31T12:00:00+00:00
broader: Finans- och affärstjänster

Tryckerier
type: Concept
definition: Produktion av tryckt material såsom skyltar, flygblad och reklambad.
in scheme: mediatopic
created: 2009-10-22T02:00:00+00:00
retired: 2023-03-31T12:00:00+00:00
modified: 2023-03-31T12:00:00+00:00
broader: Finans- och affärstjänster

Bokföring och revision
type: Concept
definition: Tjänster som hjälper till att systematiskt redovisa ekonomiska förhållanden och granskning att redovisningen är tillförlitlig.
in scheme: mediatopic
created: 2009-10-22T02:00:00+00:00
modified: 2023-03-31T12:00:00+00:00
broader: Finansiella tjänster

Auktionstjänster
type: Concept
definition: Tjänster där varor är ute för försäljning och vid vilken spekulanterna efter hand avger allt högre bud och varan säljs till den högstbjudande.
in scheme: mediatopic
created: 2009-10-22T02:00:00+00:00
modified: 2023-03-31T12:00:00+00:00
broader: Försäljningskanaler

Banker
type: Concept
definition: Företag som förvarar, överför, tar emot eller delar ut pengar.
in scheme: mediatopic
created: 2009-10-22T02:00:00+00:00
modified: 2023-03-31T12:00:00+00:00
broader: Finansiella tjänster

Konsulter
type: Concept
definition: Leverantörer av expertkunskap inom ett specifikt område, vanligtvis under en avtalad tid.
in scheme: mediatopic
created: 2009-10-22T02:00:00+00:00
modified: 2023-03-31T12:00:00+00:00
broader: Företagsservice

Bemanningsföretag
type: Concept
definition: Tjänster som hjälper personer att hitta ett arbete och som hjälper företag att hitta arbetskraft.
in scheme: mediatopic
created: 2009-10-22T02:00:00+00:00
modified: 2023-03-31T12:00:00+00:00
broader: Företagsservice

Vårdgivare
type: Concept
definition: Företag som tillhandahåller tjänster inom hälso- och sjukvård.
in scheme: mediatopic
created: 2009-10-22T02:00:00+00:00
modified: 2022-06-14T12:00:00+00:00
broader: Hälsovårdsproduktion

Försäkringar
type: Concept
definition: Tjänster som låter individer betala små belopp regelbundet för att skydda sig ekonomiskt mot stora oväntade händelser.
in scheme: mediatopic
created: 2009-10-22T02:00:00+00:00
modified: 2023-03-31T12:00:00+00:00
broader: Finansiella tjänster

Ekonomisk rådgivning
type: Concept
definition: Företag som ger råd om hur en individ eller ett företag bör investera.
in scheme: mediatopic
created: 2009-10-22T02:00:00+00:00
modified: 2023-03-31T12:00:00+00:00
broader: Finansiella tjänster

Fastighetsskötsel
type: Concept
definition: Företag som hjälper till med städning av bostäder eller affärslokaler.
in scheme: mediatopic
created: 2009-10-22T02:00:00+00:00
retired: 2023-03-31T12:00:00+00:00
modified: 2023-03-31T12:00:00+00:00
broader: Företagsservice

Juridiska tjänster
type: Concept
definition: Tjänster som hjälper individer eller företag att tolka och förhålla sig till nationella, regionala eller lokala lagar.
in scheme: mediatopic
created: 2009-10-22T02:00:00+00:00
modified: 2023-03-31T12:00:00+00:00
broader: Företagsservice

Privata investeringar
type: Concept
definition: En individs personliga finanser och ekonomiska satsningar.
in scheme: mediatopic
created: 2009-10-22T02:00:00+00:00
modified: 2023-03-31T12:00:00+00:00
broader: Finansiella tjänster

Skönhetsindustri
type: Concept
definition: Tjänster för att ta hand om en individs kropp, såsom hårfrisering, massage och nagelvård.
in scheme: mediatopic
created: 2009-10-22T02:00:00+00:00
retired: 2023-03-31T12:00:00+00:00
modified: 2023-03-31T12:00:00+00:00
broader: Företagsservice

Uthyrningsfirmor
type: Concept
definition: Företag som hyr ut saker, såsom bilar, kläder och verktyg.
in scheme: mediatopic
created: 2009-10-22T02:00:00+00:00
modified: 2023-03-31T12:00:00+00:00
broader: Företagsservice

Bud- och transporttjänster
type: Concept
definition: Företag som förbereder och fraktar paket och dokument åt individer eller företag.
in scheme: mediatopic
created: 2009-10-22T02:00:00+00:00
modified: 2023-03-31T12:00:00+00:00
broader: Företagsservice

Aktiemäklande
type: Concept
definition: Tjänster för att köpa och sälja aktier åt individer eller andra entiteter.
in scheme: mediatopic
created: 2009-10-22T02:00:00+00:00
modified: 2023-03-31T12:00:00+00:00
broader: Finansiella tjänster

Bröllopstjänster
type: Concept
definition: Varor och tjänster för att genomföra en vigsel med tillhörande festligheter.
in scheme: mediatopic
created: 2009-10-22T02:00:00+00:00
retired: 2023-03-31T12:00:00+00:00
modified: 2023-03-31T12:00:00+00:00
broader: Företagsservice

Flyg- och rymdindustri
type: Concept
definition: Produktion av flygplan och rymdfarkoster samt komponenter som behövs för att tillverka dessa.
in scheme: mediatopic
created: 2009-10-22T02:00:00+00:00
modified: 2021-02-18T12:00:00+00:00
broader: Verkstadsindustri

Bilindustri
type: Concept
definition: Produktion av bilar och komponenter som behövs för att tillverka bilar.
in scheme: mediatopic
created: 2009-10-22T02:00:00+00:00
modified: 2021-02-18T12:00:00+00:00
broader: Verkstadsindustri

Försvarsindustri
type: Concept
definition: Produktion av vapen, stridsvagnar, kanoner, fartyg med mera för användning av militära och icke-militära försvarsstyrkor.
in scheme: mediatopic
created: 2009-10-22T02:00:00+00:00
modified: 2023-03-31T12:00:00+00:00
broader: Verkstadsindustri

Elutrustningar
type: Concept
definition: Produktion av stora och små elektroniska varor för användning i hemmet eller affärsverksamheten.
in scheme: mediatopic
created: 2009-10-22T02:00:00+00:00
modified: 2021-02-18T12:00:00+00:00
broader: Verkstadsindustri

Tunga maskiner
type: Concept
definition: Produktion av kranar, bulldozers och liknande för användning i stora konstruktionsprojekt.
in scheme: mediatopic
created: 2009-10-22T02:00:00+00:00
modified: 2023-03-31T12:00:00+00:00
broader: Verkstadsindustri

Komponenttillverkning
type: Concept
definition: Produktion av mekansika, elektroniska eller elektriska produkter som behövs för att tillverka andra produkter.
in scheme: mediatopic
created: 2009-10-22T02:00:00+00:00
retired: 2023-03-31T12:00:00+00:00
modified: 2023-03-31T12:00:00+00:00
broader: Verkstadsindustri

Mätinstrumenttillverkning
type: Concept
definition: Produktion av instrument för kalibrering samt mätning av t ex hastighet, tryck och distans.
in scheme: mediatopic
created: 2009-10-22T02:00:00+00:00
retired: 2023-03-31T12:00:00+00:00
modified: 2023-03-31T12:00:00+00:00
broader: Verkstadsindustri

Maskintillverkning
type: Concept
definition: Produktion av turbiner, motorer, fläktar, pumpar och andra komponenter till motordriven utrustning.
in scheme: mediatopic
created: 2009-10-22T02:00:00+00:00
modified: 2023-03-31T12:00:00+00:00
broader: Verkstadsindustri

Varvsindustri
type: Concept
definition: Produktion av fartyg, ubåtar och pråmar.
in scheme: mediatopic
created: 2009-10-22T02:00:00+00:00
modified: 2023-03-31T12:00:00+00:00
broader: Verkstadsindustri

Kapitalvaror
type: Concept
definition: Varaktiga produkter som används vid produktionen av andra varor eller tjänster.
in scheme: mediatopic
created: 2016-04-04T12:00:00+00:00
retired: 2023-03-31T12:00:00+00:00
modified: 2023-03-31T12:00:00+00:00
broader: Verkstadsindustri

Järnvägsindustrin
type: Concept
definition: Produktion av tåg, järnvägar, signalsystem samt drift och underhåll av dessa.
in scheme: mediatopic
created: 2016-04-04T12:00:00+00:00
modified: 2023-03-31T12:00:00+00:00
broader: Verkstadsindustri

Reklam
type: Concept
definition: Metoder för att marknadsföra varor och tjänster med hjälp av video, grafik eller text.
in scheme: mediatopic
created: 2009-10-22T02:00:00+00:00
modified: 2023-03-31T12:00:00+00:00
broader: Medier

Förlagsindustrin
type: Concept
definition: Den kommersiella verksamhet som producerar och säljer böcker, både skönlitteratur och facklitteratur.
in scheme: mediatopic
created: 2009-10-22T02:00:00+00:00
modified: 2023-03-31T12:00:00+00:00
broader: Medier

Filmindustrin
type: Concept
definition: Den kommersiella verksamhet som ägnas åt inspelning, bearbetning, förvärv, distribution, visning, försäljning och uthyrning av film.
in scheme: mediatopic
created: 2009-10-22T02:00:00+00:00
modified: 2023-03-31T12:00:00+00:00
broader: Medier

Musikindustrin
type: Concept
definition: Den kommersiella verksamhet som omfattar publicering och försäljning av musik i olika former, främst fonogram eller digitala filer via internet, men även noter samt industriell tillverkning av och handel med musikinstrument och apparater för in- och avspelning av musik.
in scheme: mediatopic
created: 2009-10-22T02:00:00+00:00
modified: 2023-03-31T12:00:00+00:00
broader: Medier

Nyhetsbyråer
type: Concept
definition: Kommersiella företag som producerar och distribuerar nyheter i text, bild och rörlig bild.
in scheme: mediatopic
created: 2009-10-22T02:00:00+00:00
retired: 2023-03-31T12:00:00+00:00
modified: 2023-03-31T12:00:00+00:00
broader: Medier

Dagstidningar och magasin
type: Concept
definition: Den kommersiella verksamhet som producerar pappersprodukter innehållande nyheter och information.
in scheme: mediatopic
created: 2009-10-22T02:00:00+00:00
retired: 2023-03-31T12:00:00+00:00
modified: 2023-03-31T12:00:00+00:00
broader: Medier

Internetbaserade medier
type: Concept
definition: Den kommersiella verksamhet som distribuerar nyheter och information genom datornätverk för allmän konsumtion.
in scheme: mediatopic
created: 2009-10-22T02:00:00+00:00
retired: 2023-03-31T12:00:00+00:00
modified: 2023-03-31T12:00:00+00:00
broader: Medier

Pr
type: Concept
definition: Den kommersiella verksamhet som marknadsför produkter eller tjänster med hjälp av reklam, direktkontakt eller annonser.
in scheme: mediatopic
created: 2009-10-22T02:00:00+00:00
modified: 2023-03-31T12:00:00+00:00
broader: Medier

Radioindustrin
type: Concept
definition: Den kommersiella verksamhet som producerar, distribuerar och sänder radioprogram.
in scheme: mediatopic
created: 2009-10-22T02:00:00+00:00
modified: 2023-03-31T12:00:00+00:00
broader: Medier

Satellit- och kabelleverantörer
type: Concept
definition: Den kommersiella verksamhet som tillhandahåller tv med hjälp av satellit- eller kabelöverföring.
in scheme: mediatopic
created: 2009-10-22T02:00:00+00:00
modified: 2021-05-05T12:00:00+00:00
broader: Medier

Tv-industrin
type: Concept
definition: Den kommersiella verksamhet som producerar, distribuerar och sänder tv.
in scheme: mediatopic
created: 2009-10-22T02:00:00+00:00
modified: 2023-03-31T12:00:00+00:00
broader: Medier

Streamingtjänster
type: Concept
definition: Företag som tillhandahåller underhållning som film och musik direkt via internet.
in scheme: mediatopic
created: 2020-08-05T12:00:00+00:00
modified: 2023-03-31T12:00:00+00:00
broader: Medier

Podcast
type: Concept
definition: Nätverk och personer som framställer avsnitt om olika ämnen som lyssnare kan ta del av.
in scheme: mediatopic
created: 2023-03-31T12:00:00+00:00
modified: 2023-03-31T12:00:00+00:00
broader: Medier

Nyhetsindustrin
type: Concept
definition: Produktion och distribution av nyheter i tryck, utsändning, video eller digitalt.
in scheme: mediatopic
created: 2023-03-31T12:00:00+00:00
modified: 2023-03-31T12:00:00+00:00
broader: Medier

Guld och värdefulla metaller
type: Concept
definition: Gruvdrift, anrikning och försäljning av guld och andra ädla metaller.
in scheme: mediatopic
created: 2009-10-22T02:00:00+00:00
modified: 2023-03-31T12:00:00+00:00
broader: Metaller och mineraler

Järn och stål
type: Concept
definition: Gruvdrift, anrikning och försäljning av järnhaltiga metaller.
in scheme: mediatopic
created: 2009-10-22T02:00:00+00:00
retired: 2023-03-31T12:00:00+00:00
modified: 2023-03-31T12:00:00+00:00
broader: Metaller och mineraler

Gruvdrift
type: Concept
definition: Verksamheten med att gräva efter metaller, råmaterial såsom kol samt ädelstenar såsom diamanter.
in scheme: mediatopic
created: 2009-10-22T02:00:00+00:00
retired: 2023-03-31T12:00:00+00:00
modified: 2023-03-31T12:00:00+00:00
broader: Metaller och mineraler

Icke-järnmetall
type: Concept
definition: Gruvdrift, anrikning och försäljning av koppar, zink, aluminium och andra icke järnhaltiga metaller.
in scheme: mediatopic
created: 2009-10-22T02:00:00+00:00
retired: 2023-03-31T12:00:00+00:00
modified: 2023-03-31T12:00:00+00:00
broader: Metaller och mineraler

Destillerier och bryggerier
type: Concept
definition: Tillverkning av alkoholhaltiga drycker.
in scheme: mediatopic
created: 2009-10-22T02:00:00+00:00
retired: 2023-03-31T12:00:00+00:00
modified: 2023-03-31T12:00:00+00:00
broader: Processindustri

Papper
type: Concept
definition: Tillverkning av papper för att skriva, slå in, trycka eller paketera.
in scheme: mediatopic
created: 2009-10-22T02:00:00+00:00
retired: 2023-03-31T12:00:00+00:00
modified: 2023-03-31T12:00:00+00:00
broader: Processindustri

Gummi
type: Concept
definition: Tillverkning av produkter (t ex handskar, slangar, skyddskläder) i vilka naturgummi och syntetiskt gummi till betydande del ingår som basråvara.
in scheme: mediatopic
created: 2009-10-22T02:00:00+00:00
retired: 2023-03-31T12:00:00+00:00
modified: 2023-03-31T12:00:00+00:00
broader: Processindustri

Ej alkoholhaltig dryck
type: Concept
definition: Tillverkning av alkoholfria drycker.
in scheme: mediatopic
created: 2009-10-22T02:00:00+00:00
retired: 2023-03-31T12:00:00+00:00
modified: 2023-03-31T12:00:00+00:00
broader: Processindustri

Kläder och textilier
type: Concept
definition: Tillverkning av material för att klä människor, möbler och andra föremål.
in scheme: mediatopic
created: 2009-10-22T02:00:00+00:00
retired: 2023-03-31T12:00:00+00:00
modified: 2023-03-31T12:00:00+00:00
broader: Processindustri

E-cigaretter
type: Concept
definition: Laddningsbar patron som fylls med vätska som förångas när den dras in i lungorna, avsedd att användas som substitut för tobaksrökning.
in scheme: mediatopic
created: 2016-04-04T12:00:00+00:00
retired: 2023-03-31T12:00:00+00:00
modified: 2023-03-31T12:00:00+00:00
broader: Processindustri

Casinon
type: Concept
definition: Affärsverksamhet som går ut på att erbjuda lokaler för spel där utgången helt eller huvudsakligen bestäms av slumpen.
in scheme: mediatopic
created: 2009-10-22T02:00:00+00:00
modified: 2023-03-31T12:00:00+00:00
broader: Turistindustri

Hotell och logi
type: Concept
definition: Affärsverksamhet som går ut på att erbjuda tak över huvudet och mat till resenärer.
in scheme: mediatopic
created: 2009-10-22T02:00:00+00:00
modified: 2023-03-31T12:00:00+00:00
broader: Turistindustri

Sport- och fritidsprodukter
type: Concept
definition: Tillverkning av varor som används till fritidssysselsättningar.
in scheme: mediatopic
created: 2009-10-22T02:00:00+00:00
modified: 2021-02-18T12:00:00+00:00
broader: Turistindustri

Restaurang och catering
type: Concept
definition: Affärsverksamhet som går ut på att servera färdig mat till stora eller små grupper av kunder.
in scheme: mediatopic
created: 2009-10-22T02:00:00+00:00
modified: 2023-03-31T12:00:00+00:00
broader: Turistindustri

Researrangörer
type: Concept
definition: Företag som paketerar resor i form av transport, boende och aktiviteter.
in scheme: mediatopic
created: 2009-10-22T02:00:00+00:00
modified: 2023-03-31T12:00:00+00:00
broader: Turistindustri

Flygtransport
type: Concept
definition: Kommersiell förflyttning av folk eller varor med hjälp av flygplan.
in scheme: mediatopic
created: 2009-10-22T02:00:00+00:00
modified: 2023-03-31T12:00:00+00:00
broader: Transport

Järnvägstransport
type: Concept
definition: Kommersiell förflyttning av folk eller varor med hjälp av tåg och och järnvägar.
in scheme: mediatopic
created: 2009-10-22T02:00:00+00:00
modified: 2023-03-31T12:00:00+00:00
broader: Transport

Vägtransport
type: Concept
definition: Kommersiell förflyttning av varor med hjälp av lastbilar och vägar.
in scheme: mediatopic
created: 2009-10-22T02:00:00+00:00
modified: 2023-03-31T12:00:00+00:00
broader: Transport

Trafik
type: Concept
definition: Samtidig rörelse på begränsad yta av ett antal transportmedel längs särskilt inrättade färdvägar till lands, till sjöss eller i luften.
in scheme: mediatopic
created: 2009-10-22T02:00:00+00:00
retired: 2023-03-31T12:00:00+00:00
modified: 2023-03-31T12:00:00+00:00
broader: Transport

Sjötransport
type: Concept
definition: Kommersiell förflyttning av folk eller varor med hjälp av båtar, skepp och vatten.
in scheme: mediatopic
created: 2009-10-22T02:00:00+00:00
modified: 2021-02-18T12:00:00+00:00
broader: Transport

Logistik
type: Concept
definition: Materialflöde inom företag eller organisationer, vanligtvis med huvudsyftet att åstadkomma metoder för att rätt material skall finnas på rätt plats vid rätt tid.
in scheme: mediatopic
created: 2016-04-04T12:00:00+00:00
modified: 2023-03-31T12:00:00+00:00
broader: Transport

Kollektivtrafik
type: Concept
definition: Olika typer av transporter med exempelvis buss och tåg som går på bestämda linjer och tider och fasta priser.
in scheme: mediatopic
created: 2022-09-23T12:00:00+00:00
modified: 2022-09-23T12:00:00+00:00
broader: Transport

Taxitjänster
type: Concept
definition: Traditionella taxiföretag eller it-lösningar där personer kan betala för transporttjänster.
in scheme: mediatopic
created: 2022-09-23T12:00:00+00:00
modified: 2022-09-23T12:00:00+00:00
broader: Transport

Mobilitetspool
type: Concept
definition: Nätverk av fordon som bilar, cyklar och elfordon som kan korttidshyras av medlemmar.
in scheme: mediatopic
created: 2022-09-23T12:00:00+00:00
modified: 2022-09-23T12:00:00+00:00
broader: Transport

Pendling
type: Concept
definition: Regelbundna resor mellan bostad och arbetsplats, vanligen dagliga.
in scheme: mediatopic
created: 2009-10-22T02:00:00+00:00
modified: 2021-02-18T12:00:00+00:00
broader: Anställning
broad match: http://cv.iptc.org/newscodes/subjectcode/10007000

Makroekonomi
type: Concept
definition: Storskaliga ekonomiska frågor på nationell eller högre nivå.
in scheme: mediatopic
created: 2009-10-22T02:00:00+00:00
modified: 2024-03-28T12:00:00+00:00
broader: Ekonomi
narrower: Obligationer
narrower: Budget och budgetarbete
narrower: Konsumenter
narrower: Konsumentförtroende
narrower: Krediter och skulder
narrower: Deflation
narrower: Ekonomisk tillväxt
narrower: Ekonomiska indikatorer
narrower: Bruttonationalprodukt
narrower: Industriproduktion
narrower: Lagerstatus
narrower: Produktivitet
narrower: Arbetsmarknadsstatistik
narrower: Export
narrower: Statligt bistånd
narrower: Statsskuld
narrower: Import
narrower: Inflation
narrower: Investeringar
narrower: Bolån
narrower: Marknadspriser
narrower: Recession

Centralbanker
type: Concept
definition: Bank som utgör centrum för bankväsendet i ett land och har ansvar för sedelutgivningen, utlåningen till staten och andra banker med mera.
in scheme: mediatopic
created: 2009-10-22T02:00:00+00:00
modified: 2024-03-28T12:00:00+00:00
broader: Ekonomi

Valutor
type: Concept
definition: Värdeförhållande mellan två valutor.
in scheme: mediatopic
created: 2009-10-22T02:00:00+00:00
modified: 2024-03-28T12:00:00+00:00
broader: Ekonomi
narrower: Kryptovaluta

Branschorganisationer
type: Concept
definition: En intresseförening för företag i en viss bransch.
in scheme: mediatopic
created: 2009-10-22T02:00:00+00:00
modified: 2024-03-28T12:00:00+00:00
broader: Ekonomi

Tillväxtmarknad
type: Concept
definition: Marknader som representeras av utvecklingsländer, som strävar efter att bli en del av den globala ekonomin och som ibland behöver hjälp av internationella långivare.
in scheme: mediatopic
created: 2009-10-22T02:00:00+00:00
modified: 2024-03-28T12:00:00+00:00
broader: Ekonomi

Internationella ekonomiska organisationer
type: Concept
definition: Entiteter såsom Världsbanken, WTO och Unido, som verkar på en global nivå.
in scheme: mediatopic
created: 2009-10-22T02:00:00+00:00
modified: 2024-07-01T12:00:00+00:00
broader: Ekonomi

Internationell handel
type: Concept
definition: Handel med varor och tjänster mellan länder.
in scheme: mediatopic
created: 2009-10-22T02:00:00+00:00
modified: 2024-03-28T12:00:00+00:00
broader: Ekonomi
narrower: Handelsavtal
narrower: Handelsbalans
narrower: Handelstvist
narrower: Handelspolitik
narrower: Tullavgifter

Penningpolitik
type: Concept
definition: Statliga åtgärder för reglering av penningväsendet och kreditmarknaden i ett land, särskilt genom centralbanken.
in scheme: mediatopic
created: 2009-10-22T02:00:00+00:00
modified: 2024-03-28T12:00:00+00:00
broader: Ekonomi
narrower: Ränta

Fonder
type: Concept
definition: En samling värdepapper, ofta kallad för portfölj, som ägs av många människor tillsammans, vilka är andelsägare och som kan bestå av olika typer av aktie- eller räntebaserade värdepapper.
in scheme: mediatopic
created: 2009-10-22T02:00:00+00:00
modified: 2024-03-28T12:00:00+00:00
broader: Ekonomi

Delningsekonomi
type: Concept
definition: Aktiviteter som syftar till minskad resursåtgång genom effektivare kapacitetsutnyttjande såsom delning av tillgång till varor och tjänster.
in scheme: mediatopic
created: 2016-04-04T12:00:00+00:00
modified: 2024-03-28T12:00:00+00:00
broader: Ekonomi

Ekonomisk politik
type: Concept
definition: Åtgärder från i första hand statens sida inriktade på att påverka förhållanden i ekonomin.
in scheme: mediatopic
created: 2009-10-22T02:00:00+00:00
modified: 2025-03-31T12:00:00+00:00
broader: Regeringsförklaring
narrower: Förstatligande
narrower: Privatisering
narrower: Statligt ägda företag
narrower: Utvecklingsstöd

Förstatligande
type: Concept
definition: Överföring av privat verksamhet eller egendom till staten.
in scheme: mediatopic
created: 2009-10-22T02:00:00+00:00
modified: 2025-03-31T12:00:00+00:00
broader: Ekonomisk politik

Privatisering
type: Concept
definition: Överföring av offentlig verksamhet till privat ägo.
in scheme: mediatopic
created: 2009-10-22T02:00:00+00:00
modified: 2025-03-31T12:00:00+00:00
broader: Ekonomisk politik

Statligt ägda företag
type: Concept
definition: Företag som ägs eller delägs av staten.
in scheme: mediatopic
created: 2009-10-22T02:00:00+00:00
modified: 2025-03-31T12:00:00+00:00
broader: Ekonomisk politik
broad match: http://cv.iptc.org/newscodes/subjectcode/04017001

Utvecklingsstöd
type: Concept
definition: Olika program och ekonomiskt stöd för att stimulera ekonomi och företagsamhet inom olika områden.
in scheme: mediatopic
created: 2020-08-05T12:00:00+00:00
modified: 2025-03-31T12:00:00+00:00
broader: Ekonomisk politik

Obligationer
type: Concept
definition: Köp- och säljbar skuldförbindelse som utgör del av större lån och som löses in till visst belopp då lånet förfaller.
in scheme: mediatopic
created: 2009-10-22T02:00:00+00:00
retired: 2024-03-28T12:00:00+00:00
modified: 2024-03-28T12:00:00+00:00
broader: Makroekonomi

Budget och budgetarbete
type: Concept
definition: En beräkning i förväg av alla inkomster och utgifter.
in scheme: mediatopic
created: 2009-10-22T02:00:00+00:00
retired: 2024-03-28T12:00:00+00:00
modified: 2024-03-28T12:00:00+00:00
broader: Makroekonomi

Konsumenter
type: Concept
definition: Köpare av varor och tjänster.
in scheme: mediatopic
created: 2009-10-22T02:00:00+00:00
retired: 2024-03-28T12:00:00+00:00
modified: 2024-03-28T12:00:00+00:00
broader: Makroekonomi
narrower: Konsumentfrågor

Konsumentförtroende
type: Concept
definition: Kunders företroende för den aktuella ekonomiska situationen.
in scheme: mediatopic
created: 2009-10-22T02:00:00+00:00
modified: 2024-03-28T12:00:00+00:00
broader: Makroekonomi

Krediter och skulder
type: Concept
definition: Ekonomisk tillgång som får disponeras mot räntekostnader och penningsumma, som man är skyldig att betala tillbaka.
in scheme: mediatopic
created: 2009-10-22T02:00:00+00:00
retired: 2024-03-28T12:00:00+00:00
modified: 2024-03-28T12:00:00+00:00
broader: Makroekonomi

Deflation
type: Concept
definition: Priserna på varor och tjänster sjunker eller handeln minskar.
in scheme: mediatopic
created: 2009-10-22T02:00:00+00:00
modified: 2024-03-28T12:00:00+00:00
broader: Makroekonomi
broad match: http://cv.iptc.org/newscodes/subjectcode/04008016

Ekonomisk tillväxt
type: Concept
definition: Ökning över tiden av produktionen av varor och tjänster i ett land, bruttonationalprodukten (BNP).
in scheme: mediatopic
created: 2009-10-22T02:00:00+00:00
modified: 2024-03-28T12:00:00+00:00
broader: Makroekonomi
broad match: http://cv.iptc.org/newscodes/subjectcode/04000000

Ekonomiska indikatorer
type: Concept
definition: Specifika index, t ex lagersaldon och prisindex, som visar om ekonomin förbättras eller försämras.
in scheme: mediatopic
created: 2009-10-22T02:00:00+00:00
retired: 2024-03-28T12:00:00+00:00
modified: 2024-03-28T12:00:00+00:00
broader: Makroekonomi

Bruttonationalprodukt
type: Concept
definition: Värdet av alla de varor och tjänster som framställs i ett land under ett år.
in scheme: mediatopic
created: 2009-10-22T02:00:00+00:00
modified: 2024-03-28T12:00:00+00:00
broader: Makroekonomi
broad match: http://cv.iptc.org/newscodes/subjectcode/04000000

Industriproduktion
type: Concept
definition: Industriell framställning av föremål.
in scheme: mediatopic
created: 2009-10-22T02:00:00+00:00
modified: 2024-03-28T12:00:00+00:00
broader: Makroekonomi

Lagerstatus
type: Concept
definition: Varor som inte har sålts utan förvaras av producent, grossist eller återförsäljare.
in scheme: mediatopic
created: 2009-10-22T02:00:00+00:00
modified: 2024-03-28T12:00:00+00:00
broader: Makroekonomi

Produktivitet
type: Concept
definition: Förhållandet mellan erhållet resultat och insatta resurser vid industriell produktion.
in scheme: mediatopic
created: 2009-10-22T02:00:00+00:00
modified: 2024-03-28T12:00:00+00:00
broader: Makroekonomi

Arbetsmarknadsstatistik
type: Concept
definition: Statistik som beskriver den nationella arbetsmarknaden.
in scheme: mediatopic
created: 2009-10-22T02:00:00+00:00
modified: 2024-03-28T12:00:00+00:00
broader: Makroekonomi
broad match: http://cv.iptc.org/newscodes/subjectcode/04008000

Export
type: Concept
definition: Organiserad utförsel av varor eller tjänster från det egna landet till utlandet.
in scheme: mediatopic
created: 2009-10-22T02:00:00+00:00
modified: 2024-03-28T12:00:00+00:00
broader: Makroekonomi

Statligt bistånd
type: Concept
definition: Överföring av resurser till fattiga länder på förmånliga villkor med syftet att bidra till utveckling.
in scheme: mediatopic
created: 2009-10-22T02:00:00+00:00
retired: 2024-03-28T12:00:00+00:00
modified: 2024-03-28T12:00:00+00:00
broader: Makroekonomi

Statsskuld
type: Concept
definition: De pengar som staten är skyldig till exempel andra länder.
in scheme: mediatopic
created: 2009-10-22T02:00:00+00:00
modified: 2024-03-28T12:00:00+00:00
broader: Makroekonomi

Import
type: Concept
definition: Organiserad införsel av varor från utlandet till det egna landet.
in scheme: mediatopic
created: 2009-10-22T02:00:00+00:00
modified: 2024-03-28T12:00:00+00:00
broader: Makroekonomi

Inflation
type: Concept
definition: Ekonomisk utveckling som yttrar sig i fortlöpande allmän höjning av prisnivån och därmed försämring av penningvärdet.
in scheme: mediatopic
created: 2009-10-22T02:00:00+00:00
modified: 2024-03-28T12:00:00+00:00
broader: Makroekonomi
broad match: http://cv.iptc.org/newscodes/subjectcode/04008016

Investeringar
type: Concept
definition: Satsning av ekonomiskt värde med grundad förhoppning om framtida avkastning, vanligtvis i produktiv nyttighet och så att pengarna binds en längre tid.
in scheme: mediatopic
created: 2009-10-22T02:00:00+00:00
retired: 2024-03-28T12:00:00+00:00
modified: 2024-03-28T12:00:00+00:00
broader: Makroekonomi

Bolån
type: Concept
definition: Upplåning av pengar för köp av mark eller fastighet eller för reparation eller renovering av fastighet, mot säkerhet, vanligtvis i en fastighet.
in scheme: mediatopic
created: 2009-10-22T02:00:00+00:00
modified: 2024-03-28T12:00:00+00:00
broader: Makroekonomi

Marknadspriser
type: Concept
definition: Det monetära värdet av varor, tjänster, aktier eller obligationer.
in scheme: mediatopic
created: 2009-10-22T02:00:00+00:00
retired: 2024-03-28T12:00:00+00:00
modified: 2024-03-28T12:00:00+00:00
broader: Makroekonomi

Recession
type: Concept
definition: En mild form av lågkonjunktur och den vanligaste benämningen på en tillfällig nedgång i konjunkturen.
in scheme: mediatopic
created: 2009-10-22T02:00:00+00:00
modified: 2024-03-28T12:00:00+00:00
broader: Makroekonomi
broad match: http://cv.iptc.org/newscodes/subjectcode/04000000

Entreprenörskap
type: Concept
definition: Processen att skapa, lansera och driva ett nytt företag.
in scheme: mediatopic
created: 2016-04-04T12:00:00+00:00
modified: 2024-03-28T12:00:00+00:00
broader: Företag

Små och medelstora företag
type: Concept
definition: Företag vars antal anställda, omsättning och balansräkning inte får överskrida vissa nivåer som är uppsatta av landet de verkar i.
in scheme: mediatopic
created: 2016-04-04T12:00:00+00:00
modified: 2024-03-28T12:00:00+00:00
broader: Företag

Kooperativ
type: Concept
definition: En organisation eller företag som ägs och drivs gemensamt av sina medlemmar och som delar vinsterna från verksamheten.
in scheme: mediatopic
created: 2019-10-07T12:00:00+00:00
modified: 2021-07-12T12:00:00+00:00
broader: Företag

Konsumentfrågor
type: Concept
definition: Frågor kring priser, inflation/deflation och kvalitet på återförsäljarnivån.
in scheme: mediatopic
created: 2009-10-22T02:00:00+00:00
retired: 2024-03-28T12:00:00+00:00
modified: 2024-03-28T12:00:00+00:00
broader: Konsumenter

Kryptovaluta
type: Concept
definition: Digitala valutor där kryptografi används för att säkerställa transaktionerna.
in scheme: mediatopic
created: 2019-10-07T12:00:00+00:00
modified: 2021-07-12T12:00:00+00:00
broader: Valutor

Ränta
type: Concept
definition: Överenskommet pris på kredit som tas ut av långivaren, angivet i procent av lånesumman.
in scheme: mediatopic
created: 2009-10-22T02:00:00+00:00
modified: 2024-03-28T12:00:00+00:00
broader: Penningpolitik

Handelsavtal
type: Concept
definition: Överenskommelse mellan två eller flera länder om villkoren för handelsförbindelser länderna emellan.
in scheme: mediatopic
created: 2009-10-22T02:00:00+00:00
modified: 2024-03-28T12:00:00+00:00
broader: Internationell handel

Handelsbalans
type: Concept
definition: Skillnaden mellan värdet av ett lands expor toch värdet av dess import av varor.
in scheme: mediatopic
created: 2009-10-22T02:00:00+00:00
modified: 2024-03-28T12:00:00+00:00
broader: Internationell handel

Handelstvist
type: Concept
definition: Internationell dispyt om handelshinder, kartellverksamhet, prisdumpning med mera.
in scheme: mediatopic
created: 2009-10-22T02:00:00+00:00
modified: 2024-03-28T12:00:00+00:00
broader: Internationell handel

Handelspolitik
type: Concept
definition: Benämning på alla ekonomisk-politiska åtgärder med vilka avsikten är att påverka utrikeshandeln.
in scheme: mediatopic
created: 2009-10-22T02:00:00+00:00
modified: 2024-03-28T12:00:00+00:00
broader: Internationell handel

Tullavgifter
type: Concept
definition: En skatt enligt en tariff som betalas vid import eller export av varor över en landgräns, oftast för att utjämna prisdifferenser.
in scheme: mediatopic
created: 2009-10-22T02:00:00+00:00
modified: 2024-03-28T12:00:00+00:00
broader: Internationell handel

Råvarumarknad
type: Concept
definition: Handelsplats för standardiserad handel med råvaror och/eller handelsvaror, eller derivatinstrument baserade på dessa varor t ex bomull, olja, kol, metaller med mera.
in scheme: mediatopic
created: 2009-10-22T02:00:00+00:00
modified: 2024-03-28T12:00:00+00:00
broader: Marknader och börser
narrower: Energimarknad
narrower: Metallmarknad
narrower: Mjuk råvarumarknad

Obligationsmarknad
type: Concept
definition: Den del av kreditmarknaden som avser lån som vid sitt utgivande har en löptid på minst ett år.
in scheme: mediatopic
created: 2009-10-22T02:00:00+00:00
modified: 2024-03-28T12:00:00+00:00
broader: Marknader och börser

Valutamarknad
type: Concept
definition: Den handel med valutor i vilken valutakurser bestäms.
in scheme: mediatopic
created: 2009-10-22T02:00:00+00:00
modified: 2024-03-28T12:00:00+00:00
broader: Marknader och börser

Lånemarknad
type: Concept
definition: Marknad där pengar kan lånas till bestämda räntesatser.
in scheme: mediatopic
created: 2009-10-22T02:00:00+00:00
modified: 2024-03-28T12:00:00+00:00
broader: Marknader och börser

Energimarknad
type: Concept
definition: Handelsplats för el, gas, kol, olja och utsläppsrätter för koldioxid.
in scheme: mediatopic
created: 2009-10-22T02:00:00+00:00
modified: 2024-03-28T12:00:00+00:00
broader: Råvarumarknad

Metallmarknad
type: Concept
definition: Handelsplats för metaller såsom koppar, stål, aluminium, zink med mera.
in scheme: mediatopic
created: 2009-10-22T02:00:00+00:00
modified: 2021-02-18T12:00:00+00:00
broader: Råvarumarknad

Mjuk råvarumarknad
type: Concept
definition: Handelsplats för råvaror som odlas, såsom bomull, socker, sojabönor med mera.
in scheme: mediatopic
created: 2009-10-22T02:00:00+00:00
retired: 2023-10-02T12:00:00+00:00
modified: 2024-03-28T12:00:00+00:00
broader: Råvarumarknad

Lån
type: Concept
definition: Innehav av annans egendom för eget bruk med skyldighet för låntagaren att återställa det lånade föremålet eller motsvarande värde till en bestämd ränta och vid en bestämd tidpunkt..
in scheme: mediatopic
created: 2009-10-22T02:00:00+00:00
modified: 2024-03-28T12:00:00+00:00
broader: Finansiella tjänster

Derivat
type: Concept
definition: Värdepapper, t ex optioner, vars värde påverkas av värdet på ett annat värdepapper, t ex aktier.
in scheme: mediatopic
created: 2009-10-22T02:00:00+00:00
modified: 2023-03-31T12:00:00+00:00
broader: Aktier

Aktieråd
type: Concept
definition: En analytikers rekommendation kring en specifik aktie.
in scheme: mediatopic
created: 2012-10-04T12:00:00+00:00
retired: 2023-03-31T12:00:00+00:00
modified: 2023-03-31T12:00:00+00:00
broader: Aktier
narrower: Köpråd
narrower: Råd att behålla
narrower: Säljråd

Aktierusning
type: Concept
definition: Anmärkningsvärd prisrörelse hos en specifik aktie.
in scheme: mediatopic
created: 2012-10-04T12:00:00+00:00
retired: 2023-03-31T12:00:00+00:00
modified: 2023-03-31T12:00:00+00:00
broader: Aktier

Låg- och mellanstadium
type: Concept
definition: De två inledande, treåriga stadierna av grundskolan, årskurserna 1-6 samt F-klass.
in scheme: mediatopic
created: 2009-10-22T02:00:00+00:00
modified: 2021-09-30T12:00:00+00:00
broader: Skola

Vidareutbildning
type: Concept
definition: All form av utbildning utöver grundutbildningen på olika utbildningsnivåer.
in scheme: mediatopic
created: 2009-10-22T02:00:00+00:00
retired: 2021-09-30T12:00:00+00:00
modified: 2021-09-30T12:00:00+00:00
broader: Skola

Vuxenutbildning
type: Concept
definition: Samlingsnamn för ett flertal former av utbildning för vuxna människor.
in scheme: mediatopic
created: 2009-10-22T02:00:00+00:00
modified: 2024-07-01T12:00:00+00:00
broader: Skola

Gymnasium
type: Concept
definition: En skolform för teoretisk utbildning mellan grundskola och universitet eller högskola.
in scheme: mediatopic
created: 2009-10-22T02:00:00+00:00
modified: 2021-09-30T12:00:00+00:00
broader: Skola

Högre utbildning
type: Concept
definition: Utbildning vid universitet, akademier, högskolor, seminarier, konservatorier och liknande institutioner, som oftast resulterar i en examen.
in scheme: mediatopic
created: 2009-10-22T02:00:00+00:00
modified: 2021-09-30T12:00:00+00:00
broader: Skola
narrower: Högskola
narrower: Universitet
broad match: http://cv.iptc.org/newscodes/subjectcode/05000000

Högstadium
type: Concept
definition: Grundskolans avslutande treåriga stadium omfattande årskurserna 7-9.
in scheme: mediatopic
created: 2009-10-22T02:00:00+00:00
modified: 2021-09-30T12:00:00+00:00
broader: Skola

Förskola
type: Concept
definition: Pedagogisk verksamhet för inskrivna barn i åldern 1–5 år.
in scheme: mediatopic
created: 2009-10-22T02:00:00+00:00
modified: 2021-09-30T12:00:00+00:00
broader: Skola

Religiösa skolor
type: Concept
definition: Skolor där undervisningen handlar om och är styrd av en viss trosinriktning.
in scheme: mediatopic
created: 2019-04-06T12:00:00+00:00
modified: 2021-09-30T12:00:00+00:00
broader: Skola

Kommunal skola
type: Concept
definition: En kommunal skola är öppen för alla och ingår i det offentliga skolväsendet i Sverige
in scheme: mediatopic
created: 2019-04-06T12:00:00+00:00
modified: 2021-09-30T12:00:00+00:00
broader: Skola

Privatskola
type: Concept
definition: En typ av skola som inte administreras av lokala, regionala eller nationella myndigheter. Privatskolan förbehåller sig rätten att välja de elever som tas in på skolan och finansieras genom avgifter snarare än offentlig finansiering
in scheme: mediatopic
created: 2019-04-06T12:00:00+00:00
modified: 2021-09-30T12:00:00+00:00
broader: Skola

Friskola
type: Concept
definition: En skola som inte drivs av offentliga sektorn, men som huvudsakligen finansieras av skattemedel
in scheme: mediatopic
created: 2019-04-06T12:00:00+00:00
modified: 2021-09-30T12:00:00+00:00
broader: Skola

Högskola
type: Concept
definition: Läroanstalt för högre utbildning och forskning, där det i princip krävs avslutade gymnasiestudier för att komma in.
in scheme: mediatopic
created: 2009-10-22T02:00:00+00:00
retired: 2021-09-30T12:00:00+00:00
modified: 2021-09-30T12:00:00+00:00
broader: Högre utbildning
broad match: http://cv.iptc.org/newscodes/subjectcode/05000000

Universitet
type: Concept
definition: Inrättning för forskning och högre eftergymnasial utbildning inom de viktigaste traditionella kunskapsområdena.
in scheme: mediatopic
created: 2009-10-22T02:00:00+00:00
retired: 2021-09-30T12:00:00+00:00
modified: 2021-09-30T12:00:00+00:00
broader: Högre utbildning

Global uppvärmning
type: Concept
definition: Den konstaterade ökningen av medeltemperaturen på jordytan sedan slutet av 1800-talet.
in scheme: mediatopic
created: 2009-10-22T02:00:00+00:00
retired: 2025-06-30T12:00:00+00:00
modified: 2025-06-30T12:00:00+00:00
broader: Klimatförändringar

Energibesparing
type: Concept
definition: Minskning av energianvändningen genom att avstå från tjänster och nyttigheter, t ex genom sänkning av inomhustemperaturen.
in scheme: mediatopic
created: 2009-10-22T02:00:00+00:00
retired: 2025-06-30T12:00:00+00:00
modified: 2025-06-30T12:00:00+00:00
broader: Naturvård

Nationalparker och naturreservat
type: Concept
definition: Områden med värdefulla naturmiljöer som med lagar skyddas från exploatering.
in scheme: mediatopic
created: 2009-10-22T02:00:00+00:00
modified: 2025-06-30T12:00:00+00:00
broader: Naturvård

Miljöpolitik
type: Concept
definition: Politiska program gällande miljö och klimat såsom miljöskydd, föroreningar, förnybar energi och bevarandefrågor.
in scheme: mediatopic
created: 2009-10-22T02:00:00+00:00
modified: 2025-03-31T12:00:00+00:00
broader: Regeringsförklaring

Luftföroreningar
type: Concept
definition: Ämnen som förekommer i atmosfären i så stor mängd att det kan skada människor, djur, växter eller föremål.
in scheme: mediatopic
created: 2009-10-22T02:00:00+00:00
modified: 2025-10-09T12:00:00+00:00
broader: Föroreningar

Miljösanering
type: Concept
definition: Åtgärder som syftar till att befria en plats från något skadligt och göra den beboelig igen, antingen för människor eller djur.
in scheme: mediatopic
created: 2009-10-22T02:00:00+00:00
modified: 2025-10-09T12:00:00+00:00
broader: Föroreningar

Farligt avfall
type: Concept
definition: Avfall som bedömts utgöra ett särskilt starkt hot mot miljön och därför måste omhändertas med särskild försiktighet och under särskilda bestämmelser.
in scheme: mediatopic
created: 2009-10-22T02:00:00+00:00
modified: 2025-10-09T12:00:00+00:00
broader: Föroreningar

Avfall
type: Concept
definition: Skräpets påverkan på miljön, inklusive återvinning.
in scheme: mediatopic
created: 2009-10-22T02:00:00+00:00
modified: 2025-10-09T12:00:00+00:00
broader: Föroreningar

Vattenföroreningar
type: Concept
definition: Ämnen som förekommer i vatten i så stor mängd att det kan skada människor, djur och växter.
in scheme: mediatopic
created: 2009-10-22T02:00:00+00:00
modified: 2025-10-09T12:00:00+00:00
broader: Föroreningar

Energiresurser
type: Concept
definition: Resurser såsom kol, gas, vind, solljus och så vidare, som används för att generera värme och el.
in scheme: mediatopic
created: 2009-10-22T02:00:00+00:00
retired: 2025-06-30T12:00:00+00:00
modified: 2025-06-30T12:00:00+00:00
broader: Naturresurser

Landresurser
type: Concept
definition: Den del av ett land som är över vattenytan och tillgänglig för utveckling, antingen i vinstdrivande syfte eller för allmänhetens bästa.
in scheme: mediatopic
created: 2009-10-22T02:00:00+00:00
retired: 2025-06-30T12:00:00+00:00
modified: 2025-06-30T12:00:00+00:00
broader: Naturresurser

Befolkningstillväxt
type: Concept
definition: Ökning av folkmängden i ett givet område.
in scheme: mediatopic
created: 2009-10-22T02:00:00+00:00
retired: 2025-06-30T12:00:00+00:00
modified: 2025-06-30T12:00:00+00:00
broader: Naturresurser

Förnybar energi
type: Concept
definition: Energikällor som direkt eller indirekt baseras på solinstrålning och därigenom fortlöpande förnyas i samma takt som de används, t ex solkraft, vindkraft, vattenkraft och geotermisk energi.
in scheme: mediatopic
created: 2009-10-22T02:00:00+00:00
retired: 2023-03-31T12:00:00+00:00
modified: 2023-03-31T12:00:00+00:00
broader: Naturresurser

Vatten
type: Concept
definition: Miljöfrågor som avser vatten, inklusive hav, sjöar, floder, glaciärer och is.
in scheme: mediatopic
created: 2009-10-22T02:00:00+00:00
retired: 2025-10-09T12:00:00+00:00
modified: 2021-02-18T12:00:00+00:00
broader: Naturresurser

Skogar
type: Concept
definition: Större område, som är tätt bevuxet med träd, vilt eller planterat.
in scheme: mediatopic
created: 2009-10-22T02:00:00+00:00
modified: 2025-06-30T12:00:00+00:00
broader: Natur

Berg
type: Concept
definition: Större upphöjning av jordytan, vanligtvis bestående av sten, helst med jämförelsevis branta sidor eller med avsevärd höjd över omgivningen.
in scheme: mediatopic
created: 2009-10-22T02:00:00+00:00
modified: 2025-06-30T12:00:00+00:00
broader: Natur

Hav
type: Concept
definition: Det sammanhängande vattenområde som omger jordens kontinenter, vanligtvis synonymt med världshavet eller oceanerna.
in scheme: mediatopic
created: 2009-10-22T02:00:00+00:00
modified: 2025-06-30T12:00:00+00:00
broader: Natur

Floder, älvar och åar
type: Concept
definition: Större rinnande vattendrag med i stort sett parallella sidor, vanligtvis med funktionen att avvattna en sjö eller dylikt.
in scheme: mediatopic
created: 2009-10-22T02:00:00+00:00
modified: 2025-06-30T12:00:00+00:00
broader: Natur

Våtmarker
type: Concept
definition: Ett område i naturen som hela tiden eller ibland är dränkt i vatten.
in scheme: mediatopic
created: 2009-10-22T02:00:00+00:00
modified: 2025-06-30T12:00:00+00:00
broader: Natur

Ekosystem
type: Concept
definition: Enhet som innefattar alla organismer och deras omgivning inom ett område t ex en sjö eller en skog.
in scheme: mediatopic
created: 2009-10-22T02:00:00+00:00
modified: 2025-10-09T12:00:00+00:00
broader: Natur

Utrotningshotade arter
type: Concept
definition: Arter som riskerar att inom en nära framtid helt försvinna från ett bestämt område eller från hela jorden, i strikt bemärkelse på grund av aktiv förföljelse från människan.
in scheme: mediatopic
created: 2009-10-22T02:00:00+00:00
modified: 2025-10-09T12:00:00+00:00
broader: Natur

Invasiva arter
type: Concept
definition: Icke ursprungliga arter vilka påverkar det ekosystem som arterna koloniserar.
in scheme: mediatopic
created: 2009-10-22T02:00:00+00:00
modified: 2025-10-09T12:00:00+00:00
broader: Natur

Djur
type: Concept
definition: Nyheter om djur där fokus ligger på känslomässiga saker.
in scheme: mediatopic
created: 2009-10-22T02:00:00+00:00
modified: 2025-10-09T12:00:00+00:00
broader: Natur
narrower: Djursjukdomar
narrower: Skadedjur

Växter
type: Concept
definition: Nyheter om växter där fokus är på känslomässiga saker.
in scheme: mediatopic
created: 2009-10-22T02:00:00+00:00
modified: 2025-10-09T12:00:00+00:00
broader: Natur
narrower: Växtsjukdomar

Cancer
type: Concept
definition: En svår tumörsjukdom med okontrollerad celltillväxt varvid de nya cellerna förstör den omgivande vävnaden, ofta dödlig.
in scheme: mediatopic
created: 2009-10-22T02:00:00+00:00
modified: 2021-02-18T12:00:00+00:00
broader: Sjukdomar och sjukdomstillstånd

Smittsamma sjukdomar
type: Concept
definition: Sjukdomar som kan överföras från en människa till en annan.
in scheme: mediatopic
created: 2009-10-22T02:00:00+00:00
modified: 2021-02-18T12:00:00+00:00
broader: Sjukdomar och sjukdomstillstånd
narrower: Epidemier
narrower: Virussjukdomar

Hjärt- och kärlsjukdomar
type: Concept
definition: Samlingsbenämning på sjukdomar som drabbar hjärtat, blodkärlen eller bådadera.
in scheme: mediatopic
created: 2009-10-22T02:00:00+00:00
modified: 2022-06-14T12:00:00+00:00
broader: Sjukdomar och sjukdomstillstånd

Åkommor
type: Concept
definition: Ospecificerade sjukdomar, såsom magknip, huvudvärk, ryggskott och liknande.
in scheme: mediatopic
created: 2009-10-22T02:00:00+00:00
retired: 2022-06-14T12:00:00+00:00
modified: 2022-06-14T12:00:00+00:00
broader: Sjukdomar och sjukdomstillstånd

Kroppsskador
type: Concept
definition: Ett traumatiskt, kroppsligt tillstånd vanligen orsakat av yttre våld.
in scheme: mediatopic
created: 2009-10-22T02:00:00+00:00
modified: 2022-06-14T12:00:00+00:00
broader: Sjukdomar och sjukdomstillstånd

Medicinska tillstånd
type: Concept
definition: Olika nivåer av sjukdom eller skada.
in scheme: mediatopic
created: 2009-10-22T02:00:00+00:00
modified: 2024-07-01T12:00:00+00:00
broader: Sjukdomar och sjukdomstillstånd
narrower: Fetma

Psykisk ohälsa
type: Concept
definition: Tillstånd av psykisk ohälsa som drabbar personligheten, känslolivet och kognitionen.
in scheme: mediatopic
created: 2009-10-22T02:00:00+00:00
modified: 2022-06-14T12:00:00+00:00
broader: Sjukdomar och sjukdomstillstånd
narrower: Ätstörning
narrower: Depression
narrower: Ångest och stress
broad match: http://cv.iptc.org/newscodes/subjectcode/07000000

Förgiftning
type: Concept
definition: När någon får i sig ett ämne i så stor dos att det skadar personen.
in scheme: mediatopic
created: 2021-05-05T12:00:00+00:00
modified: 2021-12-21T12:00:00+00:00
broader: Sjukdomar och sjukdomstillstånd

Funktionsnedsättning
type: Concept
definition: Till följd av en medfödd eler förvärvad skada har en människa har nedsatt förmåga att fungera fysiskt eller psykiskt.
in scheme: mediatopic
created: 2022-06-14T12:00:00+00:00
modified: 2022-06-14T12:00:00+00:00
broader: Sjukdomar och sjukdomstillstånd

Epidemier
type: Concept
definition: Uppkomst av stort antal fall av smittsam sjukdom hos viss befolkning.
in scheme: mediatopic
created: 2009-10-22T02:00:00+00:00
modified: 2022-06-14T12:00:00+00:00
broader: Smittsamma sjukdomar
narrower: Pest
narrower: Pandemi
broad match: http://cv.iptc.org/newscodes/subjectcode/07002000

Virussjukdomar
type: Concept
definition: Sjukdomar orsakade av den typ av smittämnen som kallas virus.
in scheme: mediatopic
created: 2009-10-22T02:00:00+00:00
modified: 2022-06-14T12:00:00+00:00
broader: Smittsamma sjukdomar
narrower: Aids
narrower: Retrovirus

Pest
type: Concept
definition: Typ av häftigt förlöpande infektionssjukdom som medför hög feber och stark medtagenhet.
in scheme: mediatopic
created: 2009-10-22T02:00:00+00:00
retired: 2022-06-14T12:00:00+00:00
modified: 2022-06-14T12:00:00+00:00
broader: Epidemier
broad match: http://cv.iptc.org/newscodes/subjectcode/07002000

Pandemi
type: Concept
definition: Epidemi som får spridning över stora delar av världen och drabbar många människor
in scheme: mediatopic
created: 2019-04-06T12:00:00+00:00
retired: 2022-06-14T12:00:00+00:00
modified: 2022-06-14T12:00:00+00:00
broader: Epidemier

Aids
type: Concept
definition: En dödlig sjukdom som kännetecknas av svåra skador på immunförsvaret, vilket medför att den drabbade blir extremt känslig för infektioner. Aids orsakas av humant immunbristvirus, HIV, och utgör slutstadiet av en hiv-infektion.
in scheme: mediatopic
created: 2009-10-22T02:00:00+00:00
modified: 2022-06-14T12:00:00+00:00
broader: Virussjukdomar

Retrovirus
type: Concept
definition: En familj av RNA-virus som orsakar bland annat leukemi och aids.
in scheme: mediatopic
created: 2009-10-22T02:00:00+00:00
retired: 2022-06-14T12:00:00+00:00
modified: 2022-06-14T12:00:00+00:00
broader: Virussjukdomar

Fetma
type: Concept
definition: Kroppsvikt som överstiger vad som bedöms vara övre gräns för normal vikt.
in scheme: mediatopic
created: 2009-10-22T02:00:00+00:00
modified: 2022-06-14T12:00:00+00:00
broader: Medicinska tillstånd

Ätstörning
type: Concept
definition: Tillstånd som kännetecknas av problem med ätande, aptit och vikt, såsom anorexia, bulimi och hetsätning.
in scheme: mediatopic
created: 2009-10-22T02:00:00+00:00
modified: 2021-02-18T12:00:00+00:00
broader: Psykisk ohälsa

Depression
type: Concept
definition: Ett mer konstant tillstånd av nedstämdhet som innebär att den drabbade personen tappar intresset att göra saker och delta i vardagslivet.
in scheme: mediatopic
created: 2022-06-14T12:00:00+00:00
modified: 2022-06-14T12:00:00+00:00
broader: Psykisk ohälsa

Ångest och stress
type: Concept
definition: Ett känslomässigt tillstånd där oro och/eller stress innebär störningar i en persons vardag.
in scheme: mediatopic
created: 2022-06-14T12:00:00+00:00
modified: 2022-06-14T12:00:00+00:00
broader: Psykisk ohälsa

Sjukhus och kliniker
type: Concept
definition: Medicinska inrättningar för behandling av sjuka och skadade.
in scheme: mediatopic
created: 2009-10-22T02:00:00+00:00
modified: 2021-05-05T12:00:00+00:00
broader: Vårdinrättningar

Primärvård
type: Concept
definition: Vårdinrättningar där personer med medicinska problem kan söka en första kontakt med sjukvården. Antingen för direkt åtgärde eller remiss för vidare behandling.
in scheme: mediatopic
created: 2019-04-06T12:00:00+00:00
modified: 2021-07-12T12:00:00+00:00
broader: Vårdinrättningar

Diet
type: Concept
definition: Sammansättning av kost under längre period, särskilt sådan som är fastställd av medicinska skäl.
in scheme: mediatopic
created: 2009-10-22T02:00:00+00:00
modified: 2022-06-14T12:00:00+00:00
broader: Behandlingar
narrower: Kosttillskott

Mediciner
type: Concept
definition: Medel mot kroppsliga eller psykiska besvär, auktoriserade av läkarvetenskapen.
in scheme: mediatopic
created: 2009-10-22T02:00:00+00:00
modified: 2022-06-14T12:00:00+00:00
broader: Behandlingar
broad match: http://cv.iptc.org/newscodes/subjectcode/07000000

Receptbelagda mediciner
type: Concept
definition: Mediciner som bara kan köpas med läkares tillstånd.
in scheme: mediatopic
created: 2009-10-22T02:00:00+00:00
modified: 2022-06-14T12:00:00+00:00
broader: Behandlingar

Medicinska tester
type: Concept
definition: Medicinska analysprocedurer såsom blodprov, stresstester, skiktröntgen, magnetisk resonanstomografi med mera.
in scheme: mediatopic
created: 2009-10-22T02:00:00+00:00
modified: 2022-06-14T12:00:00+00:00
broader: Behandlingar

Medicin
type: Concept
definition: En substans som används för att eliminera en sjukdom.
in scheme: mediatopic
created: 2009-10-22T02:00:00+00:00
modified: 2022-06-14T12:00:00+00:00
broader: Behandlingar
narrower: Örtmedicin
narrower: Holistisk medicin
narrower: Kinesisk medicin
narrower: Västerländsk medicin

Fysisk kondition
type: Concept
definition: Kroppens fysiska tillstånd hos en person.
in scheme: mediatopic
created: 2009-10-22T02:00:00+00:00
retired: 2022-06-14T12:00:00+00:00
modified: 2022-06-14T12:00:00+00:00
broader: Behandlingar

Förebyggande medicin
type: Concept
definition: Åtgärder som syftar till att bevara god hälsa och förhindra att skador och sjukdomar uppkommer eller förvärras.
in scheme: mediatopic
created: 2009-10-22T02:00:00+00:00
retired: 2022-06-14T12:00:00+00:00
modified: 2022-06-14T12:00:00+00:00
broader: Behandlingar

Vacciner
type: Concept
definition: Skydd mot viss sjukdom, vilket består av försvagat smittämne som i liten dos införs i kroppen, som därvid utvecklar antikroppar mot denna sjukdom.
in scheme: mediatopic
created: 2009-10-22T02:00:00+00:00
modified: 2022-06-14T12:00:00+00:00
broader: Behandlingar

Terapi
type: Concept
definition: Särskild medicinsk eller psykologisk behandling ofta med aktivt deltagande av patienten.
in scheme: mediatopic
created: 2009-10-22T02:00:00+00:00
modified: 2021-02-18T12:00:00+00:00
broader: Behandlingar

Missbruksvård
type: Concept
definition: Vård av personer som hamnat i missbruk av alkohol eller droger.
in scheme: mediatopic
created: 2019-04-06T12:00:00+00:00
modified: 2022-06-14T12:00:00+00:00
broader: Behandlingar

Akutsjukvård
type: Concept
definition: Sjukvård som tar hand om akuta fall som är oplanerade men allvarliga. Patienter kommer in utan föregående tidsbokning eller tom med ambulans.
in scheme: mediatopic
created: 2019-04-06T12:00:00+00:00
modified: 2022-06-14T12:00:00+00:00
broader: Behandlingar

Kirurgi (ingrepp)
type: Concept
definition: Metoder för att bota sjukdomar eller laga skador genom ingrepp i patientens kropp med hjälp av medicinska instrument.
in scheme: mediatopic
created: 2019-04-06T12:00:00+00:00
modified: 2021-07-12T12:00:00+00:00
broader: Behandlingar

Kosttillskott
type: Concept
definition: Livsmedel som är avsedda att komplettera en normal kost.
in scheme: mediatopic
created: 2009-10-22T02:00:00+00:00
modified: 2022-06-14T12:00:00+00:00
broader: Diet

Örtmedicin
type: Concept
definition: Benämning på medel, huvudsakligen avsedda för egenbehandling, vilka utgörs av torkade växtdelar eller extrakt av sådana som används för att bota sjukdomar.
in scheme: mediatopic
created: 2009-10-22T02:00:00+00:00
modified: 2022-06-14T12:00:00+00:00
broader: Medicin

Holistisk medicin
type: Concept
definition: Behandling av hela personen, inklusive mentala och sociala faktorer, i stället för bara av sjukdomens symptom.
in scheme: mediatopic
created: 2009-10-22T02:00:00+00:00
modified: 2022-06-14T12:00:00+00:00
broader: Medicin

Kinesisk medicin
type: Concept
definition: Utövandet av diagnosticering, behandling och förebyggande av sjukdomar baserat på traditionella metoder utvecklade i Östasien.
in scheme: mediatopic
created: 2009-10-22T02:00:00+00:00
modified: 2022-06-14T12:00:00+00:00
broader: Medicin

Västerländsk medicin
type: Concept
definition: Utövandet av diagnosticering, behandling och förebyggande av sjukdomar baserat på vetenskaplig forskning i den västra hemisfären.
in scheme: mediatopic
created: 2009-10-22T02:00:00+00:00
modified: 2022-06-14T12:00:00+00:00
broader: Medicin

Hälso- och sjukvårdspolitik
type: Concept
definition: Politiska program för sjukvård, tandvård, psykiatri och folkhälsa.
in scheme: mediatopic
created: 2009-10-22T02:00:00+00:00
modified: 2025-03-31T12:00:00+00:00
broader: Regeringsförklaring

Medicaid
type: Concept
definition: Ett offentligt finansierat sjukförsäkringssystem i USA för låginkomsttagare och deras familjer.
in scheme: mediatopic
created: 2009-10-22T02:00:00+00:00
retired: 2014-06-02T12:00:00+00:00
modified: 2021-02-18T12:00:00+00:00
broader: Offentlig sjukvård

Medicare
type: Concept
definition: Ett offentligt finansierat sjukförsäkringssystem i USA för personer som är minst 65 år eller handikappade.
in scheme: mediatopic
created: 2009-10-22T02:00:00+00:00
retired: 2014-06-02T12:00:00+00:00
modified: 2021-02-18T12:00:00+00:00
broader: Offentlig sjukvård

Medicinska hjälpmedel
type: Concept
definition: Stöd för doktorer, såsom blodprover och andra prover, röntgenbilder och så vidare.
in scheme: mediatopic
created: 2009-10-22T02:00:00+00:00
modified: 2022-06-14T12:00:00+00:00
broader: Vårdyrken

Medicinsk specialisering
type: Concept
definition: De olika medicinska specialiseringsområdena.
in scheme: mediatopic
created: 2009-10-22T02:00:00+00:00
modified: 2022-06-14T12:00:00+00:00
broader: Vårdyrken
narrower: Geriatrik
narrower: Gynekologi
narrower: Pediatrik
narrower: Reproduktiv medicin
narrower: Tandvård
narrower: Farmakologi
narrower: Veterinärmedicin
narrower: Allmänmedicin
narrower: Ortopedi
narrower: Onkologi
narrower: Röntgen
narrower: Ögonvård
narrower: Kirurgi (inriktning)
narrower: Psykiatri

Sjukvårdspersonal
type: Concept
definition: Doktorer, sköterskor och andra som jobbar på en medicinsk inrättning.
in scheme: mediatopic
created: 2009-10-22T02:00:00+00:00
modified: 2021-05-05T12:00:00+00:00
broader: Vårdyrken

Geriatrik
type: Concept
definition: Medicinskt kunskapsområde som omfattar sjukdomar hos äldre, vanligen med en nedre åldersgräns vid 65 år.
in scheme: mediatopic
created: 2009-10-22T02:00:00+00:00
retired: 2022-06-14T12:00:00+00:00
modified: 2022-06-14T12:00:00+00:00
broader: Medicinsk specialisering

Gynekologi
type: Concept
definition: Medicinskt kunskapsområde som omfattar sjukdomar i de kvinnliga könsorganen.
in scheme: mediatopic
created: 2009-10-22T02:00:00+00:00
retired: 2022-06-14T12:00:00+00:00
modified: 2022-06-14T12:00:00+00:00
broader: Medicinsk specialisering

Pediatrik
type: Concept
definition: Medicinskt kunskapsområde som omfattar sjukdomar och hälsobetingelser hos barn och under adolescensen, samt i vissa avseenden även hos foster under tiden närmast före födelsen.
in scheme: mediatopic
created: 2009-10-22T02:00:00+00:00
modified: 2022-06-14T12:00:00+00:00
broader: Medicinsk specialisering

Reproduktiv medicin
type: Concept
definition: Olika metoder att behandla par som inte kan få barn på naturlig väg, såsom provrörsbefruktning.
in scheme: mediatopic
created: 2009-10-22T02:00:00+00:00
retired: 2022-06-14T12:00:00+00:00
modified: 2022-06-14T12:00:00+00:00
broader: Medicinsk specialisering
broad match: http://cv.iptc.org/newscodes/subjectcode/07014003

Tandvård
type: Concept
definition: Det medicinska yrket och forskningsfältet som rör diagnosticering, förebyggande arbete och behandling av tänderna.
in scheme: mediatopic
created: 2009-10-22T02:00:00+00:00
modified: 2021-02-18T12:00:00+00:00
broader: Medicinsk specialisering
broad match: http://cv.iptc.org/newscodes/subjectcode/13019000

Farmakologi
type: Concept
definition: Det medicinska yrket och forskningsfältet som rör läkemedel.
in scheme: mediatopic
created: 2009-10-22T02:00:00+00:00
retired: 2022-06-14T12:00:00+00:00
modified: 2022-06-14T12:00:00+00:00
broader: Medicinsk specialisering
broad match: http://cv.iptc.org/newscodes/subjectcode/13019000

Veterinärmedicin
type: Concept
definition: Det medicinska yrket och forskningsfältet som rör diagnosticering, förebyggande arbete och behandlingar av sjukdomar hos djur.
in scheme: mediatopic
created: 2009-10-22T02:00:00+00:00
modified: 2021-02-18T12:00:00+00:00
broader: Medicinsk specialisering
broad match: http://cv.iptc.org/newscodes/subjectcode/13019000

Allmänmedicin
type: Concept
definition: Sjukvård som tar hand om alla möjliga åkommor internt i kroppen och som inte hör till någon specialist-vård.
in scheme: mediatopic
created: 2019-04-06T12:00:00+00:00
retired: 2022-06-14T12:00:00+00:00
modified: 2022-06-14T12:00:00+00:00
broader: Medicinsk specialisering

Ortopedi
type: Concept
definition: Sjukvård som tar hand om saker som gäller kroppens leder och rörlighet.
in scheme: mediatopic
created: 2019-04-06T12:00:00+00:00
retired: 2022-06-14T12:00:00+00:00
modified: 2022-06-14T12:00:00+00:00
broader: Medicinsk specialisering

Onkologi
type: Concept
definition: Läran om tumörsjukdomar. Medicinsk specialitet som fokuserar på tumörsjukdomar
in scheme: mediatopic
created: 2019-04-06T12:00:00+00:00
retired: 2022-06-14T12:00:00+00:00
modified: 2022-06-14T12:00:00+00:00
broader: Medicinsk specialisering

Röntgen
type: Concept
definition: Använda strålning eller liknande metoder för att avbilda kroppens insida.
in scheme: mediatopic
created: 2019-04-06T12:00:00+00:00
retired: 2022-06-14T12:00:00+00:00
modified: 2022-06-14T12:00:00+00:00
broader: Medicinsk specialisering

Ögonvård
type: Concept
definition: Sjukvård som hanterar sjukdommar och andra problem i ögonen/synen.
in scheme: mediatopic
created: 2019-04-06T12:00:00+00:00
modified: 2022-06-14T12:00:00+00:00
broader: Medicinsk specialisering

Kirurgi (inriktning)
type: Concept
definition: Sjukvård där någon form av ingrepp i kroppen sker för att avlägsna skadade delar, eller reparera skadade saker.
in scheme: mediatopic
created: 2019-04-06T12:00:00+00:00
retired: 2022-06-14T12:00:00+00:00
modified: 2022-06-14T12:00:00+00:00
broader: Medicinsk specialisering

Psykiatri
type: Concept
definition: Sjukvård som gäller diagnosticering, förebyggande och behandling av mentala åkommor.
in scheme: mediatopic
created: 2019-04-06T12:00:00+00:00
retired: 2022-06-14T12:00:00+00:00
modified: 2022-06-14T12:00:00+00:00
broader: Medicinsk specialisering

Djursjukdomar
type: Concept
definition: Sjukdomar som drabbar djur.
in scheme: mediatopic
created: 2009-10-22T02:00:00+00:00
modified: 2025-10-09T12:00:00+00:00
broader: Djur

Växtsjukdomar
type: Concept
definition: Sjukdomar som drabbar växter, orsakade av parasiter eller miljöproblem.
in scheme: mediatopic
created: 2009-10-22T02:00:00+00:00
modified: 2025-10-09T12:00:00+00:00
broader: Växter

Skadedjur
type: Concept
definition: Djur eller insekter som tar sig in i byggnader och ställer till skada
in scheme: mediatopic
created: 2021-02-18T12:00:00+00:00
modified: 2025-10-09T12:00:00+00:00
broader: Djur

Namngivning
type: Concept
definition: Nyheter om namngivning/dop
in scheme: mediatopic
created: 2019-06-26T12:00:00+00:00
modified: 2021-07-12T12:00:00+00:00
broader: Ceremonier

Examen & student
type: Concept
definition: Nyheter om studenter och andra former av examen
in scheme: mediatopic
created: 2019-06-26T12:00:00+00:00
modified: 2021-07-12T12:00:00+00:00
broader: Ceremonier

Begravning
type: Concept
definition: Nyheter om jordfästning av en person
in scheme: mediatopic
created: 2019-06-26T12:00:00+00:00
modified: 2021-07-12T12:00:00+00:00
broader: Ceremonier

Bröllop
type: Concept
definition: Olika aktiviteter kring den ceremoni då två personer gifter sig, kyrkligt eller borgerligt.
in scheme: mediatopic
created: 2019-06-26T12:00:00+00:00
modified: 2021-07-12T12:00:00+00:00
broader: Ceremonier

Kungligt
type: Concept
definition: Nyheter om kungliga personer och då främst deras sociala liv till skillnad från mer officiella uppdrag.
in scheme: mediatopic
created: 2009-10-22T02:00:00+00:00
modified: 2021-05-05T12:00:00+00:00
broader: Societeten

Lärlingar
type: Concept
definition: Den som lär ett yrke, oftast ett hantverksyrke, genom att arbeta tillsammans med någon tidigare yrkesutbildad.
in scheme: mediatopic
created: 2009-10-22T02:00:00+00:00
modified: 2021-02-18T12:00:00+00:00
broader: Anställning

Barnarbete
type: Concept
definition: Arbete utfört av barn under 18 års ålder.
in scheme: mediatopic
created: 2009-10-22T02:00:00+00:00
modified: 2021-02-18T12:00:00+00:00
broader: Anställning

Arbetstagare
type: Concept
definition: Fysisk person som i ett anställningsavtal mot vederlag utför arbete åt motparten, arbetsgivaren.
in scheme: mediatopic
created: 2009-10-22T02:00:00+00:00
modified: 2021-02-18T12:00:00+00:00
broader: Anställning

Arbetsgivare
type: Concept
definition: Juridisk eller fysisk person som betalar en annan person, arbetstagaren, lön för att få visst arbete utfört.
in scheme: mediatopic
created: 2009-10-22T02:00:00+00:00
modified: 2021-02-18T12:00:00+00:00
broader: Anställning

Yrkesträning
type: Concept
definition: Inlärning av kunskap och färdigheter som krävs för ett specifikt yrke.
in scheme: mediatopic
created: 2009-10-22T02:00:00+00:00
modified: 2021-02-18T12:00:00+00:00
broader: Anställning
narrower: Kompetensutveckling
narrower: Omskolning
broad match: http://cv.iptc.org/newscodes/subjectcode/09003000

Yrken
type: Concept
definition: Typ av arbete som det går att försörja sig på och som kräver vissa särskilda kunskaper.
in scheme: mediatopic
created: 2009-10-22T02:00:00+00:00
retired: 2019-10-07T12:00:00+00:00
modified: 2021-02-18T12:00:00+00:00
broader: Anställning

Löner och förmåner
type: Concept
definition: Den ersättning en anställd får efter utfört arbete.
in scheme: mediatopic
created: 2009-10-22T02:00:00+00:00
modified: 2021-02-18T12:00:00+00:00
broader: Anställning
narrower: Anställningsförmåner
narrower: Socialförsäkring
narrower: Vinstdelning
broad match: http://cv.iptc.org/newscodes/subjectcode/09011001

Egenföretagande
type: Concept
definition: När en person arbetar men gör det i form av ett eget företag som sedan har kontrakt med något beställande företag eller personer.
in scheme: mediatopic
created: 2019-04-06T12:00:00+00:00
modified: 2021-07-12T12:00:00+00:00
broader: Anställning

Föräldraledighet
type: Concept
definition: Rätt till ledighet för att föda barn eller ta hand om ett litet barn.
in scheme: mediatopic
created: 2019-10-07T12:00:00+00:00
modified: 2021-07-12T12:00:00+00:00
broader: Anställning

Ideellt arbete
type: Concept
definition: Jobb som utförs frivilligt och utan betalning för att hjälpa andra personer eller organisationer.
in scheme: mediatopic
created: 2019-10-07T12:00:00+00:00
modified: 2021-07-12T12:00:00+00:00
broader: Anställning

Kompetensutveckling
type: Concept
definition: Studier och kurser för yrkesutövare och befattningshavare i syfte att ge kunskaper och färdigheter utöver vad en tidigare, grundläggande utbildning givit.
in scheme: mediatopic
created: 2009-10-22T02:00:00+00:00
retired: 2019-10-07T12:00:00+00:00
modified: 2021-05-05T12:00:00+00:00
broader: Yrkesträning

Omskolning
type: Concept
definition: Utbildning från ett yrkesområde till ett annat, företrädesvis för vuxna.
in scheme: mediatopic
created: 2009-10-22T02:00:00+00:00
retired: 2019-10-07T12:00:00+00:00
modified: 2021-02-18T12:00:00+00:00
broader: Yrkesträning

Anställningsförmåner
type: Concept
definition: Arbetsgivaren köper varor eller tjänster, ger ränteförmånliga lån eller hyr tillgångar åt sina anställda för de anställdas privata användning.
in scheme: mediatopic
created: 2009-10-22T02:00:00+00:00
retired: 2019-10-07T12:00:00+00:00
modified: 2021-02-18T12:00:00+00:00
broader: Löner och förmåner

Socialförsäkring
type: Concept
definition: Trygghetsförsäkring som omfattar alla medborgare t ex folkpension, allmän sjukförsäkring, yrkesskadeförsäkring och arbetslöshetsförsäkring.
in scheme: mediatopic
created: 2009-10-22T02:00:00+00:00
modified: 2021-02-18T12:00:00+00:00
broader: Löner och förmåner

Vinstdelning
type: Concept
definition: System där anställda får del av företagets vinster. Vid sidan av vanlig lön.
in scheme: mediatopic
created: 2023-10-02T12:00:00+00:00
modified: 2023-10-02T12:00:00+00:00
broader: Löner och förmåner

Arbetsmiljöfrågor
type: Concept
definition: Regler och processer för att garantera arbetstagarnas hälsa.
in scheme: mediatopic
created: 2009-10-22T02:00:00+00:00
modified: 2021-02-18T12:00:00+00:00
broader: Arbetsrätt

Gig-ekonomi
type: Concept
definition: En arbetsmarknad där enskilda personer jobbar på korta uppdrag istället för att vara fast anställda.
in scheme: mediatopic
created: 2019-10-07T12:00:00+00:00
modified: 2021-07-12T12:00:00+00:00
broader: Arbetsmarknad

Kollektivavtal
type: Concept
definition: Överenskommelse mellan facklig organisation och arbetsgivare om anställningsvillkor.
in scheme: mediatopic
created: 2009-10-22T02:00:00+00:00
modified: 2021-02-18T12:00:00+00:00
broader: Anställningsförhållanden
narrower: Friskvårdsavtal
narrower: Löneavtal
narrower: Arbetstidsavtal

Arbetskonflikt
type: Concept
definition: Akut motsättning mellan arbetstagare och arbetsgivare som tar sig uttryck i eller leder till stridsåtgärder, vanligtvis strejk eller lockout.
in scheme: mediatopic
created: 2009-10-22T02:00:00+00:00
modified: 2021-02-18T12:00:00+00:00
broader: Anställningsförhållanden
narrower: Strejk

Friskvårdsavtal
type: Concept
definition: Avtal om åtgärder för att förebygga sjukdomar.
in scheme: mediatopic
created: 2009-10-22T02:00:00+00:00
retired: 2019-10-07T12:00:00+00:00
modified: 2021-05-05T12:00:00+00:00
broader: Kollektivavtal

Löneavtal
type: Concept
definition: Avtal om ersättning för utfört arbete.
in scheme: mediatopic
created: 2009-10-22T02:00:00+00:00
retired: 2019-10-07T12:00:00+00:00
modified: 2021-05-05T12:00:00+00:00
broader: Kollektivavtal

Arbetstidsavtal
type: Concept
definition: Avtal om arbetstid, t ex längd, förläggning eller avbrott i arbetet för vila.
in scheme: mediatopic
created: 2009-10-22T02:00:00+00:00
retired: 2019-10-07T12:00:00+00:00
modified: 2021-02-18T12:00:00+00:00
broader: Kollektivavtal

Strejk
type: Concept
definition: Organiserad nedläggelse av arbete i syfte att utöva påtryckningar på arbetsgivaren under längre eller kortare tid.
in scheme: mediatopic
created: 2009-10-22T02:00:00+00:00
modified: 2021-02-18T12:00:00+00:00
broader: Arbetskonflikt

Pensions
type: Concept
definition: Regelbundet utbetalat belopp till person som har lämnat förvärvslivet av ålders- eller hälsoskäl.
in scheme: mediatopic
created: 2009-10-22T02:00:00+00:00
modified: 2021-02-18T12:00:00+00:00
broader: Pensionstiden
broad match: http://cv.iptc.org/newscodes/subjectcode/09006000

Uppsägningar
type: Concept
definition: Ensidig förklaring av part i anställnings- eller kollektivavtal att avtalet ska upphöra på grund av förändrade ekonomiska förutsättningar.
in scheme: mediatopic
created: 2009-10-22T02:00:00+00:00
retired: 2019-10-07T12:00:00+00:00
modified: 2021-02-18T12:00:00+00:00
broader: Arbetslöshet

Arbetslöshetsersättning
type: Concept
definition: Statsunderstödd försäkring som ger ersättning vid oförvållad arbetslöshet.
in scheme: mediatopic
created: 2009-10-22T02:00:00+00:00
modified: 2021-02-18T12:00:00+00:00
broader: Arbetslöshet
broad match: http://cv.iptc.org/newscodes/subjectcode/09009000

Klubbar och föreningar
type: Concept
definition: Organisationer med medlemmar som delar ett intresse.
in scheme: mediatopic
created: 2009-10-22T02:00:00+00:00
modified: 2021-02-18T12:00:00+00:00
broader: Fritid

Spel
type: Concept
definition: Benämning på tidsfördriv, vanligen i tävlingsform, för en eller flera personer, utövade efter vissa regler och vanligen med någon sorts hjälpmedel eller rekvisita.
in scheme: mediatopic
created: 2009-10-22T02:00:00+00:00
modified: 2021-02-18T12:00:00+00:00
broader: Fritid
narrower: Brädspel
narrower: Kortspel
narrower: Barnspel
narrower: Tärningsspel
narrower: Utomhusspel
narrower: Kryss och pyssel
narrower: Brickspel
narrower: Datorspel

Spel och lotteri
type: Concept
definition: Spel där deltagarnas vinstmöjligheter helt eller delvis är beroende av slumpen.
in scheme: mediatopic
created: 2009-10-22T02:00:00+00:00
modified: 2021-02-18T12:00:00+00:00
broader: Fritid

Hobby
type: Concept
definition: Aktiv verksamhet som man regelbundet och av renodlat intresse ägnar sig åt på fritiden, ofta med inslag av skapande.
in scheme: mediatopic
created: 2009-10-22T02:00:00+00:00
modified: 2021-02-18T12:00:00+00:00
broader: Fritid
narrower: Bilar
narrower: Cyklar
narrower: Mat och dryck
narrower: Motorcyklar
narrower: Samlande

Semester
type: Concept
definition: Arbetstagares årliga, av arbetsgivaren betalda, ledighet för rekreation.
in scheme: mediatopic
created: 2009-10-22T02:00:00+00:00
modified: 2021-02-18T12:00:00+00:00
broader: Fritid
narrower: Helgdagar
narrower: Halloween
broad match: http://cv.iptc.org/newscodes/subjectcode/10005000

Nöjeslokal
type: Concept
definition: En plats dit folk går för att bli underhållna eller roade.
in scheme: mediatopic
created: 2009-10-22T02:00:00+00:00
modified: 2021-05-05T12:00:00+00:00
broader: Fritid
narrower: Nöjesfält
narrower: Bar
narrower: Kafé
narrower: Nattklubb
narrower: Restaurang
narrower: Sportanläggningar
narrower: Djurpark
narrower: http://cv.iptc.org/newscodes/mediatopic/20001392
broad match: http://cv.iptc.org/newscodes/subjectcode/10000000

Fritidsaktiviteter
type: Concept
definition: Aktiviteter som görs på ledig tid för nöjes skull eller som avslappning.
in scheme: mediatopic
created: 2009-10-22T02:00:00+00:00
modified: 2021-02-18T12:00:00+00:00
broader: Fritid
narrower: Fiske
narrower: Jakt
narrower: Dyksport
narrower: Klättring och vandring
narrower: Ridning
broad match: http://cv.iptc.org/newscodes/subjectcode/10000000

Resor
type: Concept
definition: Resor för nöjes skull, turistresor.
in scheme: mediatopic
created: 2009-10-22T02:00:00+00:00
modified: 2021-02-18T12:00:00+00:00
broader: Fritid
narrower: Turism
broad match: http://cv.iptc.org/newscodes/subjectcode/10000000

Brädspel
type: Concept
definition: Ett tärningsspel med brickor som ska flyttas runt ett bräde.
in scheme: mediatopic
created: 2009-10-22T02:00:00+00:00
modified: 2021-02-18T12:00:00+00:00
broader: Spel
broad match: http://cv.iptc.org/newscodes/subjectcode/10001000

Kortspel
type: Concept
definition: Spel i vilket man använder kort.
in scheme: mediatopic
created: 2009-10-22T02:00:00+00:00
modified: 2021-02-18T12:00:00+00:00
broader: Spel
broad match: http://cv.iptc.org/newscodes/subjectcode/10001000

Barnspel
type: Concept
definition: Spel som har utformats för, och oftast spelas av, barn.
in scheme: mediatopic
created: 2009-10-22T02:00:00+00:00
modified: 2021-04-09T12:00:00+00:00
broader: Spel
broad match: http://cv.iptc.org/newscodes/subjectcode/10001000

Tärningsspel
type: Concept
definition: Spel i vilket deltagarna tilldelas poäng i enlighet med utfallet av tärningskast.
in scheme: mediatopic
created: 2009-10-22T02:00:00+00:00
modified: 2021-02-18T12:00:00+00:00
broader: Spel
broad match: http://cv.iptc.org/newscodes/subjectcode/10001000

Utomhusspel
type: Concept
definition: Spel som utövas utomhus.
in scheme: mediatopic
created: 2009-10-22T02:00:00+00:00
modified: 2021-02-18T12:00:00+00:00
broader: Spel
broad match: http://cv.iptc.org/newscodes/subjectcode/10001000

Kryss och pyssel
type: Concept
definition: Korsord och andra logiska gåtor.
in scheme: mediatopic
created: 2009-10-22T02:00:00+00:00
modified: 2021-02-18T12:00:00+00:00
broader: Spel
broad match: http://cv.iptc.org/newscodes/subjectcode/10001000

Brickspel
type: Concept
definition: Spel som spelas med brickor, t ex domino.
in scheme: mediatopic
created: 2009-10-22T02:00:00+00:00
modified: 2021-02-18T12:00:00+00:00
broader: Spel
broad match: http://cv.iptc.org/newscodes/subjectcode/10001000

Datorspel
type: Concept
definition: Benämning på videospel, ett datorspel avsett att kopplas till en tv-apparat, som på sin bildskärm visar spelförloppet.
in scheme: mediatopic
created: 2009-10-22T02:00:00+00:00
modified: 2021-02-18T12:00:00+00:00
broader: Spel
broad match: http://cv.iptc.org/newscodes/subjectcode/10001000

Bilar
type: Concept
definition: Intresse för nya och gamla bilar.
in scheme: mediatopic
created: 2009-10-22T02:00:00+00:00
modified: 2021-02-18T12:00:00+00:00
broader: Hobby
broad match: http://cv.iptc.org/newscodes/subjectcode/10000000

Cyklar
type: Concept
definition: Intresse för nya och gamla cyklar.
in scheme: mediatopic
created: 2009-10-22T02:00:00+00:00
modified: 2021-02-18T12:00:00+00:00
broader: Hobby
broad match: http://cv.iptc.org/newscodes/subjectcode/10000000

Mat och dryck
type: Concept
definition: Intresse för mat och dryck, matlagning och dryckesframställning.
in scheme: mediatopic
created: 2009-10-22T02:00:00+00:00
modified: 2021-02-18T12:00:00+00:00
broader: Hobby
narrower: Matlagning och bakning
narrower: Öl, vin och sprit
broad match: http://cv.iptc.org/newscodes/subjectcode/10000000

Motorcyklar
type: Concept
definition: Intresse för nya och gamla motorfordon med två eller tre hjul.
in scheme: mediatopic
created: 2009-10-22T02:00:00+00:00
modified: 2021-05-05T12:00:00+00:00
broader: Hobby
broad match: http://cv.iptc.org/newscodes/subjectcode/10000000

Samlande
type: Concept
definition: Hobby där man leta, skaffar, ordnar och kanske visar en stor mängd föremål av en viss sort.
in scheme: mediatopic
created: 2019-07-30T12:00:00+00:00
modified: 2021-07-12T12:00:00+00:00
broader: Hobby

Helgdagar
type: Concept
definition: Allmänt arbetsfri dag.
in scheme: mediatopic
created: 2009-10-22T02:00:00+00:00
modified: 2021-02-18T12:00:00+00:00
broader: Semester
narrower: Midsommar
narrower: Nationaldag
narrower: Nyår

Halloween
type: Concept
definition: Firas i en del länder den 31 oktober och innehåller ofta kostymer, bus-eller-godis, pumpadekorationer och festligheter.
in scheme: mediatopic
created: 2019-09-05T12:00:00+00:00
modified: 2021-07-12T12:00:00+00:00
broader: Semester

Midsommar
type: Concept
definition: Tradition att fira sommarsolståndet.
in scheme: mediatopic
created: 2019-09-05T12:00:00+00:00
modified: 2021-07-12T12:00:00+00:00
broader: Helgdagar

Nationaldag
type: Concept
definition: En dag för att fira en viss nation.
in scheme: mediatopic
created: 2019-09-05T12:00:00+00:00
modified: 2021-07-12T12:00:00+00:00
broader: Helgdagar

Nyår
type: Concept
definition: Högtid för att fira ut det gamla året och välkomna det nya.
in scheme: mediatopic
created: 2019-09-05T12:00:00+00:00
modified: 2021-07-12T12:00:00+00:00
broader: Helgdagar

Nöjesfält
type: Concept
definition: Stationär eller ambulerande nöjespark med bland annat karuseller och andra åkattraktioner.
in scheme: mediatopic
created: 2009-10-22T02:00:00+00:00
modified: 2021-02-18T12:00:00+00:00
broader: Nöjeslokal
broad match: http://cv.iptc.org/newscodes/subjectcode/10000000

Bar
type: Concept
definition: Lokal för öl-, vin- och spritservering vid disk ofta i anslutning till restaurang.
in scheme: mediatopic
created: 2009-10-22T02:00:00+00:00
modified: 2021-02-18T12:00:00+00:00
broader: Nöjeslokal
broad match: http://cv.iptc.org/newscodes/subjectcode/10000000

Kafé
type: Concept
definition: Lokal där det framför allt serveras kaffe, te och läskedrycker samt bakverk och smörgåsar.
in scheme: mediatopic
created: 2009-10-22T02:00:00+00:00
modified: 2021-02-18T12:00:00+00:00
broader: Nöjeslokal
broad match: http://cv.iptc.org/newscodes/subjectcode/10000000

Nattklubb
type: Concept
definition: Lokal med musik och dans, ibland med artistuppträdanden, som har öppet på natten efter vanliga restaurangers stängningstid.
in scheme: mediatopic
created: 2009-10-22T02:00:00+00:00
modified: 2021-02-18T12:00:00+00:00
broader: Nöjeslokal

Restaurang
type: Concept
definition: Offentlig lokal för servering av måltid mot betalning.
in scheme: mediatopic
created: 2009-10-22T02:00:00+00:00
modified: 2021-02-18T12:00:00+00:00
broader: Nöjeslokal
broad match: http://cv.iptc.org/newscodes/subjectcode/10000000

Sportanläggningar
type: Concept
definition: Byggnader där sportevenemang äger rum.
in scheme: mediatopic
created: 2009-10-22T02:00:00+00:00
retired: 2021-02-18T12:00:00+00:00
modified: 2021-02-18T12:00:00+00:00
broader: Nöjeslokal
broad match: http://cv.iptc.org/newscodes/subjectcode/10000000

Djurpark
type: Concept
definition: En anläggning där människor kan se vilda och/eller tama djur i fångenskap.
in scheme: mediatopic
created: 2021-02-18T12:00:00+00:00
modified: 2021-07-12T12:00:00+00:00
broader: Nöjeslokal

http://cv.iptc.org/newscodes/mediatopic/20001392
type: Concept
in scheme: mediatopic
created: 2025-06-30T12:00:00+00:00
modified: 2025-06-30T12:00:00+00:00
broader: Nöjeslokal

Fiske
type: Concept
definition: En fritidsaktivitet där man med hjälp av beten, vapen och fällor försöker fånga vattenlevande djur.
in scheme: mediatopic
created: 2009-10-22T02:00:00+00:00
modified: 2021-02-18T12:00:00+00:00
broader: Fritidsaktiviteter

Jakt
type: Concept
definition: Försök till fångande eller dödande av vilt genom uppspårning, förföljande eller dylikt.
in scheme: mediatopic
created: 2009-10-22T02:00:00+00:00
modified: 2021-02-18T12:00:00+00:00
broader: Fritidsaktiviteter

Dyksport
type: Concept
definition: Samlingsbegrepp för olika grenar med dykning under vatten.
in scheme: mediatopic
created: 2009-10-22T02:00:00+00:00
modified: 2021-02-18T12:00:00+00:00
broader: Fritidsaktiviteter

Klättring och vandring
type: Concept
definition: Sportsliga aktiviteter i bergen.
in scheme: mediatopic
created: 2012-10-04T12:00:00+00:00
modified: 2023-10-02T12:00:00+00:00
broader: Fritidsaktiviteter

Ridning
type: Concept
definition: Fritidsaktivitet där personen sitter på en häst. Inomhus eller utomhus.
in scheme: mediatopic
created: 2019-06-26T12:00:00+00:00
modified: 2021-07-12T12:00:00+00:00
broader: Fritidsaktiviteter

Turism
type: Concept
definition: Människors aktiviteter när de reser till och vistas på platser utanför den vanliga omgivningen, ibland som en del av en grupp.
in scheme: mediatopic
created: 2009-10-22T02:00:00+00:00
retired: 2019-07-22T12:00:00+00:00
modified: 2021-02-18T12:00:00+00:00
broader: Resor

Ekologisk mat
type: Concept
definition: Mat som är framodlad utan konstgödsel eller kemiska föreningar.
in scheme: mediatopic
created: 2009-10-22T02:00:00+00:00
modified: 2021-02-18T12:00:00+00:00
broader: Livsstil

Hem och trädgård
type: Concept
definition: Intresse för hus och lägenheter, deras möblering, inredning med mera.
in scheme: mediatopic
created: 2009-10-22T02:00:00+00:00
modified: 2021-02-18T12:00:00+00:00
broader: Livsstil
narrower: Gör det själv
narrower: Inredningsdesign
narrower: Trädgårdsdesign
broad match: http://cv.iptc.org/newscodes/subjectcode/10000000

Trender
type: Concept
definition: Intresse för utvecklingen av stil, mode och design.
in scheme: mediatopic
created: 2009-10-22T02:00:00+00:00
modified: 2021-02-18T12:00:00+00:00
broader: Livsstil
narrower: Kroppsdekoration
broad match: http://cv.iptc.org/newscodes/subjectcode/10000000

Fester
type: Concept
definition: Sammankomst med riklig förtäring av god mat och dryck, för deltagarnas nöje, ibland med dans.
in scheme: mediatopic
created: 2012-10-04T12:00:00+00:00
modified: 2021-07-12T12:00:00+00:00
broader: Livsstil

http://cv.iptc.org/newscodes/mediatopic/20001391
type: Concept
in scheme: mediatopic
created: 2025-06-30T12:00:00+00:00
modified: 2025-06-30T12:00:00+00:00
broader: Livsstil

Matlagning och bakning
type: Concept
definition: Intresse i metoder och recept för att laga mat och baka.
in scheme: mediatopic
created: 2019-07-30T12:00:00+00:00
modified: 2021-07-12T12:00:00+00:00
broader: Mat och dryck

Öl, vin och sprit
type: Concept
definition: Intresse i produktion, avsmakning och samlande av olika alkoholhaltiga drycker.
in scheme: mediatopic
created: 2019-07-30T12:00:00+00:00
modified: 2021-07-12T12:00:00+00:00
broader: Mat och dryck

Gör det själv
type: Concept
definition: Intresse i att renovera och bygga om ens eget hem.
in scheme: mediatopic
created: 2019-07-30T12:00:00+00:00
modified: 2021-07-12T12:00:00+00:00
broader: Hem och trädgård

Inredningsdesign
type: Concept
definition: Intresse i att dekorera ens eget hem.
in scheme: mediatopic
created: 2019-07-30T12:00:00+00:00
modified: 2021-07-12T12:00:00+00:00
broader: Hem och trädgård

Trädgårdsdesign
type: Concept
definition: Intresse i att designa, anlägga och sköta sin egen trädgård.
in scheme: mediatopic
created: 2019-07-30T12:00:00+00:00
modified: 2021-07-12T12:00:00+00:00
broader: Hem och trädgård

Kroppsdekoration
type: Concept
definition: Intresse i att smycka den egna kroppen, exempelvis med taturering eller piercing.
in scheme: mediatopic
created: 2019-07-30T12:00:00+00:00
modified: 2021-07-12T12:00:00+00:00
broader: Trender
narrower: Tatuering
narrower: Piercing

Medborgarinitiativ
type: Concept
definition: Politiska förslag från icke-statliga organisationer eller privatpersoner för korrigerande åtgärder eller på förändringar av lagar och regler.
in scheme: mediatopic
created: 2009-10-22T02:00:00+00:00
modified: 2021-05-12T12:00:00+00:00
broader: Val

Valsystem
type: Concept
definition: Övergripande utformning av ett lands representationssystem på nationell och subnationell nivå.
in scheme: mediatopic
created: 2009-10-22T02:00:00+00:00
modified: 2024-09-26T12:00:00+00:00
broader: Val
broad match: http://cv.iptc.org/newscodes/subjectcode/11000000

Mellanstatliga val
type: Concept
definition: Att välja representanter till ett mellanstatligt styre, t ex Europaparlamentet.
in scheme: mediatopic
created: 2009-10-22T02:00:00+00:00
modified: 2021-07-12T12:00:00+00:00
broader: Val
broad match: http://cv.iptc.org/newscodes/subjectcode/11000000

Lokalval
type: Concept
definition: Att välja representanter till ett lokalt styre, t ex en kommun.
in scheme: mediatopic
created: 2009-10-22T02:00:00+00:00
modified: 2021-07-12T12:00:00+00:00
broader: Val

Nationella val
type: Concept
definition: Att välja representanter till ett nationellt styre, t ex riksdagen.
in scheme: mediatopic
created: 2009-10-22T02:00:00+00:00
modified: 2021-07-12T12:00:00+00:00
broader: Val

Politiska kampanjer
type: Concept
definition: Intensiv verksamhet under viss tid i avsikt att få någon vald.
in scheme: mediatopic
created: 2009-10-22T02:00:00+00:00
retired: 2024-09-26T12:00:00+00:00
modified: 2024-09-26T12:00:00+00:00
broader: Val

Kampanjbidrag
type: Concept
definition: Pengar som används för att hjälpa personer att bli valda.
in scheme: mediatopic
created: 2009-10-22T02:00:00+00:00
modified: 2021-02-18T12:00:00+00:00
broader: Val

Politiska kandidater
type: Concept
definition: Personer som ställer upp i ett val.
in scheme: mediatopic
created: 2009-10-22T02:00:00+00:00
modified: 2021-02-18T12:00:00+00:00
broader: Val

Primärval
type: Concept
definition: Förberedande val för att välja kandidater att representera ett politiskt parti i ett lokalt, regionalt eller nationellt val
in scheme: mediatopic
created: 2009-10-22T02:00:00+00:00
modified: 2021-07-12T12:00:00+00:00
broader: Val

Folkomröstning
type: Concept
definition: Omröstning i en viss fråga, där alla röstberättigade kan delta.
in scheme: mediatopic
created: 2009-10-22T02:00:00+00:00
modified: 2024-09-26T12:00:00+00:00
broader: Val

Regionala val
type: Concept
definition: Val av politiska företrädare till regional beslutande politisk församling
in scheme: mediatopic
created: 2009-10-22T02:00:00+00:00
modified: 2021-07-12T12:00:00+00:00
broader: Val

Röstning
type: Concept
definition: Att rösta för en kandidat, ett parti eller ett initiativ i ett politiskt val, att företräda medborgarna i en politisk församling
in scheme: mediatopic
created: 2009-10-22T02:00:00+00:00
modified: 2021-02-18T12:00:00+00:00
broader: Val

Kyrkoval
type: Concept
definition: Procedurer för att välja representanter för att styra olika religiösa organisationer.
in scheme: mediatopic
created: 2019-09-05T12:00:00+00:00
retired: 2024-09-26T12:00:00+00:00
modified: 2024-09-26T12:00:00+00:00
broader: Val

Politiska debatter
type: Concept
definition: Organiserade debatter mellan kandidater inför politiska val. Ofta inför publik och ibland tv- och radiosända.
in scheme: mediatopic
created: 2019-09-05T12:00:00+00:00
modified: 2021-07-12T12:00:00+00:00
broader: Val

Fyllnadsval
type: Concept
definition: Särskilda val för att välja någon till en valbar plats som har blivit ledig mellan allmänna val
in scheme: mediatopic
created: 2024-09-26T12:00:00+00:00
modified: 2024-09-26T12:00:00+00:00
broader: Val

Misstroendevotum
type: Concept
definition: Ett verktyg som den folkvalda församlingen har för att avsätta en regering eller ett enskilt statsråd
in scheme: mediatopic
created: 2024-09-26T12:00:00+00:00
modified: 2024-09-26T12:00:00+00:00
broader: Val

Koalition
type: Concept
definition: Samverkan, allians eller förbund mellan nationer eller politiska partier
in scheme: mediatopic
created: 2024-09-26T12:00:00+00:00
modified: 2024-09-26T12:00:00+00:00
broader: Val

Censur och yttrandefrihet
type: Concept
definition: Försök att kontrollera yttrandefriheten samt rätten att utöva densamma
in scheme: mediatopic
created: 2009-10-22T02:00:00+00:00
modified: 2021-02-18T12:00:00+00:00
broader: Grundläggande rättigheter

Religionsfrihet
type: Concept
definition: Rättighet att utöva vilken religion man vill utan världsliga myndigheters inblandning.
in scheme: mediatopic
created: 2009-10-22T02:00:00+00:00
modified: 2021-05-05T12:00:00+00:00
broader: Grundläggande rättigheter

Tryckfrihet
type: Concept
definition: Lagstadgad rätt att fritt uttrycka tankar och åsikter i tryckt form, varvid ofta någon annan person än skribenten hålls ansvarig för publiceringen.
in scheme: mediatopic
created: 2009-10-22T02:00:00+00:00
modified: 2021-02-18T12:00:00+00:00
broader: Grundläggande rättigheter

Mänskliga rättigheter
type: Concept
definition: Rättigheter att åtnjutas av alla människor i hela världen
in scheme: mediatopic
created: 2009-10-22T02:00:00+00:00
modified: 2021-02-18T12:00:00+00:00
broader: Grundläggande rättigheter

Personlig integritet
type: Concept
definition: Rätten för en individ eller grupp att hålla information om sig själv privat
in scheme: mediatopic
created: 2020-08-05T12:00:00+00:00
modified: 2021-07-12T12:00:00+00:00
broader: Grundläggande rättigheter

Jämställdhet
type: Concept
definition: Frågor om jämställdhet mellan olika grupper, vanligast den mellan män och kvinnor med målsättningen att kvinnor ska ha samma rättigheter och möjligheter som män.
in scheme: mediatopic
created: 2021-05-05T12:00:00+00:00
modified: 2021-12-21T12:00:00+00:00
broader: Grundläggande rättigheter

Offentlig verksamhet
type: Concept
definition: Statlig och kommunal förvaltning.
in scheme: mediatopic
created: 2009-10-22T02:00:00+00:00
retired: 2025-03-31T12:00:00+00:00
modified: 2025-03-31T12:00:00+00:00
broader: Regering och riksdag
narrower: Civilsamhälleligt arbete

Offentliganställd
type: Concept
definition: Den som är anställd i offentlig skattefinansierad verksamhet på alla nivåer.
in scheme: mediatopic
created: 2009-10-22T02:00:00+00:00
modified: 2025-03-31T12:00:00+00:00
broader: Regering och riksdag

Förtroendevald
type: Concept
definition: Den som genom val erhållit ett uppdrag och på väljarnas uppdrag sköta ämbetet i enlighet med sin övertygelse.
in scheme: mediatopic
created: 2009-10-22T02:00:00+00:00
modified: 2025-03-31T12:00:00+00:00
broader: Regering och riksdag

Grundlag
type: Concept
definition: En grundlag, konstitution eller statsförfattning är en samling lagar som utgör de grundläggande formella normerna i en stat.
in scheme: mediatopic
created: 2009-10-22T02:00:00+00:00
modified: 2025-03-31T12:00:00+00:00
broader: Regering och riksdag

Nationell säkerhet
type: Concept
definition: En nations försvar mot inre och yttre fiender.
in scheme: mediatopic
created: 2009-10-22T02:00:00+00:00
modified: 2025-03-31T12:00:00+00:00
broader: Regering och riksdag
narrower: Väpnade styrkor
narrower: Försvarsmateriel
narrower: Militär utrustning
narrower: Säkerhetsåtgärder
narrower: Spioneri och underrättelseverksamhet

Verkställande statsmakt
type: Concept
definition: Den högsta verkställande makten i en nation
in scheme: mediatopic
created: 2009-10-22T02:00:00+00:00
modified: 2025-03-31T12:00:00+00:00
broader: Regering och riksdag

Statsbudget
type: Concept
definition: En beräkning i förväg av statens inkomster och utgifter under ett år, budgetår.
in scheme: mediatopic
created: 2009-10-22T02:00:00+00:00
modified: 2025-03-31T12:00:00+00:00
broader: Regering och riksdag
narrower: Offentliga finanser
broad match: http://cv.iptc.org/newscodes/subjectcode/11013000

Departement
type: Concept
definition: Statsorgan som under regeringen ansvarar för viss gren av statsstyrelsen genom att bereda, handlägga och verkställa regeringens beslut, men utan befogenhet att ingripa i förvaltningens detaljer.
in scheme: mediatopic
created: 2009-10-22T02:00:00+00:00
retired: 2025-03-31T12:00:00+00:00
modified: 2025-03-31T12:00:00+00:00
broader: Regering och riksdag

Statschef
type: Concept
definition: Den högsta företrädaren för en suverän stat, som en president, monark eller emir.
in scheme: mediatopic
created: 2009-10-22T02:00:00+00:00
modified: 2025-03-31T12:00:00+00:00
broader: Regering och riksdag

Riksrättsförfarande
type: Concept
definition: Processen som ställer regeringsmedlemmar eller liknande personer inför en särskild domstol för ämbetsfel.
in scheme: mediatopic
created: 2009-10-22T02:00:00+00:00
modified: 2021-02-18T12:00:00+00:00
broader: Regering och riksdag

Lokala myndigheter
type: Concept
definition: Verkställande myndigheter på lokal, kommun- region- eller länsnivå.
in scheme: mediatopic
created: 2009-10-22T02:00:00+00:00
modified: 2025-03-31T12:00:00+00:00
broader: Regering och riksdag

Minister eller statsråd
type: Concept
definition: Regeringsmedlem som är chef för ett departement eller ansvarig för ett visst politikområde.
in scheme: mediatopic
created: 2009-10-22T02:00:00+00:00
modified: 2025-03-31T12:00:00+00:00
broader: Regering och riksdag

Regeringen
type: Concept
definition: Högsta styrelsen för ett land.
in scheme: mediatopic
created: 2009-10-22T02:00:00+00:00
modified: 2021-02-18T12:00:00+00:00
broader: Regering och riksdag

Riksdagen
type: Concept
definition: Folkrepresentationen i ett land, namnet på Sveriges folkvalda parlament.
in scheme: mediatopic
created: 2009-10-22T02:00:00+00:00
modified: 2021-03-31T12:00:00+00:00
broader: Regering och riksdag
narrower: Andra kammaren
narrower: Första kammaren

Regional myndighet
type: Concept
definition: Myndigheter som verkar på en nivå mellan den lokala och den nationella.
in scheme: mediatopic
created: 2009-10-22T02:00:00+00:00
modified: 2025-03-31T12:00:00+00:00
broader: Regering och riksdag

Lobbyverksamhet
type: Concept
definition: Bearbetning av beslutsfattare för att åstadkomma beslut i en viss riktning.
in scheme: mediatopic
created: 2009-10-22T02:00:00+00:00
modified: 2025-03-31T12:00:00+00:00
broader: Regering och riksdag

Politiska partier och rörelser
type: Concept
definition: Sammanslutning eller grupp av väljare som uppträder i val under särskild beteckning samt mer informella politiska formationer.
in scheme: mediatopic
created: 2009-10-22T02:00:00+00:00
retired: 2025-03-31T12:00:00+00:00
modified: 2025-03-31T12:00:00+00:00
broader: Regering och riksdag

Politisk utveckling
type: Concept
definition: Skapandet och framväxten av politiska system och historien om de personer och nationer som förknippas med dessa.
in scheme: mediatopic
created: 2009-10-22T02:00:00+00:00
retired: 2025-03-31T12:00:00+00:00
modified: 2025-03-31T12:00:00+00:00
broader: Regering och riksdag

Politiska system
type: Concept
definition: Den regeringsform som används, erkänns eller på annat sätt deklareras av ett samhälle eller en stat.
in scheme: mediatopic
created: 2009-10-22T02:00:00+00:00
modified: 2025-03-31T12:00:00+00:00
broader: Regering och riksdag
narrower: Demokrati
narrower: Diktatur
narrower: http://cv.iptc.org/newscodes/mediatopic/20001386
narrower: http://cv.iptc.org/newscodes/mediatopic/20001387
narrower: http://cv.iptc.org/newscodes/mediatopic/20001388
narrower: http://cv.iptc.org/newscodes/mediatopic/20001389

Tillsynsmyndigheter
type: Concept
definition: Myndigheter som är ansvariga för att reglera och övervaka en bransch.
in scheme: mediatopic
created: 2016-04-04T12:00:00+00:00
retired: 2025-03-31T12:00:00+00:00
modified: 2025-03-31T12:00:00+00:00
broader: Regering och riksdag

Partikongress
type: Concept
definition: Kongress, stämma eller möte inom ett politiskt parti för att nominera kandidater, välja ledare och ta beslut om partiprogram.
in scheme: mediatopic
created: 2019-09-05T12:00:00+00:00
modified: 2025-03-31T12:00:00+00:00
broader: Regering och riksdag

Politisk kommitté
type: Concept
definition: En grupp som satts samman med representanter för olika partier för att fokusera på en viss fråga.
in scheme: mediatopic
created: 2019-09-05T12:00:00+00:00
modified: 2025-03-31T12:00:00+00:00
broader: Regering och riksdag

Regeringschef
type: Concept
definition: Högsta ansvarig i den verkställande makten i ett land, delstat eller liknande.
in scheme: mediatopic
created: 2019-09-05T12:00:00+00:00
modified: 2025-03-31T12:00:00+00:00
broader: Regering och riksdag

Offentlig utredning
type: Concept
definition: Utredning av händelser och aktioner utförda av styrande myndigheter.
in scheme: mediatopic
created: 2019-09-05T12:00:00+00:00
modified: 2021-07-12T12:00:00+00:00
broader: Regering och riksdag

Politiskt ledarskap
type: Concept
definition: Företrädare för ett politiskt parti samt diskussioner om förändringar i ledarskapet inom ett politiskt parti.
in scheme: mediatopic
created: 2021-02-18T12:00:00+00:00
modified: 2025-03-31T12:00:00+00:00
broader: Regering och riksdag

http://cv.iptc.org/newscodes/mediatopic/20001384
type: Concept
in scheme: mediatopic
created: 2025-03-31T12:00:00+00:00
modified: 2025-03-31T12:00:00+00:00
broader: Regering och riksdag

http://cv.iptc.org/newscodes/mediatopic/20001385
type: Concept
in scheme: mediatopic
created: 2025-03-31T12:00:00+00:00
modified: 2025-03-31T12:00:00+00:00
broader: Regering och riksdag

Civilsamhälleligt arbete
type: Concept
definition: Arbete som utförs av den del av samhället där människor hjälper varandra utan inblandning av det offentliga, staten eller kommuner.
in scheme: mediatopic
created: 2012-10-04T12:00:00+00:00
retired: 2025-03-31T12:00:00+00:00
modified: 2021-07-12T12:00:00+00:00
broader: Offentlig verksamhet

Väpnade styrkor
type: Concept
definition: De personer och medel som används för att försvara en nation eller föra krig.
in scheme: mediatopic
created: 2009-10-22T02:00:00+00:00
modified: 2025-03-31T12:00:00+00:00
broader: Nationell säkerhet
narrower: Militära veteraner
narrower: Värnplikt

Försvarsmateriel
type: Concept
definition: Utrustning som används av medlemmar i ett lands väpnade styrkor.
in scheme: mediatopic
created: 2009-10-22T02:00:00+00:00
retired: 2025-03-31T12:00:00+00:00
modified: 2025-03-31T12:00:00+00:00
broader: Nationell säkerhet

Militär utrustning
type: Concept
definition: De vapen och den utrustning som används av en försvarsmakt samt i vapenhandel.
in scheme: mediatopic
created: 2009-10-22T02:00:00+00:00
modified: 2025-03-31T12:00:00+00:00
broader: Nationell säkerhet

Säkerhetsåtgärder
type: Concept
definition: Medel för att skydda en stat, en byggnad eller en person från skada.
in scheme: mediatopic
created: 2009-10-22T02:00:00+00:00
retired: 2025-03-31T12:00:00+00:00
modified: 2025-03-31T12:00:00+00:00
broader: Nationell säkerhet
narrower: Nationell säkerhet

Spioneri och underrättelseverksamhet
type: Concept
definition: Hemligt, ibland olagligt, insamlande av information.
in scheme: mediatopic
created: 2009-10-22T02:00:00+00:00
modified: 2025-03-31T12:00:00+00:00
broader: Nationell säkerhet

Militära veteraner
type: Concept
definition: Saker som rör före detta anställda hos försvarsmakten.
in scheme: mediatopic
created: 2009-10-22T02:00:00+00:00
modified: 2021-05-05T12:00:00+00:00
broader: Väpnade styrkor

Värnplikt
type: Concept
definition: Medborgares skyldighet att utbilda sig för att delta i sitt lands militära försvar.
in scheme: mediatopic
created: 2012-10-04T12:00:00+00:00
modified: 2021-07-12T12:00:00+00:00
broader: Väpnade styrkor

Nationell säkerhet
type: Concept
definition: Arbetet med att säkra en stat och dess gränser samt att upprätthålla medborgarnas välmående.
in scheme: mediatopic
created: 2009-10-22T02:00:00+00:00
retired: 2025-03-31T12:00:00+00:00
modified: 2025-03-31T12:00:00+00:00
broader: Säkerhetsåtgärder

Offentliga finanser
type: Concept
definition: De pengar som används av staten för att betala statliga program och åtgärder samt statsskulden.
in scheme: mediatopic
created: 2009-10-22T02:00:00+00:00
retired: 2025-03-31T12:00:00+00:00
modified: 2025-03-31T12:00:00+00:00
broader: Statsbudget

Andra kammaren
type: Concept
definition: Den direktvalda delen av ett parlament.
in scheme: mediatopic
created: 2009-10-22T02:00:00+00:00
modified: 2021-02-18T12:00:00+00:00
broader: Riksdagen

Första kammaren
type: Concept
definition: Den indirekt valda delen av ett parlament.
in scheme: mediatopic
created: 2009-10-22T02:00:00+00:00
modified: 2021-02-18T12:00:00+00:00
broader: Riksdagen

Medborgerlig säkerhet
type: Concept
definition: Politik som syftar till att skydda medborgarna.
in scheme: mediatopic
created: 2009-10-22T02:00:00+00:00
retired: 2025-03-31T12:00:00+00:00
modified: 2025-03-31T12:00:00+00:00
broader: Regeringsförklaring

Skattepolitik
type: Concept
definition: Politiska program för beskattning av medborgare, företag och organisationer.
in scheme: mediatopic
created: 2009-10-22T02:00:00+00:00
modified: 2025-03-31T12:00:00+00:00
broader: Regeringsförklaring
broad match: http://cv.iptc.org/newscodes/subjectcode/11013000

Inrikespolitik
type: Concept
definition: Politisk verksamhet som gäller de inre förhållandena i det egna landet.
in scheme: mediatopic
created: 2009-10-22T02:00:00+00:00
retired: 2025-03-31T12:00:00+00:00
modified: 2025-03-31T12:00:00+00:00
broader: Regeringsförklaring

Datasäkerhetspolitik
type: Concept
definition: Politiska program för att skydda personuppgifter i skriftlig, muntlig eller elektronisk form och föreskrifter kring vilka personuppgifter som kan samlas in av företag, myndigheter eller andra.
in scheme: mediatopic
created: 2009-10-22T02:00:00+00:00
modified: 2025-03-31T12:00:00+00:00
broader: Regeringsförklaring

Bostadspolitik och stadsplanering
type: Concept
definition: Systematiskt planerande av städer och förorter och byggandet av hus i dessa.
in scheme: mediatopic
created: 2009-10-22T02:00:00+00:00
modified: 2025-03-31T12:00:00+00:00
broader: Regeringsförklaring

Minoritetspolitik
type: Concept
definition: Politiska program som påverkar statens förhållande till nationella minoriteter och urfolk såsom språk, rätt till landområden och ekonomiskt stöd.
in scheme: mediatopic
created: 2009-10-22T02:00:00+00:00
modified: 2025-03-31T12:00:00+00:00
broader: Regeringsförklaring

Social välfärd
type: Concept
definition: Politiska program för ekonomiskt stöd till medborgarna genom som arbetslöshetsersättningar, pensioner och ekonomiskt stöd till de fattiga.
in scheme: mediatopic
created: 2009-10-22T02:00:00+00:00
modified: 2025-03-31T12:00:00+00:00
broader: Regeringsförklaring

Persondatalagstiftning
type: Concept
definition: Bestämmelser som reglerar skydd för behandling av personuppgifter samt det fria flödet av sådana uppgifter.
in scheme: mediatopic
created: 2009-10-22T02:00:00+00:00
retired: 2025-03-31T12:00:00+00:00
modified: 2025-03-31T12:00:00+00:00
broader: Regeringsförklaring

Vapenlagstiftning
type: Concept
definition: Bestämmelser som reglerar innehav av vapen och ammunition.
in scheme: mediatopic
created: 2009-10-22T02:00:00+00:00
modified: 2025-03-31T12:00:00+00:00
broader: Regeringsförklaring

Byggprojektering
type: Concept
definition: Tekniska samråd om föreslagna byggnadskonstruktioner.
in scheme: mediatopic
created: 2009-10-22T02:00:00+00:00
retired: 2025-03-31T12:00:00+00:00
modified: 2025-03-31T12:00:00+00:00
broader: Regeringsförklaring

Migrationspolitik
type: Concept
definition: Politiska program för in- och utvandring i ett land såsom begränsningar, deportation och integrationsprogram.
in scheme: mediatopic
created: 2009-10-22T02:00:00+00:00
modified: 2025-03-31T12:00:00+00:00
broader: Regeringsförklaring

Kärnkraftspolitik
type: Concept
definition: Politik som styr användandet av kärnkraft som energikälla eller som del av en vapenarsenal.
in scheme: mediatopic
created: 2009-10-22T02:00:00+00:00
modified: 2025-03-31T12:00:00+00:00
broader: Regeringsförklaring

Branschlagstiftning
type: Concept
definition: Regler och organisationer, både nationella och internationella, som används för att lösa intressekonflikter och skapa bra regleringar inom en del av näringslivet.
in scheme: mediatopic
created: 2009-10-22T02:00:00+00:00
modified: 2025-03-31T12:00:00+00:00
broader: Regeringsförklaring
narrower: Livsmedelspolitik

Kulturpolitik
type: Concept
definition: Politiska program för kulturlivet.
in scheme: mediatopic
created: 2012-10-04T12:00:00+00:00
modified: 2025-03-31T12:00:00+00:00
broader: Regeringsförklaring

Integrationspolitik
type: Concept
definition: Politik som syftar till lika rättigheter och möjligheter för alla, oavsett etnisk eller kulturell bakgrund, en samhällsgemenskap med samhällets mångfald som grund samt en samhällsutveckling präglad av ömsesidig respekt och tolerans.
in scheme: mediatopic
created: 2012-10-04T12:00:00+00:00
retired: 2025-03-31T12:00:00+00:00
modified: 2025-03-31T12:00:00+00:00
broader: Regeringsförklaring

Idrottspolitik
type: Concept
definition: Politik som påverkar idrotten.
in scheme: mediatopic
created: 2012-10-04T12:00:00+00:00
modified: 2025-03-31T12:00:00+00:00
broader: Regeringsförklaring

Regionalpolitik
type: Concept
definition: Politik som syftar till att trygga likvärdiga förutsättningar för samhällsutvecklingen i olika delar av ett land.
in scheme: mediatopic
created: 2016-04-04T12:00:00+00:00
modified: 2025-03-31T12:00:00+00:00
broader: Regeringsförklaring

Infrastrukturpolitik
type: Concept
definition: Politiska program för att utveckla och underhålla kommunikationer, transporter, distributionsnät och annan infrastruktur i samhället.
in scheme: mediatopic
created: 2019-09-05T12:00:00+00:00
modified: 2025-03-31T12:00:00+00:00
broader: Regeringsförklaring

Lokalpolitik
type: Concept
definition: Politiska frågor som handlar om ett visst område, ofta en del av ett land.
in scheme: mediatopic
created: 2019-09-05T12:00:00+00:00
modified: 2021-07-12T12:00:00+00:00
broader: Regeringsförklaring

Utbildningspolitik
type: Concept
definition: Politiska program för utbildning och som berör skolväsendet.
in scheme: mediatopic
created: 2021-12-17T12:00:00+00:00
modified: 2025-03-31T12:00:00+00:00
broader: Regeringsförklaring

http://cv.iptc.org/newscodes/mediatopic/20001383
type: Concept
in scheme: mediatopic
created: 2025-03-31T12:00:00+00:00
modified: 2025-03-31T12:00:00+00:00
broader: Regeringsförklaring

Livsmedelspolitik
type: Concept
definition: Politiska program för produktion och försäljning av mat och dryck, inklusive livsmedelssäkerhet.
in scheme: mediatopic
created: 2009-10-22T02:00:00+00:00
modified: 2025-03-31T12:00:00+00:00
broader: Branschlagstiftning
broad match: http://cv.iptc.org/newscodes/subjectcode/11022000

Diplomati
type: Concept
definition: Förhandlingar mellan representanter för nationer eller grupper av nationer och de diplomater som är involverade i samtalen.
in scheme: mediatopic
created: 2009-10-22T02:00:00+00:00
modified: 2025-03-31T12:00:00+00:00
broader: Internationella relationer
narrower: Toppmöte
narrower: Traktat och fördrag

Ekonomiska sanktioner
type: Concept
definition: Ekonomiska åtgärder som vidtagits av ett land eller en mellanstatlig organisation mot en annan stat eller organisation, såsom handelsrestriktioner och embargon.
in scheme: mediatopic
created: 2009-10-22T02:00:00+00:00
modified: 2025-03-31T12:00:00+00:00
broader: Internationella relationer

Utlandsbistånd
type: Concept
definition: Stöd från en nation till en annan för ändamål som katastrof, allmän ekonomisk utveckling eller diplomati.
in scheme: mediatopic
created: 2009-10-22T02:00:00+00:00
modified: 2025-03-31T12:00:00+00:00
broader: Internationella relationer

Internationella organisation
type: Concept
definition: Organisation med medlemmar och verksamhet som går över internationella gränser.
in scheme: mediatopic
created: 2009-10-22T02:00:00+00:00
modified: 2025-03-31T12:00:00+00:00
broader: Internationella relationer

Flykting
type: Concept
definition: Den som söker skydd eller asyl i ett annat land på grund av viss rädsla för förföljelse, konflikt eller naturkatastrof i sitt eget hemland.
in scheme: mediatopic
created: 2009-10-22T02:00:00+00:00
modified: 2025-03-31T12:00:00+00:00
broader: Internationella relationer

Gränskonflikt
type: Concept
definition: Konflikt mellan länder kring territoriella gränser.
in scheme: mediatopic
created: 2021-02-18T12:00:00+00:00
modified: 2025-03-31T12:00:00+00:00
broader: Internationella relationer

Toppmöte
type: Concept
definition: Möte på hög nivå mellan länder med syfte att diskutera gemensamma mål eller att genom diplomatiska förhandlingar lindra internationella spänningar.
in scheme: mediatopic
created: 2009-10-22T02:00:00+00:00
modified: 2025-03-31T12:00:00+00:00
broader: Diplomati

Traktat och fördrag
type: Concept
definition: Ett skriftligt avtal mellan internationella enheter som är bindande enligt internationell rätt.
in scheme: mediatopic
created: 2009-10-22T02:00:00+00:00
modified: 2025-03-31T12:00:00+00:00
broader: Diplomati

Demokrati
type: Concept
definition: Politiskt system i vilket regeringsmakten i princip företräder folkviljan, sådan den framkommer genom fria, allmänna och hemliga val.
in scheme: mediatopic
created: 2009-10-22T02:00:00+00:00
modified: 2025-03-31T12:00:00+00:00
broader: Politiska system

Diktatur
type: Concept
definition: Politiskt system där all statsmakt är koncentrerad till en viss person eller en viss grupp, utan folkviljans samtycke genom fria, allmänna och hemliga val.
in scheme: mediatopic
created: 2009-10-22T02:00:00+00:00
modified: 2025-03-31T12:00:00+00:00
broader: Politiska system
broad match: http://cv.iptc.org/newscodes/subjectcode/11006000

http://cv.iptc.org/newscodes/mediatopic/20001386
type: Concept
in scheme: mediatopic
created: 2025-03-31T12:00:00+00:00
modified: 2025-03-31T12:00:00+00:00
broader: Politiska system

http://cv.iptc.org/newscodes/mediatopic/20001387
type: Concept
in scheme: mediatopic
created: 2025-03-31T12:00:00+00:00
modified: 2025-03-31T12:00:00+00:00
broader: Politiska system

http://cv.iptc.org/newscodes/mediatopic/20001388
type: Concept
in scheme: mediatopic
created: 2025-03-31T12:00:00+00:00
modified: 2025-03-31T12:00:00+00:00
broader: Politiska system

http://cv.iptc.org/newscodes/mediatopic/20001389
type: Concept
in scheme: mediatopic
created: 2025-03-31T12:00:00+00:00
modified: 2025-03-31T12:00:00+00:00
broader: Politiska system

Buddhism
type: Concept
definition: En österländsk religion, grundan i Indien cirka 600 före kristus som lägger stor vikt vid frigörelsen från det världsliga. I enlighet med Buddhas lärdomar.
in scheme: mediatopic
created: 2009-10-22T02:00:00+00:00
modified: 2021-12-21T12:00:00+00:00
broader: Religiös tro

Kristendom
type: Concept
definition: Den religion som utgår från Jesus Kristus och hans predikningar. Samt bibeln.
in scheme: mediatopic
created: 2009-10-22T02:00:00+00:00
modified: 2021-12-21T12:00:00+00:00
broader: Religiös tro
narrower: Ekumenik
narrower: Mormonism
narrower: Gammalkatolicism
narrower: Ortodox kristendom
narrower: Protestantism
narrower: Katolicism

Konfucianism
type: Concept
definition: En kinesisk vishets- och samhällslära, baserad på idéer från tänkaren Konfucius.
in scheme: mediatopic
created: 2009-10-22T02:00:00+00:00
modified: 2021-12-17T12:00:00+00:00
broader: Religiös tro

Kulter och sekter
type: Concept
definition: Religiösa grupperingar som karaktäriseras av en diffus organisation och av ett i förhållande till andra religiösa grupper avvikande trossystem. Följer ofta en karismatisk ledare.
in scheme: mediatopic
created: 2009-10-22T02:00:00+00:00
modified: 2021-12-21T12:00:00+00:00
broader: Religiös tro

Frimureri
type: Concept
definition: Den verksamhet som bedrivs av hemliga ordenssällskap som vill verka för medlemmarnas personliga utveckling till bättre människor.
in scheme: mediatopic
created: 2009-10-22T02:00:00+00:00
retired: 2021-12-17T12:00:00+00:00
modified: 2021-12-17T12:00:00+00:00
broader: Religiös tro

Hinduism
type: Concept
definition: En indisk religion och samhällssystem med kaster med tro på själavandring och det gudomligas närvaro i varje del av världsalltet.
in scheme: mediatopic
created: 2009-10-22T02:00:00+00:00
modified: 2021-12-21T12:00:00+00:00
broader: Religiös tro

Islam
type: Concept
definition: Monoteistisk religion som räknar Muhammed som profet och Koranen som helig skrift.
in scheme: mediatopic
created: 2009-10-22T02:00:00+00:00
modified: 2021-12-17T12:00:00+00:00
broader: Religiös tro
narrower: Shiaislamism
narrower: Sunni-islamism

Jainism
type: Concept
definition: En indisk religion som är besläktad med buddhismen. Uppkom cirka 700-500 före kristus.
in scheme: mediatopic
created: 2009-10-22T02:00:00+00:00
modified: 2021-12-21T12:00:00+00:00
broader: Religiös tro

Judendom
type: Concept
definition: Monoteistisk religion där Toran är lagen, den motsvarar moseböckerna i gamla testamentet.
in scheme: mediatopic
created: 2009-10-22T02:00:00+00:00
modified: 2021-12-21T12:00:00+00:00
broader: Religiös tro
narrower: Chassidism

Naturreligioner
type: Concept
definition: Dyrkan av naturliga element, såsom eld, vatten, träd och berg, vilket anses förkroppsliga gudomlighet.
in scheme: mediatopic
created: 2009-10-22T02:00:00+00:00
modified: 2021-12-21T12:00:00+00:00
broader: Religiös tro

Zoroastrism
type: Concept
definition: En persisk religion, numera mest utövad i Indien, som följer den iranske profeten Zarathustra.
in scheme: mediatopic
created: 2009-10-22T02:00:00+00:00
modified: 2021-12-17T12:00:00+00:00
broader: Religiös tro

Scientologi
type: Concept
definition: En psykologiserande, delvis kommersiell frälsningsrörelse, kännetecknad av idéer om självförverkligande genom personlig andlig kraft. Startad av L Ron Hubbard.
in scheme: mediatopic
created: 2009-10-22T02:00:00+00:00
modified: 2021-12-21T12:00:00+00:00
broader: Religiös tro

Shintoism
type: Concept
definition: En japansk religion i vilken naturgudar och döda hjältars andar dyrkas genom offergåvor, danser med mera.
in scheme: mediatopic
created: 2009-10-22T02:00:00+00:00
modified: 2021-12-17T12:00:00+00:00
broader: Religiös tro

Sikhism
type: Concept
definition: En religion i framför allt Punjab i norra Indien, som har utvecklats ur hinduismen, men lär att det bara finns en gud.
in scheme: mediatopic
created: 2009-10-22T02:00:00+00:00
modified: 2021-12-17T12:00:00+00:00
broader: Religiös tro

Daoism
type: Concept
definition: En kinesisk vishetslära som förespråkar ett enkelt liv i samklang med naturen.
in scheme: mediatopic
created: 2009-10-22T02:00:00+00:00
modified: 2021-12-17T12:00:00+00:00
broader: Religiös tro

Moonrörelsen
type: Concept
definition: Tidigare namn på Familjefederationen för världsfred och enighet, en nyreligiös rörelse grundad i Busan i Sydkorea av Sun Myung Moon.
in scheme: mediatopic
created: 2009-10-22T02:00:00+00:00
modified: 2021-12-17T12:00:00+00:00
broader: Religiös tro

Atheism och Agnosticism
type: Concept
definition: Ateister anser att det inte finns någon gud, agnostiker att man inte kan veta.
in scheme: mediatopic
created: 2021-12-17T12:00:00+00:00
modified: 2021-12-21T12:00:00+00:00
broader: Religiös tro

Ekumenik
type: Concept
definition: Samlande benämning på kyrkliga enhetssträvanden.
in scheme: mediatopic
created: 2009-10-22T02:00:00+00:00
retired: 2021-12-17T12:00:00+00:00
modified: 2021-02-18T12:00:00+00:00
broader: Kristendom

Mormonism
type: Concept
definition: En kristen rörelse som tror på Mormons bok och Joseph Smiths uppenbarelser. Grundad i staten New York kring 1820.
in scheme: mediatopic
created: 2009-10-22T02:00:00+00:00
modified: 2021-12-21T12:00:00+00:00
broader: Kristendom

Gammalkatolicism
type: Concept
definition: En sammanslutning av självständiga och episkopalt styrda kyrkor, som står utanför gemenskapen med påven och den romersk-katolska kyrkan.
in scheme: mediatopic
created: 2009-10-22T02:00:00+00:00
retired: 2021-12-17T12:00:00+00:00
modified: 2021-02-18T12:00:00+00:00
broader: Kristendom

Ortodox kristendom
type: Concept
definition: En kristen riktning, särskilt verksam i Östeuropa, som karaktäriseras av dess fortsatta tro på kyrkofäderna och dessas liturgi.
in scheme: mediatopic
created: 2009-10-22T02:00:00+00:00
modified: 2021-12-17T12:00:00+00:00
broader: Kristendom

Protestantism
type: Concept
definition: En kristen riktning som uppkom genom utbrytning ur den katolska kyrkan och omfattar lutheraner och reformerta.
in scheme: mediatopic
created: 2009-10-22T02:00:00+00:00
modified: 2021-12-17T12:00:00+00:00
broader: Kristendom
narrower: Anglikanism
narrower: Baptism
narrower: Lutheranism
narrower: Mennoniter
narrower: Metodism
narrower: Reformert kristendom

Katolicism
type: Concept
definition: Den form av kristendom som utövas inom den stora, internationella kyrka som har sitt centrum i Rom och som är dominerande bland annat i Sydeuropa och Latinamerika.
in scheme: mediatopic
created: 2009-10-22T02:00:00+00:00
retired: 2021-12-17T12:00:00+00:00
modified: 2021-02-18T12:00:00+00:00
broader: Kristendom
narrower: Konkordat

Katolicism
type: Concept
definition: Katolicism, katolsk, är en kristen term avseende katolska kyrkans religion. Största kristna trosinriktningen. Leds av påven.
in scheme: mediatopic
created: 2021-12-17T12:00:00+00:00
modified: 2021-12-21T12:00:00+00:00
broader: Kristendom

Anglikanism
type: Concept
definition: Den läromässiga, liturgiska och etiska hållning som utmärker den engelska statskyrkan.
in scheme: mediatopic
created: 2009-10-22T02:00:00+00:00
retired: 2021-12-17T12:00:00+00:00
modified: 2021-02-18T12:00:00+00:00
broader: Protestantism

Baptism
type: Concept
definition: En kristen riktning som hävdar att dopet måste föregås av ett medvetet val och som därför förkastar barndopet.
in scheme: mediatopic
created: 2009-10-22T02:00:00+00:00
retired: 2021-12-17T12:00:00+00:00
modified: 2021-07-12T12:00:00+00:00
broader: Protestantism

Lutheranism
type: Concept
definition: Sammanfattande benämning på de kyrkor och det fromhetsliv som utgår från Martin Luther och den lutherska reformationen.
in scheme: mediatopic
created: 2009-10-22T02:00:00+00:00
retired: 2021-12-17T12:00:00+00:00
modified: 2021-02-18T12:00:00+00:00
broader: Protestantism

Mennoniter
type: Concept
definition: Medlemmar av en protestantisk, pacifistisk församlingsrörelse, som eftersträvar en kyrka fri från statlig inblandning och att församlingarna ska bestå av troendedöpta.
in scheme: mediatopic
created: 2009-10-22T02:00:00+00:00
retired: 2021-12-17T12:00:00+00:00
modified: 2021-12-17T12:00:00+00:00
broader: Protestantism

Metodism
type: Concept
definition: En frikyrklig rörelse med inriktning på noga planerat fromhetsliv.
in scheme: mediatopic
created: 2009-10-22T02:00:00+00:00
retired: 2021-12-17T12:00:00+00:00
modified: 2021-02-18T12:00:00+00:00
broader: Protestantism

Reformert kristendom
type: Concept
definition: En utveckling inom kristendomen för att förändra kyrkan, ett exempel är kalvinism. Den betonar att Gud har all makt och att Bibeln ska styra både kyrkan och samhället.
in scheme: mediatopic
created: 2009-10-22T02:00:00+00:00
retired: 2021-12-17T12:00:00+00:00
modified: 2021-02-18T12:00:00+00:00
broader: Protestantism

Konkordat
type: Concept
definition: Avtal mellan en stat och den romersk-katolska kyrkan.
in scheme: mediatopic
created: 2009-10-22T02:00:00+00:00
retired: 2021-12-17T12:00:00+00:00
modified: 2021-12-17T12:00:00+00:00
broader: Katolicism

Shiaislamism
type: Concept
definition: Näst största trosinriktningen inom Islam där anhängarna tror att ättlingar till Muhammed är bäst lämpade att leda religionen.
in scheme: mediatopic
created: 2021-12-17T12:00:00+00:00
modified: 2021-12-21T12:00:00+00:00
broader: Islam

Sunni-islamism
type: Concept
definition: Största trosinriktningen inom Islam där den bäst lämpade ska leda religionen.
in scheme: mediatopic
created: 2021-12-17T12:00:00+00:00
modified: 2021-12-21T12:00:00+00:00
broader: Islam

Chassidism
type: Concept
definition: Strikt judisk trosinriktning som uppstod i Ukraina under 1700-talet.
in scheme: mediatopic
created: 2021-12-17T12:00:00+00:00
modified: 2021-12-21T12:00:00+00:00
broader: Judendom

Jul
type: Concept
definition: En kristen högtid till minne av Kristi födelse kring den 25 december. Men firas också av icke troende.
in scheme: mediatopic
created: 2009-10-22T02:00:00+00:00
modified: 2021-12-21T12:00:00+00:00
broader: Religiösa högtider

Påsk
type: Concept
definition: En kristen vårhögtid till minne av Jesu korsfästelse och uppståndelse.
in scheme: mediatopic
created: 2009-10-22T02:00:00+00:00
modified: 2021-12-17T12:00:00+00:00
broader: Religiösa högtider

Pingst
type: Concept
definition: En kristen högtid som firas (i maj eller juni) till minne av det tillfälle då apostlarna enligt Bibeln uppfylldes av helig ande.
in scheme: mediatopic
created: 2009-10-22T02:00:00+00:00
modified: 2021-12-17T12:00:00+00:00
broader: Religiösa högtider

Ramadan
type: Concept
definition: Den muslimska fastemånaden.
in scheme: mediatopic
created: 2009-10-22T02:00:00+00:00
modified: 2021-12-17T12:00:00+00:00
broader: Religiösa högtider

Jom kippur
type: Concept
definition: Försoningsdag inom den judiska religionen firad på hösten.
in scheme: mediatopic
created: 2009-10-22T02:00:00+00:00
modified: 2021-12-17T12:00:00+00:00
broader: Religiösa högtider

Alla helgons dag
type: Concept
definition: Kristen högtid då de avlidna hyllas.
in scheme: mediatopic
created: 2019-09-05T12:00:00+00:00
modified: 2021-12-17T12:00:00+00:00
broader: Religiösa högtider

Sista april
type: Concept
definition: Kristen högtid som firas till minne av Saint Walpurga, en nunna från 700-talet.
in scheme: mediatopic
created: 2019-09-05T12:00:00+00:00
modified: 2021-07-12T12:00:00+00:00
broader: Religiösa högtider

Eid al-Adha
type: Concept
definition: Eid al-adha, också kallad för offerhögtiden, stora eid eller bakr-eid, är en av de två islamska högtidsfester som firas av muslimer över hela världen och som baserar sig på Koranen. Muslimer och druser firar den till minne av Ibrahims villighet att offra sin son enligt Guds order.
in scheme: mediatopic
created: 2021-12-17T12:00:00+00:00
modified: 2021-12-21T12:00:00+00:00
broader: Religiösa högtider

Chanukka
type: Concept
definition: Judisk högtid som kallas ljuset fest eller invigningsfesten.
in scheme: mediatopic
created: 2021-12-17T12:00:00+00:00
modified: 2021-12-21T12:00:00+00:00
broader: Religiösa högtider

Dop
type: Concept
definition: Kristen ritual där en person får heligt vatten på sig, eller nedsänks i heligt vatten. Ska representera upptagandet i den kyrliga gemenskapen. Ofta i samband med namngivning.
in scheme: mediatopic
created: 2019-09-05T12:00:00+00:00
modified: 2021-12-17T12:00:00+00:00
broader: Religiösa ritualer

Bar mitzvah
type: Concept
definition: Termerna bar mitzvah och bat mitzvah hänvisar till ritualen för att bli myndig inom judendomen. Bar används för en pojke, medan bat används för en flicka.
in scheme: mediatopic
created: 2021-12-17T12:00:00+00:00
modified: 2021-12-21T12:00:00+00:00
broader: Religiösa ritualer

Helgonförklaring
type: Concept
definition: Kanonisering, kanonisation, helgonförklaring, är den akt där kyrklig myndighet förklarar någon vara ett helgon. Ordet kanonisering härleds ur grekiskans kanonizein *reglera*, *bemyndiga*.
in scheme: mediatopic
created: 2021-12-17T12:00:00+00:00
modified: 2021-12-21T12:00:00+00:00
broader: Religiösa ritualer

Kyrkor
type: Concept
definition: En byggnad som används för olika riter inom kristendomen.
in scheme: mediatopic
created: 2009-10-22T02:00:00+00:00
modified: 2021-12-17T12:00:00+00:00
broader: Religiösa byggnader
broad match: http://cv.iptc.org/newscodes/subjectcode/12000000

Moskeér
type: Concept
definition: En byggnad som används för olika riter inom islam.
in scheme: mediatopic
created: 2009-10-22T02:00:00+00:00
modified: 2021-12-17T12:00:00+00:00
broader: Religiösa byggnader
broad match: http://cv.iptc.org/newscodes/subjectcode/12000000

Synagogor
type: Concept
definition: En byggnad som används för olika riter inom judendomen.
in scheme: mediatopic
created: 2009-10-22T02:00:00+00:00
modified: 2021-12-17T12:00:00+00:00
broader: Religiösa byggnader
broad match: http://cv.iptc.org/newscodes/subjectcode/12000000

Tempel
type: Concept
definition: En byggnad som används för olika religiösa riter.
in scheme: mediatopic
created: 2009-10-22T02:00:00+00:00
retired: 2021-12-17T12:00:00+00:00
modified: 2021-02-18T12:00:00+00:00
broader: Religiösa byggnader
broad match: http://cv.iptc.org/newscodes/subjectcode/12000000

Påven
type: Concept
definition: Den högsta ledaren för romersk-katolska kyrkan.
in scheme: mediatopic
created: 2009-10-22T02:00:00+00:00
modified: 2021-12-17T12:00:00+00:00
broader: Religiösa ledare

Bibeln
type: Concept
definition: Kristendomens heliga bok, inkluderande Gamla och Nya testamentet.
in scheme: mediatopic
created: 2009-10-22T02:00:00+00:00
modified: 2021-12-17T12:00:00+00:00
broader: Religiösa texter

Koranen
type: Concept
definition: Islams heliga bok.
in scheme: mediatopic
created: 2009-10-22T02:00:00+00:00
modified: 2021-02-18T12:00:00+00:00
broader: Religiösa texter

Toran
type: Concept
definition: Judendomens heliga skrifter.
in scheme: mediatopic
created: 2009-10-22T02:00:00+00:00
modified: 2021-12-17T12:00:00+00:00
broader: Religiösa texter

Bioteknologi
type: Concept
definition: Det vetenskapliga manipulerandet av levande organismer och biologiska processer i vetenskapligt, medicinskt eller jordbrukande syfte.
in scheme: mediatopic
created: 2009-10-22T02:00:00+00:00
modified: 2021-02-18T12:00:00+00:00
broader: Biomedicin

Maskinteknik
type: Concept
definition: Vetenskapen om och användandet av design, konstruktion och hantering av mekaniska system.
in scheme: mediatopic
created: 2009-10-22T02:00:00+00:00
modified: 2021-02-18T12:00:00+00:00
broader: Teknik och ingenjörskonst
broad match: http://cv.iptc.org/newscodes/subjectcode/13002000

Astronomi
type: Concept
definition: Kunskapen om och det vetenskapliga studiet av himlakroppar och andra naturföreteelser utanför planeten jorden.
in scheme: mediatopic
created: 2009-10-22T02:00:00+00:00
modified: 2021-02-18T12:00:00+00:00
broader: Naturvetenskap

Biologi
type: Concept
definition: Vetenskapen om de levande organismerna.
in scheme: mediatopic
created: 2009-10-22T02:00:00+00:00
modified: 2021-02-18T12:00:00+00:00
broader: Naturvetenskap
narrower: Botanik
narrower: Genetik
narrower: Paleontologi
narrower: Fysiologi
narrower: Zoologi

Kemi
type: Concept
definition: Vetenskapen om materiella ämnens sammansättning, egenskaper och omvandlingar.
in scheme: mediatopic
created: 2009-10-22T02:00:00+00:00
modified: 2021-02-18T12:00:00+00:00
broader: Naturvetenskap

Kosmologi
type: Concept
definition: Vetenskapen om universums storskaliga byggnad, uppkomst och utveckling.
in scheme: mediatopic
created: 2009-10-22T02:00:00+00:00
modified: 2021-02-18T12:00:00+00:00
broader: Naturvetenskap

Geologi
type: Concept
definition: Vetenskapen om jorden.
in scheme: mediatopic
created: 2009-10-22T02:00:00+00:00
modified: 2021-02-18T12:00:00+00:00
broader: Naturvetenskap

Hortikultur
type: Concept
definition: Vetenskapen om och konsten att odla, inklusive landskapsdesign.
in scheme: mediatopic
created: 2009-10-22T02:00:00+00:00
modified: 2021-02-18T12:00:00+00:00
broader: Naturvetenskap
broad match: http://cv.iptc.org/newscodes/subjectcode/13004000

Oceanografi
type: Concept
definition: Vetenskapen om havet.
in scheme: mediatopic
created: 2009-10-22T02:00:00+00:00
modified: 2021-02-18T12:00:00+00:00
broader: Naturvetenskap

Meteorologi
type: Concept
definition: Vetenskapen om atmosfärens fysik och kemi.
in scheme: mediatopic
created: 2009-10-22T02:00:00+00:00
modified: 2021-02-18T12:00:00+00:00
broader: Naturvetenskap

Fysik
type: Concept
definition: Vetenskapen om materiens struktur på grundläggande nivå och dess uppträdande under skilda betingelser.
in scheme: mediatopic
created: 2009-10-22T02:00:00+00:00
modified: 2021-02-18T12:00:00+00:00
broader: Naturvetenskap
narrower: Elektromagnetism
narrower: Kärnfysik

Botanik
type: Concept
definition: Vetenskapen om växterna.
in scheme: mediatopic
created: 2009-10-22T02:00:00+00:00
modified: 2021-02-18T12:00:00+00:00
broader: Biologi

Genetik
type: Concept
definition: Vetenskap som omfattar studiet av arvsmassans uppbyggnad och funktion, uppkomst av förändringar av arvsanlagen samt biologisk variation.
in scheme: mediatopic
created: 2009-10-22T02:00:00+00:00
modified: 2021-02-18T12:00:00+00:00
broader: Biologi

Paleontologi
type: Concept
definition: Vetenskapen om utdöda livsformer och om hur de utvecklades och levde.
in scheme: mediatopic
created: 2009-10-22T02:00:00+00:00
modified: 2021-02-18T12:00:00+00:00
broader: Biologi

Fysiologi
type: Concept
definition: Vetenskapen om hur levande organismer, deras organ och vävnader fungerar.
in scheme: mediatopic
created: 2009-10-22T02:00:00+00:00
modified: 2021-02-18T12:00:00+00:00
broader: Biologi

Zoologi
type: Concept
definition: Vetenskapen om djuren.
in scheme: mediatopic
created: 2009-10-22T02:00:00+00:00
modified: 2021-02-18T12:00:00+00:00
broader: Biologi

Elektromagnetism
type: Concept
definition: Vetenskapen om sambandet mellan elektricitet och magnetism.
in scheme: mediatopic
created: 2009-10-22T02:00:00+00:00
modified: 2021-07-12T12:00:00+00:00
broader: Fysik
broad match: http://cv.iptc.org/newscodes/subjectcode/13001001

Kärnfysik
type: Concept
definition: Vetenskapen om atomkärnornas struktur och kärnmateriens egenskaper.
in scheme: mediatopic
created: 2009-10-22T02:00:00+00:00
modified: 2021-02-18T12:00:00+00:00
broader: Fysik
narrower: Partikelfysik
broad match: http://cv.iptc.org/newscodes/subjectcode/13001001

Partikelfysik
type: Concept
definition: Vetenskapen om materiens minsta beståndsdelar, dessas struktur och inbördes växelverkan.
in scheme: mediatopic
created: 2009-10-22T02:00:00+00:00
modified: 2021-02-18T12:00:00+00:00
broader: Kärnfysik

Upptäckter och uppfinningar
type: Concept
definition: Utvecklandet eller skapandet av nya vetenskapliga eller tekniska produkter eller processer, t ex AI-applikationer, robotarmar och nanokameror.
in scheme: mediatopic
created: 2009-10-22T02:00:00+00:00
modified: 2021-02-18T12:00:00+00:00
broader: Vetenskaplig forskning
broad match: http://cv.iptc.org/newscodes/subjectcode/13006000

Medicinsk forskning
type: Concept
definition: Forskning inom hälsa och medicin, såsom genetiska studier, undersökning av sjukdomar eller farmaceutiska tester.
in scheme: mediatopic
created: 2009-10-22T02:00:00+00:00
modified: 2021-02-18T12:00:00+00:00
broader: Vetenskaplig forskning

Vetenskaplig expedition
type: Concept
definition: Land-, havs- eller rymdfärder med syfte att samla in ny information.
in scheme: mediatopic
created: 2009-10-22T02:00:00+00:00
modified: 2021-02-18T12:00:00+00:00
broader: Vetenskaplig forskning
narrower: Rymdforskning

Vetenskaplig avhandling
type: Concept
definition: Ett vetenskapligt arbete, oftast i bokform, som beskriver ett forskningsområde och resultat.
in scheme: mediatopic
created: 2009-10-22T02:00:00+00:00
modified: 2021-02-18T12:00:00+00:00
broader: Vetenskaplig forskning
broad match: http://cv.iptc.org/newscodes/subjectcode/13006000

Rymdforskning
type: Concept
definition: Det vetenskapliga utforskandet av yttre rymden genom bemannade och obemannade rymdfärder.
in scheme: mediatopic
created: 2009-10-22T02:00:00+00:00
modified: 2021-02-18T12:00:00+00:00
broader: Vetenskaplig expedition

Antropologi
type: Concept
definition: Vetenskapen om människosläktets utveckling och fysiska karakteristika samt världens olika kultur- och samhällstyper.
in scheme: mediatopic
created: 2009-10-22T02:00:00+00:00
modified: 2021-02-18T12:00:00+00:00
broader: Samhällsvetenskap

Arkeologi
type: Concept
definition: Vetenskap som med stöd av materiella lämningar studerar äldre tiders mänskliga kultur.
in scheme: mediatopic
created: 2009-10-22T02:00:00+00:00
modified: 2021-02-18T12:00:00+00:00
broader: Samhällsvetenskap

Ekonomivetenskap
type: Concept
definition: Vetenskapen om resursers bildande, organisation och användning.
in scheme: mediatopic
created: 2009-10-22T02:00:00+00:00
modified: 2021-02-18T12:00:00+00:00
broader: Samhällsvetenskap
broad match: http://cv.iptc.org/newscodes/subjectcode/04017000

Geografi
type: Concept
definition: Vetenskapen om natur- och kulturlandskapets bildning, framväxt och förändringar och om samspelet mellan naturgivna och kulturbetingade förhållanden samt om rumsliga samband.
in scheme: mediatopic
created: 2009-10-22T02:00:00+00:00
modified: 2021-02-18T12:00:00+00:00
broader: Samhällsvetenskap

Historia
type: Concept
definition: Vetenskapen om allt som hänt i människosläktets förflutna och utforskning och beskrivning av detta.
in scheme: mediatopic
created: 2009-10-22T02:00:00+00:00
modified: 2021-02-18T12:00:00+00:00
broader: Samhällsvetenskap

Informationsvetenskap
type: Concept
definition: Brett vetenskapligt område knutet till studier av information, samt behandling av sådan i form av data.
in scheme: mediatopic
created: 2009-10-22T02:00:00+00:00
modified: 2021-02-18T12:00:00+00:00
broader: Samhällsvetenskap
broad match: http://cv.iptc.org/newscodes/subjectcode/13003001

Juridik
type: Concept
definition: Vetenskapen om rättsreglerna och deras tillämpning.
in scheme: mediatopic
created: 2009-10-22T02:00:00+00:00
modified: 2023-10-02T12:00:00+00:00
broader: Samhällsvetenskap
broad match: http://cv.iptc.org/newscodes/subjectcode/13003001

Lingvistik
type: Concept
definition: Vetenskapen om språk.
in scheme: mediatopic
created: 2009-10-22T02:00:00+00:00
modified: 2021-02-18T12:00:00+00:00
broader: Samhällsvetenskap
broad match: http://cv.iptc.org/newscodes/subjectcode/13000000

Filosofi
type: Concept
definition: Vetenskapen om de grundläggande villkoren för tillvaron, vetandet och moralen.
in scheme: mediatopic
created: 2009-10-22T02:00:00+00:00
modified: 2021-02-18T12:00:00+00:00
broader: Samhällsvetenskap

Statsvetenskap
type: Concept
definition: En samhällsvetenskaplig disciplin inriktad på studiet av politik.
in scheme: mediatopic
created: 2009-10-22T02:00:00+00:00
modified: 2021-02-18T12:00:00+00:00
broader: Samhällsvetenskap
broad match: http://cv.iptc.org/newscodes/subjectcode/13000000

Psykologi
type: Concept
definition: Vetenskapen om själslivet (människors upplevelser, känslor, beteenden och tankar i allmänhet).
in scheme: mediatopic
created: 2009-10-22T02:00:00+00:00
modified: 2021-02-18T12:00:00+00:00
broader: Samhällsvetenskap

Sociologi
type: Concept
definition: Vetenskapen om sociala beteenden, grupper och relationer.
in scheme: mediatopic
created: 2009-10-22T02:00:00+00:00
modified: 2021-02-18T12:00:00+00:00
broader: Samhällsvetenskap

Flyg- och rymdteknik
type: Concept
definition: Vetenskap, design, utveckling och konstruktion av flygplan, rymdfarkoster och missilsystem.
in scheme: mediatopic
created: 2009-10-22T02:00:00+00:00
modified: 2021-02-18T12:00:00+00:00
broader: Teknik och ingenjörskonst
narrower: Raketteknik
broad match: http://cv.iptc.org/newscodes/subjectcode/04011001

Jordbruksteknik
type: Concept
definition: Vetenskapen om och utvecklingen av tekniker och maskiner som förbättrar jordbrukets hantering och produktivitet.
in scheme: mediatopic
created: 2009-10-22T02:00:00+00:00
modified: 2021-05-05T12:00:00+00:00
broader: Teknik och ingenjörskonst
broad match: http://cv.iptc.org/newscodes/subjectcode/13020000

Väg- och vattenbyggnadsteknik
type: Concept
definition: Vetenskap, design, utveckling och konstruktion av strukturer såsom byggnader, broar, tunnlar, bevattnings- och avloppssystem, vägar och järnvägar.
in scheme: mediatopic
created: 2009-10-22T02:00:00+00:00
modified: 2021-02-18T12:00:00+00:00
broader: Teknik och ingenjörskonst
broad match: http://cv.iptc.org/newscodes/subjectcode/13002000

Elektronik
type: Concept
definition: Vetenskap och teknik rörande ledning av elektricitet i vakuum, gaser och halvledare.
in scheme: mediatopic
created: 2009-10-22T02:00:00+00:00
modified: 2021-02-18T12:00:00+00:00
broader: Teknik och ingenjörskonst

Identifieringsteknik
type: Concept
definition: Vetenskapen, utvecklingen, tillämpningen och de etiska frågorna rörande tekniska metoder för att känna igen produkter, djur eller människor, till exempel ansiktsigenkänning och biometrisk teknik.
in scheme: mediatopic
created: 2009-10-22T02:00:00+00:00
modified: 2021-02-18T12:00:00+00:00
broader: Teknik och ingenjörskonst

IT/datavetenskap
type: Concept
definition: Vetenskap och design rörande datasystem, mjukvara och nätverk.
in scheme: mediatopic
created: 2009-10-22T02:00:00+00:00
modified: 2021-02-18T12:00:00+00:00
broader: Teknik och ingenjörskonst
narrower: Artificiell intelligens

Materialvetenskap
type: Concept
definition: Vetenskapen om grundläggande principer om materialens uppbyggnad.
in scheme: mediatopic
created: 2009-10-22T02:00:00+00:00
modified: 2021-02-18T12:00:00+00:00
broader: Teknik och ingenjörskonst

Mikrovetenskap
type: Concept
definition: Vetenskap och teknik rörande saker byggda i mikroskopisk skala.
in scheme: mediatopic
created: 2009-10-22T02:00:00+00:00
modified: 2021-02-18T12:00:00+00:00
broader: Teknik och ingenjörskonst
narrower: Nanoteknologi

Raketteknik
type: Concept
definition: Vetenskap, design, utveckling och konstruktion rörande raketer.
in scheme: mediatopic
created: 2009-10-22T02:00:00+00:00
modified: 2021-02-18T12:00:00+00:00
broader: Flyg- och rymdteknik

Artificiell intelligens
type: Concept
definition: Förkortas ofta AI. Beskriver dataprogram och robotar som efterliknar människors naturliga intelligens genom att utveckla sig baserat på tidigare försök.
in scheme: mediatopic
created: 2020-08-05T12:00:00+00:00
modified: 2021-07-12T12:00:00+00:00
broader: IT/datavetenskap

Nanoteknologi
type: Concept
definition: Teknik för att tillverka, påverka och hantera material och objekt med minst en dimension i storleksordningen 1–100 nanometer.
in scheme: mediatopic
created: 2009-10-22T02:00:00+00:00
modified: 2021-02-18T12:00:00+00:00
broader: Mikrovetenskap

Socialt nätverkande
type: Concept
definition: Bygget av gemenskaper, bland annat med hjälp av sociala medier.
in scheme: mediatopic
created: 2009-10-22T02:00:00+00:00
modified: 2021-02-18T12:00:00+00:00
broader: Gemenskaper
broad match: http://cv.iptc.org/newscodes/subjectcode/14000000

http://cv.iptc.org/newscodes/mediatopic/20001360
type: Concept
in scheme: mediatopic
created: 2022-09-23T12:00:00+00:00
modified: 2022-09-23T12:00:00+00:00
broader: Gemenskaper

Folk och folkräkning
type: Concept
definition: Antalet människor i en geografisk region och räkningen av dem.
in scheme: mediatopic
created: 2009-10-22T02:00:00+00:00
modified: 2021-05-05T12:00:00+00:00
broader: Demografi

Illegala immigranter
type: Concept
definition: Personers rörelse från ett land till ett annat med olagliga medel.
in scheme: mediatopic
created: 2009-10-22T02:00:00+00:00
modified: 2021-02-18T12:00:00+00:00
broader: Immigration

Åldersdiskriminering
type: Concept
definition: Särbehandling av individer eller grupper på grund av åldern på personerna.
in scheme: mediatopic
created: 2009-10-22T02:00:00+00:00
modified: 2021-02-18T12:00:00+00:00
broader: Diskriminering
broad match: http://cv.iptc.org/newscodes/subjectcode/14025003

Rasism
type: Concept
definition: Särbehandling av individer eller grupper på grund av personernas etnicitet.
in scheme: mediatopic
created: 2009-10-22T02:00:00+00:00
modified: 2021-02-18T12:00:00+00:00
broader: Diskriminering

Religiös diskriminering
type: Concept
definition: Särbehandling av individer eller grupper på grund av personernas religion.
in scheme: mediatopic
created: 2009-10-22T02:00:00+00:00
modified: 2021-02-18T12:00:00+00:00
broader: Diskriminering
broad match: http://cv.iptc.org/newscodes/subjectcode/14025003

Könsdiskriminering
type: Concept
definition: Särbehandling av individer eller grupper på grund av personernas kön.
in scheme: mediatopic
created: 2009-10-22T02:00:00+00:00
modified: 2021-09-30T12:00:00+00:00
broader: Diskriminering
broad match: http://cv.iptc.org/newscodes/subjectcode/14025003

Adoption
type: Concept
definition: Att formellt uppta en person som sitt eget barn.
in scheme: mediatopic
created: 2009-10-22T02:00:00+00:00
modified: 2021-02-18T12:00:00+00:00
broader: Familjefrågor

Uppvaktning
type: Concept
definition: Försök att vinna en partner.
in scheme: mediatopic
created: 2009-10-22T02:00:00+00:00
modified: 2021-07-12T12:00:00+00:00
broader: Familjefrågor

Skilsmässor
type: Concept
definition: Upplösning av ett äktenskap.
in scheme: mediatopic
created: 2009-10-22T02:00:00+00:00
modified: 2022-06-14T12:00:00+00:00
broader: Familjefrågor

Familjeplanering
type: Concept
definition: Ett medvetet försök att påverka familjens storlek.
in scheme: mediatopic
created: 2009-10-22T02:00:00+00:00
modified: 2022-06-14T12:00:00+00:00
broader: Familjefrågor
narrower: Abort
narrower: Preventivmedel

Gifta
type: Concept
definition: En lagstadgad relation mellan två personer. Kan ske genom bröllop, borgerlig vigsel eller motsvarande procedur.
in scheme: mediatopic
created: 2009-10-22T02:00:00+00:00
modified: 2021-03-15T12:00:00+00:00
broader: Familjefrågor

Föräldrar
type: Concept
definition: Personer som är far eller mor till ett visst barn och som har rätt att utöva den rättsliga vårdnaden om detta barn.
in scheme: mediatopic
created: 2009-10-22T02:00:00+00:00
modified: 2021-02-18T12:00:00+00:00
broader: Familjefrågor

Graviditet och förlossning
type: Concept
definition: Sociala och medicinska frågor kopplade till graviditet och förlossningen.
in scheme: mediatopic
created: 2022-06-14T12:00:00+00:00
modified: 2022-06-14T12:00:00+00:00
broader: Familjefrågor

Abort
type: Concept
definition: Förhållandet att en graviditet upphör eller avbryts före den 22:a graviditetsveckans slut och att fostret är dött vid framfödandet.
in scheme: mediatopic
created: 2009-10-22T02:00:00+00:00
modified: 2021-02-18T12:00:00+00:00
broader: Familjeplanering

Preventivmedel
type: Concept
definition: En metod för att förhindra befruktning.
in scheme: mediatopic
created: 2019-09-05T12:00:00+00:00
modified: 2021-07-12T12:00:00+00:00
broader: Familjeplanering

Vuxna
type: Concept
definition: Personer som har uppnått myndighetsåldern, 18 år.
in scheme: mediatopic
created: 2009-10-22T02:00:00+00:00
modified: 2021-02-18T12:00:00+00:00
broader: Mänskligheten

Barn
type: Concept
definition: Personer under skedet mellan födelsen och vuxen ålder.
in scheme: mediatopic
created: 2009-10-22T02:00:00+00:00
modified: 2021-02-18T12:00:00+00:00
broader: Mänskligheten

funktionsvariation
type: Concept
definition: Fysisk eller psykisk begränsning av en persons förmåga att fungera i en viss situation eller i en viss miljö.
in scheme: mediatopic
created: 2009-10-22T02:00:00+00:00
modified: 2024-03-28T12:00:00+00:00
broader: Mänskligheten

HBTQ
type: Concept
definition: De som identifierar sig som homosexuella, bisexuella, transpersoner eller queerpersoner.
in scheme: mediatopic
created: 2009-10-22T02:00:00+00:00
modified: 2021-05-05T12:00:00+00:00
broader: Mänskligheten

Kön
type: Concept
definition: Den sociala klassificeringen av vad som ansetts manligt och kvinnligt.
in scheme: mediatopic
created: 2009-10-22T02:00:00+00:00
modified: 2021-02-18T12:00:00+00:00
broader: Mänskligheten
broad match: http://cv.iptc.org/newscodes/subjectcode/14024000

Spädbarn
type: Concept
definition: Personer upp till cirka ett års ålder, då de börjar gå.
in scheme: mediatopic
created: 2009-10-22T02:00:00+00:00
modified: 2021-02-18T12:00:00+00:00
broader: Mänskligheten

Minoriteter
type: Concept
definition: Människor som utgör en mindre grupp än andra konkurrerande grupper utifrån etnicitet eller nationalitet, deras status, problem och relation till majoriteten.
in scheme: mediatopic
created: 2009-10-22T02:00:00+00:00
modified: 2021-02-18T12:00:00+00:00
broader: Mänskligheten

Kärnkraftsmotståndare
type: Concept
definition: Grupper som vill avveckla kärnkraften, men också personer som har utsatts för radioaktiv strålning och kompensation till dessa.
in scheme: mediatopic
created: 2009-10-22T02:00:00+00:00
retired: 2019-10-07T12:00:00+00:00
modified: 2021-02-18T12:00:00+00:00
broader: Mänskligheten

Pensionärer
type: Concept
definition: Personer som har passerat pensionsåldern.
in scheme: mediatopic
created: 2009-10-22T02:00:00+00:00
modified: 2021-02-18T12:00:00+00:00
broader: Mänskligheten

Tonåringar
type: Concept
definition: Personer i en ålder mellan barn och mogen ålder.
in scheme: mediatopic
created: 2009-10-22T02:00:00+00:00
modified: 2021-02-18T12:00:00+00:00
broader: Mänskligheten

Ursprungsbefolkning
type: Concept
definition: Människogrupp som är ättlingar till den ursprungliga befolkningen i ett område. Numera ofta i minoritet i det området.
in scheme: mediatopic
created: 2019-11-25T12:00:00+00:00
modified: 2021-07-12T12:00:00+00:00
broader: Mänskligheten

Kvinnor
type: Concept
definition: Frågor som gäller personer som identifierar sig som kvinnor ur en demografisk synvinkel samt kvinnliga bedrifter.
in scheme: mediatopic
created: 2021-05-05T12:00:00+00:00
modified: 2021-12-21T12:00:00+00:00
broader: Mänskligheten

Män
type: Concept
definition: Frågor som gäller personer som identifierar sig som män, maskulinitet mm.
in scheme: mediatopic
created: 2021-05-05T12:00:00+00:00
modified: 2021-12-21T12:00:00+00:00
broader: Mänskligheten

Hemlöshet
type: Concept
definition: Avsaknad av ett hem.
in scheme: mediatopic
created: 2009-10-22T02:00:00+00:00
modified: 2021-02-18T12:00:00+00:00
broader: Social situation

Fattigdom
type: Concept
definition: Levnadsstandard som är oacceptabelt låg.
in scheme: mediatopic
created: 2009-10-22T02:00:00+00:00
modified: 2021-02-18T12:00:00+00:00
broader: Social situation

Kränkande beteende
type: Concept
definition: Att behandla en eller flera personer nedsättande genom att angripa den personliga hedern i ord eller genom handling.
in scheme: mediatopic
created: 2009-10-22T02:00:00+00:00
modified: 2021-02-18T12:00:00+00:00
broader: Sociala problem

Beroenden
type: Concept
definition: Vanemässigt och oftast okontrollerbart användande av skadliga substanser såsom alkohol, tobak och droger.
in scheme: mediatopic
created: 2009-10-22T02:00:00+00:00
modified: 2021-02-18T12:00:00+00:00
broader: Sociala problem

Ungdomsbrottslighet
type: Concept
definition: Den brottslighet som främst personer i åldern 15–20 år står för.
in scheme: mediatopic
created: 2009-10-22T02:00:00+00:00
modified: 2021-02-18T12:00:00+00:00
broader: Sociala problem

Prostitution
type: Concept
definition: Utbjudande av sexuella tjänster mot betalning och de som tjänar på det.
in scheme: mediatopic
created: 2009-10-22T02:00:00+00:00
modified: 2021-02-18T12:00:00+00:00
broader: Sociala problem

Slaveri
type: Concept
definition: System med personlig ofrihet och rättslöshet inklusive ofrivilligt obetalt arbete och barnarbete.
in scheme: mediatopic
created: 2009-10-22T02:00:00+00:00
modified: 2021-02-18T12:00:00+00:00
broader: Sociala problem

Sexuellt ofredande
type: Concept
definition: Oönskade sexuella inviter, meddelanden, beröring, blottande osv.
in scheme: mediatopic
created: 2019-04-06T12:00:00+00:00
modified: 2024-07-01T12:00:00+00:00
broader: Sociala problem

Mobbning
type: Concept
definition: Systematiska trakasserier mot en eller flera personer inom en grupp.
in scheme: mediatopic
created: 2019-11-20T12:00:00+00:00
modified: 2021-07-12T12:00:00+00:00
broader: Sociala problem

Korrupta metoder
type: Concept
definition: Olagliga metoder för att nå egen vinning, till exempel att muta eller att utge sig för att vara någon annan.
in scheme: mediatopic
created: 2009-10-22T02:00:00+00:00
retired: 2019-10-07T12:00:00+00:00
modified: 2021-02-18T12:00:00+00:00
broader: Sociala värderingar

Livets slutskede
type: Concept
definition: Saker relaterade till döden och döende.
in scheme: mediatopic
created: 2009-10-22T02:00:00+00:00
modified: 2021-02-18T12:00:00+00:00
broader: Sociala värderingar
narrower: Dödshjälp
narrower: Självmord

Etik
type: Concept
definition: Läran om (god) moral.
in scheme: mediatopic
created: 2009-10-22T02:00:00+00:00
modified: 2021-07-12T12:00:00+00:00
broader: Sociala värderingar

Pornografi
type: Concept
definition: Texter eller bilder som beskriver sex på ett sådant sätt att den som läser eller tittar på bilderna ska bli sexuellt upphetsad.
in scheme: mediatopic
created: 2009-10-22T02:00:00+00:00
modified: 2021-02-18T12:00:00+00:00
broader: Sociala värderingar

Sexuellt beteende
type: Concept
definition: Individers eller grupper sexuella beteende.
in scheme: mediatopic
created: 2009-10-22T02:00:00+00:00
modified: 2021-02-18T12:00:00+00:00
broader: Sociala värderingar
broad match: http://cv.iptc.org/newscodes/subjectcode/12006000

Dödshjälp
type: Concept
definition: Medvetet påskyndande av annan persons död vid hopplös sjukdom.
in scheme: mediatopic
created: 2009-10-22T02:00:00+00:00
modified: 2021-02-18T12:00:00+00:00
broader: Livets slutskede
narrower: Assisterat självmord

Självmord
type: Concept
definition: Avsiktlig självdestruktiv handling som leder till döden.
in scheme: mediatopic
created: 2009-10-22T02:00:00+00:00
modified: 2021-02-18T12:00:00+00:00
broader: Livets slutskede

Assisterat självmord
type: Concept
definition: Avsiktlig självdestruktiv handling som leder till döden, som utförs med hjälp av en annan person.
in scheme: mediatopic
created: 2009-10-22T02:00:00+00:00
modified: 2021-02-18T12:00:00+00:00
broader: Dödshjälp
broad match: http://cv.iptc.org/newscodes/subjectcode/14005000

Välgörenhet
type: Concept
definition: Osjälvisk hjälp till människor som är i nöd eller att hjälpa sämre lottade.
in scheme: mediatopic
created: 2009-10-22T02:00:00+00:00
modified: 2021-05-05T12:00:00+00:00
broader: Socialhjälp

Långvård
type: Concept
definition: Långvarig vård på sjukhus, vanligtvis av gamla eller obotligt sjuka.
in scheme: mediatopic
created: 2009-10-22T02:00:00+00:00
modified: 2021-05-05T12:00:00+00:00
broader: Socialhjälp

Socialtjänst
type: Concept
definition: Social verksamhet i kommunal regi enligt socialtjänstlagen.
in scheme: mediatopic
created: 2009-10-22T02:00:00+00:00
modified: 2021-02-18T12:00:00+00:00
broader: Socialhjälp

Äldrevård
type: Concept
definition: Vård av äldre som inte direkt har med sjukdomar att göra utan mer behov som uppstår när människor blir äldre
in scheme: mediatopic
created: 2019-06-26T12:00:00+00:00
modified: 2021-07-12T12:00:00+00:00
broader: Socialhjälp

Nödboende
type: Concept
definition: Hus som drivs av myndigheter eller organisationer för att erbjuda boende till hemlösa.
in scheme: mediatopic
created: 2020-08-05T12:00:00+00:00
modified: 2021-07-12T12:00:00+00:00
broader: Socialhjälp

Barnomsorg
type: Concept
definition: Förskolor och liknande som tar hand om och utvecklar barnen när föräldrarna arbetar.
in scheme: mediatopic
created: 2021-02-18T12:00:00+00:00
modified: 2021-07-12T12:00:00+00:00
broader: Socialhjälp

Amerikansk fotboll
type: Concept
definition: Matcher mellan elvamannalag på en 120 yards lång bana, där lagen får poäng genom att förflytta den ovala bollen in i motståndarnas målzon.
in scheme: mediatopic
created: 2009-10-22T02:00:00+00:00
modified: 2021-02-18T12:00:00+00:00
broader: Tävlingsidrott

Bågskytte
type: Concept
definition: De tävlande använder pil och båge och försöker träffa måltavlan från olika avstånd.
in scheme: mediatopic
created: 2009-10-22T02:00:00+00:00
modified: 2021-02-18T12:00:00+00:00
broader: Tävlingsidrott
narrower: Armborstskytte
narrower: Långbågeskytte

Friidrott
type: Concept
definition: Samlingsbegrepp för olika tävlingar som inkluderar löpning, hopp och kast.
in scheme: mediatopic
created: 2009-10-22T02:00:00+00:00
modified: 2021-05-05T12:00:00+00:00
broader: Tävlingsidrott
narrower: Terränglöpning
narrower: Tiokamp
narrower: Diskus
narrower: Slägga
narrower: Sjukamp
narrower: Höjdhopp
narrower: Häcklöpning
narrower: Spjutkastning
narrower: Långdistanslöpning
narrower: Längdhopp
narrower: Medeldistanslöpning
narrower: Femkamp
narrower: Stavhopp
narrower: Gång
narrower: Stafett
narrower: Kulstötning
narrower: Sprintdistanser
narrower: Tresteg
narrower: Hinderlöpning

Australisk fotboll
type: Concept
definition: En bollsport med oval boll som kan sägas vara en blandning mellan vanlig fotboll och rugby.
in scheme: mediatopic
created: 2009-10-22T02:00:00+00:00
modified: 2021-02-18T12:00:00+00:00
broader: Tävlingsidrott

Badminton
type: Concept
definition: En idrott som spelas mellan två eller fyra spelare på en avgränsad bana med ett högt nät mellan. Spelarna slår på en fjäderboll och försöker få den att landa på marken i motståndarnas planhalva.
in scheme: mediatopic
created: 2009-10-22T02:00:00+00:00
modified: 2021-02-18T12:00:00+00:00
broader: Tävlingsidrott

Bandy
type: Concept
definition: Spelas på en isbana av ungefär samma storlek som en fotbollsplan. Spelarna har skridskor och en klubba med kortare rundat blad. Spelas med liten hård boll. Lagen består av elva spelare, varav en är målvakt.
in scheme: mediatopic
created: 2009-10-22T02:00:00+00:00
modified: 2021-02-18T12:00:00+00:00
broader: Tävlingsidrott

Baseboll
type: Concept
definition: Match mellan niomannalag där det lag som samlar flest poäng vinner. Poäng får man genom att springa runt banan som är markerad med fyra rundningsmärken. Spelaren måste först träffa en boll som kastas av en spelare i motståndarlaget.
in scheme: mediatopic
created: 2009-10-22T02:00:00+00:00
modified: 2021-02-18T12:00:00+00:00
broader: Tävlingsidrott
narrower: Baseboll med gummiboll

Basket
type: Concept
definition: Match mellan två femmannalag där de passar en boll och försöker pricka en fast korg med nät som sitter 3,05 meter över marken.
in scheme: mediatopic
created: 2009-10-22T02:00:00+00:00
modified: 2021-02-18T12:00:00+00:00
broader: Tävlingsidrott

Skidskytte
type: Concept
definition: En kombination av längdskidåkning och skytte. Antal skjutningar och regler för missar i skytte varierar mellan olika tävlingstyper.
in scheme: mediatopic
created: 2009-10-22T02:00:00+00:00
modified: 2021-05-05T12:00:00+00:00
broader: Tävlingsidrott

Biljard
type: Concept
definition: De tävlande använder en kö för att pricka bollar på ett speciellt bord och få ner bollarna i hål i hörnen och på långsidorna.
in scheme: mediatopic
created: 2009-10-22T02:00:00+00:00
modified: 2021-02-18T12:00:00+00:00
broader: Tävlingsidrott
broad match: http://cv.iptc.org/newscodes/subjectcode/15010000
has facet: billiardtype

Bob
type: Concept
definition: Två eller fyra tävlande sitter i en specialkonstruerad släde och åker nerför en konstgjord isbana.
in scheme: mediatopic
created: 2009-10-22T02:00:00+00:00
modified: 2022-02-03T12:00:00+00:00
broader: Tävlingsidrott

Boule
type: Concept
definition: De tävlande turas om att kasta sina klot mot en målkula. Närmast vinner.
in scheme: mediatopic
created: 2009-10-22T02:00:00+00:00
modified: 2021-05-05T12:00:00+00:00
broader: Tävlingsidrott

Boxning
type: Concept
definition: Två tävlande med handskar på händerna försöker träffa varandra med knytnävarna. Tävlingen sker i en avgränsad fyrkant, normalt i ronder om tre minuter, och kan avgöras direkt vid knockout eller på poäng.
in scheme: mediatopic
created: 2009-10-22T02:00:00+00:00
modified: 2021-02-18T12:00:00+00:00
broader: Tävlingsidrott
narrower: Bantamvikt, (Boxning)
narrower: Cruiservikt, (Boxning)
narrower: Fjädervikt, (Boxning)
narrower: Flugvikt, (Boxning)
narrower: Tungvikt, (Boxning)
narrower: Lätt flugvikt, (Boxning)
narrower: Lätt tungvikt, (Boxning)
narrower: Lätt mellanvikt, (Boxning)
narrower: Lätt weltervikt, (Boxning)
narrower: Lättvikt, (Boxning)
narrower: Mellanvikt, (Boxning)
narrower: Minivikt, (Boxning)
narrower: Tung bantamvikt, (Boxning)
narrower: Tung fjädervikt, (Boxning)
narrower: Tung flugvikt, (Boxning)
narrower: Supertungvikt, (Boxning)
narrower: Tung mellanvikt, (Boxning)
narrower: Weltervikt, (Boxning)
has facet: weightclasstype

Tjurfäktning
type: Concept
definition: Tävlingar där människor utmanar tjurar i en arena.
in scheme: mediatopic
created: 2009-10-22T02:00:00+00:00
modified: 2021-02-18T12:00:00+00:00
broader: Tävlingsidrott

Kanadensisk fotboll
type: Concept
definition: En sport som påminner om amerikansk fotboll men har andra mått och regler och ett annat antal spelare.
in scheme: mediatopic
created: 2009-10-22T02:00:00+00:00
modified: 2021-02-18T12:00:00+00:00
broader: Tävlingsidrott

Kanot (kanadensare)
type: Concept
definition: Tävling i farkoster där de tävlande normalt står på knä och paddlar med en ensidig paddel.
in scheme: mediatopic
created: 2009-10-22T02:00:00+00:00
modified: 2021-02-18T12:00:00+00:00
broader: Tävlingsidrott
narrower: C1
narrower: C2
narrower: C4
narrower: Kanotsegling
narrower: Pontonering
has facet: canoekayaktype
broad match: http://cv.iptc.org/newscodes/subjectcode/15015000

Casting
type: Concept
definition: De tävlande använder kastspön, samma som när man fiskar, men med en vikt i stället för drag. Det gäller att träffa olika markerade mål och samla poäng.
in scheme: mediatopic
created: 2009-10-22T02:00:00+00:00
modified: 2021-07-12T12:00:00+00:00
broader: Tävlingsidrott

Klättring
type: Concept
definition: Klättting i naturen genom att använda händer och fötter.
in scheme: mediatopic
created: 2009-10-22T02:00:00+00:00
modified: 2021-02-18T12:00:00+00:00
broader: Tävlingsidrott
narrower: Isklättring
narrower: Bergsklättring

Sportklättring
type: Concept
definition: Tävlingar i att klättra i konstgjorda miljöer med olika svårighetsgrader.
in scheme: mediatopic
created: 2009-10-22T02:00:00+00:00
modified: 2021-07-12T12:00:00+00:00
broader: Tävlingsidrott

Cricket
type: Concept
definition: En bollsport som spelas på gräs med boll och slagträ.
in scheme: mediatopic
created: 2009-10-22T02:00:00+00:00
modified: 2021-02-18T12:00:00+00:00
broader: Tävlingsidrott

Krocket
type: Concept
definition: Spelas på gräsmatta med bågar som spelarna ska slå sina klot igenom och bli först att ta sig igenom banan.
in scheme: mediatopic
created: 2009-10-22T02:00:00+00:00
modified: 2021-02-18T12:00:00+00:00
broader: Tävlingsidrott

Curling
type: Concept
definition: Spelas mellan lag på is med runda stenar med handtag på ovansidan. En spelare (skipper) anger riktpunkt. En spelare skickar iväg stenen och en eller två till i laget följer stenens väg över isen och sopar för att ändra rikting och/eller fart.
in scheme: mediatopic
created: 2009-10-22T02:00:00+00:00
modified: 2021-02-18T12:00:00+00:00
broader: Tävlingsidrott
narrower: Isstock

Cykel
type: Concept
definition: Tävlande cyklar en bestämd distans så fort som möjligt, individuellt eller i lag.
in scheme: mediatopic
created: 2009-10-22T02:00:00+00:00
modified: 2021-02-18T12:00:00+00:00
broader: Tävlingsidrott
narrower: Konstcykling
narrower: Hinderbana
narrower: BMX
narrower: Cykelboll
narrower: Sprint
narrower: Cykelcross
narrower: Förföljelselopp, individuellt
narrower: Termpolopp
narrower: Keirin
narrower: Madison
narrower: Mountainbike
narrower: Poängrace
narrower: Landsvägscykling
narrower: Etapplopp
narrower: Lagsprint
narrower: Förföljelselopp, lag
narrower: Lagtempolopp
narrower: Bancykel
narrower: BMX freestyle
has facet: cyclingtype

Danssport
type: Concept
definition: Dansande par utför olika typer av dansstilar och bedöms av domare.
in scheme: mediatopic
created: 2009-10-22T02:00:00+00:00
modified: 2024-05-10T12:00:00+00:00
broader: Tävlingsidrott
narrower: Breaking

Dart
type: Concept
definition: Individuell eller lagtävling där de tävlande kastar pilar på en piltavla med ett speciellt mönster. Man börjar på 501 eller 301 och måste komma ner till exakt 0 för att vinna.
in scheme: mediatopic
created: 2009-10-22T02:00:00+00:00
modified: 2021-02-18T12:00:00+00:00
broader: Tävlingsidrott

Simhopp
type: Concept
definition: De tävlande hoppar från trampolin eller fast ställning på olika höjder och utför olika konster på vägen ner. Deras hopp bedöms av domare.
in scheme: mediatopic
created: 2009-10-22T02:00:00+00:00
modified: 2021-02-18T12:00:00+00:00
broader: Tävlingsidrott
narrower: Höga hopp
narrower: Svikthopp
narrower: Synkro

Undervattenssport
type: Concept
definition: Olika sportgrenar utförda under vatten.
in scheme: mediatopic
created: 2009-10-22T02:00:00+00:00
modified: 2021-02-18T12:00:00+00:00
broader: Tävlingsidrott

Hundsport
type: Concept
definition: Samlingsbegrepp för tävlingar där hundar springer ikapp runt en bana.
in scheme: mediatopic
created: 2009-10-22T02:00:00+00:00
modified: 2021-02-18T12:00:00+00:00
broader: Tävlingsidrott
narrower: Hundkapplöpning
narrower: Draghundsport
has facet: dogracingtype

Duathlon
type: Concept
definition: Tävlingsgren innehållande löpning och cykling.
in scheme: mediatopic
created: 2009-10-22T02:00:00+00:00
modified: 2021-02-18T12:00:00+00:00
broader: Tävlingsidrott

Ridsport
type: Concept
definition: Samlingsbegrepp för tävlingar med häst och ryttare.
in scheme: mediatopic
created: 2009-10-22T02:00:00+00:00
modified: 2021-07-12T12:00:00+00:00
broader: Tävlingsidrott
narrower: Terrängritt
narrower: Dressyr
narrower: Hästhoppning
narrower: Fälttävlan
narrower: Sportkörning
has facet: equestriantype

Fäktning
type: Concept
definition: Match mellan två tävlande som är utrustade med sabel, florett eller värja. Träffar på motståndaren registreras elektriskt.
in scheme: mediatopic
created: 2009-10-22T02:00:00+00:00
modified: 2021-02-18T12:00:00+00:00
broader: Tävlingsidrott
narrower: Värja
narrower: Florett
narrower: Sabel
has facet: fencingtype

Landhockey
type: Concept
definition: Lagsport mellan elvamannalag. Spelas på gräs med boll och böjda klubbor.
in scheme: mediatopic
created: 2009-10-22T02:00:00+00:00
modified: 2021-02-18T12:00:00+00:00
broader: Tävlingsidrott

Konståkning
type: Concept
definition: Tävlas individuellt eller i par där de tävlande utför konster på is med skridskor på fötterna. Programmet utförs till musik och bedöms av domare.
in scheme: mediatopic
created: 2009-10-22T02:00:00+00:00
modified: 2021-02-18T12:00:00+00:00
broader: Tävlingsidrott
narrower: Isdans
has facet: figureskatingtype

Fistboll
type: Concept
definition: Fistboll påminner om volleyboll men har lägre nät och bollen slås med knuten näve.
in scheme: mediatopic
created: 2009-10-22T02:00:00+00:00
modified: 2021-02-18T12:00:00+00:00
broader: Tävlingsidrott

Innebandy
type: Concept
definition: Spelas mellan sexmannalag, varav en är målvakt. Spelas inomhus på samma planstorlek som basket och handboll. Målvakten står på knä och använder händerna. Utespelarna har plastklubbor och spelar på en ihålig boll av plast.
in scheme: mediatopic
created: 2009-10-22T02:00:00+00:00
modified: 2021-02-18T12:00:00+00:00
broader: Tävlingsidrott

Frisbee
type: Concept
definition: Flera olika grenar som alla spelas med en rund plastskiva som kallas disc. Det finns två laggrenar och sju individuella grenar. Störst är laggrenen Ultimate där spelarna passar discen för att göra mål i målzonen och individuella grenen disc golf.
in scheme: mediatopic
created: 2009-10-22T02:00:00+00:00
modified: 2021-02-18T12:00:00+00:00
broader: Tävlingsidrott
has facet: flyingdisctype

Gaelisk fotboll
type: Concept
definition: Bollsport med 15-mannalag. Mindre och hårdare boll än i fotboll. Bollen får passas både med fot och hand. Stor sport på Irland.
in scheme: mediatopic
created: 2009-10-22T02:00:00+00:00
modified: 2021-02-18T12:00:00+00:00
broader: Tävlingsidrott
broad match: http://cv.iptc.org/newscodes/subjectcode/15000000

Golf
type: Concept
definition: Spelarna slår på en liten hård boll med olika klubbor runt en bana med normalt 18 hål av varierande längd och svårighet. Minst antal slag vinner. Banorna kan ha hinder i form av tjockt gräs, vatten och sand.
in scheme: mediatopic
created: 2009-10-22T02:00:00+00:00
modified: 2021-02-18T12:00:00+00:00
broader: Tävlingsidrott
narrower: Bangolf

Gymnastik
type: Concept
definition: De tävlande utför olika rörelser på olika redskap och bedöms av domare.
in scheme: mediatopic
created: 2009-10-22T02:00:00+00:00
modified: 2021-02-18T12:00:00+00:00
broader: Tävlingsidrott
narrower: Rytmisk sportgymnastik
narrower: Trampolin
narrower: Artistisk gymnastik

Handboll
type: Concept
definition: Två lag med sju spelare i varje passar en boll och försöker göra mål. Planen är cirka 40 meter lång och har ett rundat område framför målet där endast målvakten får vara. Normal matchtid är 2x30 minuter.
in scheme: mediatopic
created: 2009-10-22T02:00:00+00:00
modified: 2021-02-18T12:00:00+00:00
broader: Tävlingsidrott

Hornussen
type: Concept
definition: Schweizisk lagsport där en puck slås iväg i hög hastighet. Påminner lite om baseboll.
in scheme: mediatopic
created: 2009-10-22T02:00:00+00:00
modified: 2021-02-18T12:00:00+00:00
broader: Tävlingsidrott

Galopp
type: Concept
definition: Hästtävlingar med ryttaren sittande på hästen. Hästen får galoppera.
in scheme: mediatopic
created: 2009-10-22T02:00:00+00:00
modified: 2021-02-18T12:00:00+00:00
broader: Tävlingsidrott
narrower: Flat racing
narrower: Trav
narrower: Steeplechase

Hurling
type: Concept
definition: Irländsk lagsport med 15-mannalag på en plan som har samma mått som gaelisk fotboll. Spelarna har en träklubba och försöker slå en liten hård boll i mål. Man får även passa bollen med hand eller fot.
in scheme: mediatopic
created: 2009-10-22T02:00:00+00:00
modified: 2021-02-18T12:00:00+00:00
broader: Tävlingsidrott
broad match: http://cv.iptc.org/newscodes/subjectcode/15000000

Ishockey
type: Concept
definition: Spelas på is mellan sexmannalag där spelarna har skydd, skridskor på fötterna och klubba i handen. Runt isen finns en sarg. Spelarna försöker få in pucken i motståndarnas mål. Normal matchtid är 3x20 minuter.
in scheme: mediatopic
created: 2009-10-22T02:00:00+00:00
modified: 2021-02-18T12:00:00+00:00
broader: Tävlingsidrott
narrower: Kälkhockey

Inlines
type: Concept
definition: Tävlingsport på rullskridskor, där hjulen sitter på rad.
in scheme: mediatopic
created: 2009-10-22T02:00:00+00:00
retired: 2021-02-18T12:00:00+00:00
modified: 2021-02-18T12:00:00+00:00
broader: Tävlingsidrott

Pelota
type: Concept
definition: Snabb bollsport mot en vägg där spelarna antingen använder händerna eller en särskilt utformad handske.
in scheme: mediatopic
created: 2009-10-22T02:00:00+00:00
modified: 2021-02-18T12:00:00+00:00
broader: Tävlingsidrott
has facet: jaialaitype

Kabaddi
type: Concept
definition: Lagsport med rötter i Indien. Det försvarande laget samarbetar medan bara en ur det anfallande laget får anfalla i taget. Anfallaren försöker röra så många försvarare som möjligt och försvararna försöker hindra anfallaren att återvända till sin planhalva.
in scheme: mediatopic
created: 2009-10-22T02:00:00+00:00
modified: 2021-02-18T12:00:00+00:00
broader: Tävlingsidrott

Kanot (kajak)
type: Concept
definition: Båtsport där den tävlande sitter med ben och fötter framåt och använder en paddel med blad i båda ändar.
in scheme: mediatopic
created: 2009-10-22T02:00:00+00:00
modified: 2021-02-18T12:00:00+00:00
broader: Tävlingsidrott
narrower: K1
narrower: K2
narrower: K4
broad match: http://cv.iptc.org/newscodes/subjectcode/15015000
has facet: canoekayaktype

Lacrosse
type: Concept
definition: Lacrosse är en lagsport med indianskt ursprung. Stor sport i USA och Kanada. Spelarna har en klubba med ett triangelformat nät längst fram. Där kan bollen fångas. Man får slå på motståndarnas klubba och hand och även tacklas.
in scheme: mediatopic
created: 2009-10-22T02:00:00+00:00
modified: 2021-02-18T12:00:00+00:00
broader: Tävlingsidrott

Rodel
type: Concept
definition: Den tävlande åker på rygg med fötterna först på en liten släde nedför en bana som kan vara naturlig men oftast är uppbyggd. Åkaren kan till viss del styra sin släde.
in scheme: mediatopic
created: 2009-10-22T02:00:00+00:00
modified: 2021-02-18T12:00:00+00:00
broader: Tävlingsidrott

Maraton
type: Concept
definition: Långlopp med anor från en grekisk myt om en löpare som sprang från Marathon 42195 m. Moderna maratontävlingar går ofta på avstängda gator i stora städer.
in scheme: mediatopic
created: 2009-10-22T02:00:00+00:00
modified: 2021-02-18T12:00:00+00:00
broader: Tävlingsidrott

Modern femkamp
type: Concept
definition: Modern femkamp infördes vid OS i Stockholm 1912 som en modern version av antikens femkamp. I modern femkamp tävlar man i skytte, fäktning, simning, ridning och löpning.
in scheme: mediatopic
created: 2009-10-22T02:00:00+00:00
modified: 2021-02-18T12:00:00+00:00
broader: Tävlingsidrott

Båtsport
type: Concept
definition: Samlingsbegrepp för tävlingar med motorbåtar på vatten.
in scheme: mediatopic
created: 2009-10-22T02:00:00+00:00
modified: 2021-02-18T12:00:00+00:00
broader: Tävlingsidrott
broad match: http://cv.iptc.org/newscodes/subjectcode/15046000

Motorsport
type: Concept
definition: Samlingsbegrepp för tävlingar med olika typer av bilar.
in scheme: mediatopic
created: 2009-10-22T02:00:00+00:00
modified: 2021-02-18T12:00:00+00:00
broader: Tävlingsidrott
narrower: Endurance
narrower: F3000
narrower: F1
narrower: Indy
narrower: Rallycross
narrower: Rally
has facet: motorcarracingtype

MC-sport
type: Concept
definition: Samlingsbegrepp för tävlingar med motorfordon där föraren sitter på en sadel och styr med styre. Normalt tvåhjuliga, men det finns trehjuliga och fyrhjuliga varianter också.
in scheme: mediatopic
created: 2009-10-22T02:00:00+00:00
modified: 2021-02-18T12:00:00+00:00
broader: Tävlingsidrott
narrower: Endurance, mc
narrower: Enduro
narrower: Grasstrack
narrower: Motorcykelpolo
narrower: Motocross
narrower: Roadracing
narrower: Motorcykelrally
narrower: Sidvagn
narrower: Speedway
narrower: Trial
has facet: motorcyclingtype

Nätboll
type: Concept
definition: Påminner mycket om basket, men korgarna har inga plattor bakom utan sitter på en stolpe. Spelas främst av kvinnor.
in scheme: mediatopic
created: 2009-10-22T02:00:00+00:00
modified: 2021-02-18T12:00:00+00:00
broader: Tävlingsidrott

Orientering
type: Concept
definition: Utrustad med karta och kompass ska de tävlande på tid leta upp ett antal kontroller. Vägvalet är frivilligt. Olika lopp har olika längd och antal kontroller. Utförs även som stafett.
in scheme: mediatopic
created: 2009-10-22T02:00:00+00:00
modified: 2021-02-18T12:00:00+00:00
broader: Tävlingsidrott
narrower: Skidorientering

Fallskärmshoppning
type: Concept
definition: De tävlande hoppar ut från ett flygplan och har fallskärm och gör konster i luften eller precisionslandar. Individuellt eller i lag.
in scheme: mediatopic
created: 2009-10-22T02:00:00+00:00
modified: 2021-02-18T12:00:00+00:00
broader: Tävlingsidrott

Hästpolo
type: Concept
definition: De tävlande rider och har en klubba med vilken de slår en boll med målsättningen att få den i motståndarnas mål.
in scheme: mediatopic
created: 2009-10-22T02:00:00+00:00
modified: 2021-02-18T12:00:00+00:00
broader: Tävlingsidrott

Pool
type: Concept
definition: Bollsport med kö som redskap med vilken man stöter bollar på ett speciellt bord.
in scheme: mediatopic
created: 2009-10-22T02:00:00+00:00
modified: 2021-02-18T12:00:00+00:00
broader: Tävlingsidrott
broad match: http://cv.iptc.org/newscodes/subjectcode/15010000
has facet: billiardtype

Båtracing
type: Concept
definition: Tävlingar mellan motorbåtar på sjöar, havet eller floder.
in scheme: mediatopic
created: 2009-10-22T02:00:00+00:00
modified: 2021-02-18T12:00:00+00:00
broader: Tävlingsidrott

Rodeo
type: Concept
definition: En sport där de tävlande ska hantera vilda hästar, tjurar, kalvar eller getter.
in scheme: mediatopic
created: 2009-10-22T02:00:00+00:00
modified: 2021-02-18T12:00:00+00:00
broader: Tävlingsidrott
narrower: Sadellös inridning av hästar
narrower: Barrel racing
narrower: Tjurridning
narrower: Steer wrestling
narrower: Lasso (kalvar)
narrower: Lasso (getter)
narrower: Inridning (med sadel) av hästar

Rodd
type: Concept
definition: Tävling på uppmärkt bana i naturliga vatten där varje tävlande har två åror. Rodd finns individuellt eller i större båtar för exempelvis två, fyra eller åtta personer. Olika lopp har olika längd.
in scheme: mediatopic
created: 2009-10-22T02:00:00+00:00
modified: 2021-02-18T12:00:00+00:00
broader: Tävlingsidrott
narrower: Fyra med styrman
narrower: Tvåa med styrman
narrower: Fyra utan styrman
narrower: Tvåa utan styrman
narrower: Dubbelsculler
narrower: Åttamanna
narrower: Fyrsculler
narrower: Singelsculler
has facet: rowingtype

Segling
type: Concept
definition: Samlingsbegrepp för tävlingar med båtar kring en uppmärkt bana där båtarna drivs av vinden med hjälp av segel. Många olika båttyper och banlängder.
in scheme: mediatopic
created: 2009-10-22T02:00:00+00:00
modified: 2021-02-18T12:00:00+00:00
broader: Tävlingsidrott
narrower: Katamaran och trimaran
narrower: Jolle
narrower: Kölbåt
narrower: Regatta
narrower: Havskappsegling
narrower: Världsomsegling
narrower: Ensamsegling
narrower: Ensamsegling jorden runt
has facet: sailingtype

Sepak takraw
type: Concept
definition: En sydostasiatisk lagsport som liknar volleyboll där man använder fötterna, knäna, bröstet eller huvudet för att vidröra bollen.
in scheme: mediatopic
created: 2009-10-22T02:00:00+00:00
modified: 2021-02-18T12:00:00+00:00
broader: Tävlingsidrott

Shinty
type: Concept
definition: En keltisk bollidrott, som utförs mellan två lag med speciella klubbor och där mål görs genom att skjuta en liten läderboll mellan målstolparna.
in scheme: mediatopic
created: 2009-10-22T02:00:00+00:00
modified: 2021-02-18T12:00:00+00:00
broader: Tävlingsidrott
broad match: http://cv.iptc.org/newscodes/subjectcode/15000000

Sportskytte
type: Concept
definition: Samlingsbegrepp för olika tävlingar med prickskytte med vapen som pistol, gevär och hagelgevär.
in scheme: mediatopic
created: 2009-10-22T02:00:00+00:00
modified: 2023-10-02T12:00:00+00:00
broader: Tävlingsidrott
narrower: Pistol
narrower: Gevär
narrower: Running target
narrower: Hagelgevär
narrower: Lerduveskytte
has facet: shootingtype

Skeleton
type: Concept
definition: Liknar rodel men den tävlande ligger på magen och åker med huvudet först.
in scheme: mediatopic
created: 2009-10-22T02:00:00+00:00
modified: 2021-02-18T12:00:00+00:00
broader: Tävlingsidrott

Skidor
type: Concept
definition: Samlingsbegrepp för alla typer av tävlingar där de tävlande har skidor på fötterna.
in scheme: mediatopic
created: 2009-10-22T02:00:00+00:00
modified: 2021-02-18T12:00:00+00:00
broader: Tävlingsidrott
narrower: Alpint
narrower: Freestyle
narrower: Grässkidåkning
narrower: Längdåkning, nordisk
narrower: Backhoppning
narrower: Längdåkning
narrower: Nordisk kombination
narrower: Telemark
narrower: Skidalpinism
broad match: http://cv.iptc.org/newscodes/subjectcode/15000000

Sky diving
type: Concept
definition: En individuell tävlingsgren inom fallskärmssporten där hopparen ställer sig med huvudet mot marken i fritt fall och faller så fort det är möjligt.
in scheme: mediatopic
created: 2009-10-22T02:00:00+00:00
modified: 2021-02-18T12:00:00+00:00
broader: Tävlingsidrott

Snooker
type: Concept
definition: En form av biljard, där målet är att vinna fler frames (upplägg av alla bollar på bordet) än motståndaren, vilket ger matchvinst.
in scheme: mediatopic
created: 2009-10-22T02:00:00+00:00
modified: 2021-02-18T12:00:00+00:00
broader: Tävlingsidrott
has facet: billiardtype

Snowboard
type: Concept
definition: Samlingsbegrepp av tävlingar som utförs av åkaren stående med båda fötterna på samma bräda. Till skillnad mot skidåkning där man har fötterna på varsin skida.
in scheme: mediatopic
created: 2009-10-22T02:00:00+00:00
modified: 2021-02-18T12:00:00+00:00
broader: Tävlingsidrott
has facet: snowboardingtype

Fotboll
type: Concept
definition: Lagsport där elvamannalag passar, skjuter, nickar och dribblar en boll och försöker få in bollen i motståndarnas mål. Varje lag har en målvakt och tio utespelare.
in scheme: mediatopic
created: 2009-10-22T02:00:00+00:00
modified: 2024-09-26T12:00:00+00:00
broader: Tävlingsidrott
narrower: http://cv.iptc.org/newscodes/mediatopic/20001393
narrower: http://cv.iptc.org/newscodes/mediatopic/20001394

Softboll
type: Concept
definition: Påminner om baseboll men spelas med en mjukare boll, lättare slagträ och kortare avstånd mellan rundningsmärkena.
in scheme: mediatopic
created: 2009-10-22T02:00:00+00:00
modified: 2021-02-18T12:00:00+00:00
broader: Tävlingsidrott

Skridsko
type: Concept
definition: Två tävlande i taget åker runt en oval isbana med speciella längdåkningsskridskor på fötterna. De tävlande växlar mellan innerbana och ytterbana. Lopp av olika längd.
in scheme: mediatopic
created: 2009-10-22T02:00:00+00:00
modified: 2021-03-31T12:00:00+00:00
broader: Tävlingsidrott

Squash
type: Concept
definition: Racketsport med en liten gummiboll. Man tävlar individuellt eller i par i ett rum med väggar där de tävlande delar på utrymmet.
in scheme: mediatopic
created: 2009-10-22T02:00:00+00:00
modified: 2021-02-18T12:00:00+00:00
broader: Tävlingsidrott

Sumobrottning
type: Concept
definition: En japansk kampsport, där tunga och starka utövare brottas upprätt för att antingen få ut motståndaren ur ringen eller få denne att vidröra marken med någon annan kroppsdel än fotsulorna.
in scheme: mediatopic
created: 2009-10-22T02:00:00+00:00
modified: 2021-02-18T12:00:00+00:00
broader: Tävlingsidrott

Surfing
type: Concept
definition: En sport där en person med eller utan hjälp av en surfbräda glider på vattenytan på framsidan av en våg.
in scheme: mediatopic
created: 2009-10-22T02:00:00+00:00
modified: 2021-02-18T12:00:00+00:00
broader: Tävlingsidrott

Simning
type: Concept
definition: Tävlingarna sker i speciella bassänger med uppmärkta banor. Bassängerna kan vara långa eller korta. Man tävlar i olika distanser och olika simsätt som bröst, frisim, rygg och medley. Även som stafetter som i simning kallas lagkapp.
in scheme: mediatopic
created: 2009-10-22T02:00:00+00:00
modified: 2021-02-18T12:00:00+00:00
broader: Tävlingsidrott
narrower: Ryggsim
narrower: Bröstsim
narrower: Fjärilssim
narrower: Frisim
narrower: Medley
narrower: Öppet vatten
narrower: Kappsim, fritt
narrower: Kappsim, medley
narrower: Kort bana
has facet: swimmingtype

Bordtennis
type: Concept
definition: Racketsport med små racketar med gummiduk och en liten lätt boll. Bollen måste träffa motståndarens sida av bordet. Bordet är avdelat med ett lågt nät. Man spelar individuellt eller i par i set. En match består av flera set.
in scheme: mediatopic
created: 2009-10-22T02:00:00+00:00
modified: 2021-03-15T12:00:00+00:00
broader: Tävlingsidrott

Tennis
type: Concept
definition: De tävlande slår med en racket en boll och ska träffa motståndarens planhalva. Ett nät skiljer planhalvorna åt. Olika underlag i olika tävlingar. Matchen spelasindividuellt eller i par och i flera set, som består av flera game.
in scheme: mediatopic
created: 2009-10-22T02:00:00+00:00
modified: 2021-02-18T12:00:00+00:00
broader: Tävlingsidrott

Bowling
type: Concept
definition: De tävlande turas om att med ett speciellt klot försöka fälla tio käglor som står uppställda på en speciell bana. Varje tävlande har två försök per omgång. En match består av en eller flera rundor om tio omgångar.
in scheme: mediatopic
created: 2009-10-22T02:00:00+00:00
modified: 2021-02-18T12:00:00+00:00
broader: Tävlingsidrott

Triathlon
type: Concept
definition: Kombinationstävling där de tävlande först simmar en sträcka, sedan cyklar en sträcka och slutligen springer. Totala längden kan variera mellan olika tävlingar.
in scheme: mediatopic
created: 2009-10-22T02:00:00+00:00
modified: 2021-02-18T12:00:00+00:00
broader: Tävlingsidrott

Dragkamp
type: Concept
definition: Två lag drar i ett rep. Det lag som lyckas dra motståndarna över till sin sida har vunnit.
in scheme: mediatopic
created: 2009-10-22T02:00:00+00:00
modified: 2021-02-18T12:00:00+00:00
broader: Tävlingsidrott

Volleyboll
type: Concept
definition: Lagsport där sexmannalag försvarar sin sida och försöker slå bollen över nätet till motståndarnas sida. Laget får poäng om motståndarna inte lyckas slå tillbaka bollen med max tre tillslag, slår i nät eller slår bollen utanför planen. Spelas i set.
in scheme: mediatopic
created: 2009-10-22T02:00:00+00:00
modified: 2021-02-18T12:00:00+00:00
broader: Tävlingsidrott
narrower: Beachvolleyboll

Vattenpolo
type: Concept
definition: Lagsport som utspelas i en vattenbassäng mellan sjumannalag. Spelarna får simma och driva bollen framåt, eller passa till en medspelare med en hand. Målet är att få in bollen i motståndarnas mål.
in scheme: mediatopic
created: 2009-10-22T02:00:00+00:00
modified: 2021-02-18T12:00:00+00:00
broader: Tävlingsidrott

Vattenskidor
type: Concept
definition: De tävlande åker på vatten dragna av en dragbåt, eller på annat sätt. Man tävlar i hopp, slalom och trick. Man kan åka på två skidor eller på en skida.
in scheme: mediatopic
created: 2009-10-22T02:00:00+00:00
modified: 2021-02-18T12:00:00+00:00
broader: Tävlingsidrott
has facet: waterskiingtype

Tyngdlyftning
type: Concept
definition: De tävlande turas om att lyfta en stång med vikter påmonterade. Vikten ökar under tävlingens gång och de tävlande har tre försök i varje disciplin. De är ryck och stöt.
in scheme: mediatopic
created: 2009-10-22T02:00:00+00:00
modified: 2021-07-12T12:00:00+00:00
broader: Tävlingsidrott
narrower: Stöt
narrower: Styrkelyft
narrower: Ryck
has facet: weightliftingtype

Windsurfing
type: Concept
definition: Liknar segling, men i stället för att sitta i en båt så står de tävlande på en windsurfingbräda och hanterar seglet med händerna.
in scheme: mediatopic
created: 2009-10-22T02:00:00+00:00
modified: 2021-02-18T12:00:00+00:00
broader: Tävlingsidrott
has facet: windsurfingtype

Brottning
type: Concept
definition: Kampsport där de tävlande med hjälp av olika grepp ska få ner motståndarens skuldror i mattan. Om en match inte slutar i fall så avgör domarröster. Man tävlar i grekisk-romersk stil och fristil.
in scheme: mediatopic
created: 2009-10-22T02:00:00+00:00
modified: 2021-02-18T12:00:00+00:00
broader: Tävlingsidrott
narrower: Fristil
narrower: Grekisk-romersk stil
narrower: Schwingen
has facet: weightclasstype

Shorttrack
type: Concept
definition: Skridskotävling i heat på en oval bana. Normalt fyra tävlande per heat.
in scheme: mediatopic
created: 2014-01-20T12:00:00+00:00
modified: 2021-02-18T12:00:00+00:00
broader: Tävlingsidrott

Schack
type: Concept
definition: Brädspel mellan två spelare som har 16 pjäser var när partiet startar. Olika pjäser får flytta enligt olika mönster. Den som ställer motståndarens kung så den inte kan flytta vinner. Om ingen spelare lyckas med det kan det sluta oavgjort, vilket kallas remi.
in scheme: mediatopic
created: 2014-11-07T12:00:00+00:00
modified: 2021-07-12T12:00:00+00:00
broader: Tävlingsidrott

Rullskridskosport
type: Concept
definition: Olika sorters tävlingar där de tävlande har rullskridskor på fötterna.
in scheme: mediatopic
created: 2014-11-07T12:00:00+00:00
modified: 2021-07-12T12:00:00+00:00
broader: Tävlingsidrott
narrower: Inlinehockey
narrower: Skateboard

Kampsport
type: Concept
definition: Samlingsnamn för sporter som innehåller eller förbereder för någon form av närstrid, kontrollerade i utövandet, med regler och förbud, krav på skyddsutrustning och ofta bedömning i form av ett poängsystem.
in scheme: mediatopic
created: 2015-08-27T12:00:00+00:00
modified: 2021-07-12T12:00:00+00:00
broader: Tävlingsidrott
narrower: Judo
narrower: Jukendo
narrower: Karate
narrower: Kendo
narrower: Japanskt bågskytte
narrower: Naginata
narrower: Taekwondo
narrower: Wushu
narrower: MMA
narrower: Krav maga
narrower: Kickboxning
narrower: Sambo

Konstsim
type: Concept
definition: En olympisk gren, där man tävlar i två moment: musiksimning och figursimning.
in scheme: mediatopic
created: 2016-04-05T12:00:00+00:00
modified: 2021-07-12T12:00:00+00:00
broader: Tävlingsidrott
narrower: Fria programmet
narrower: Tekniska programmet

Rugby
type: Concept
definition: En engelsk sport där två lag spelar på en bana där de passar och springer med en oval boll. Poäng får lagen genom att placera bollen i motståndarnas målzon eller sparka den mellan målstolparna.
in scheme: mediatopic
created: 2016-04-05T12:00:00+00:00
modified: 2021-07-12T12:00:00+00:00
broader: Tävlingsidrott
narrower: Rugby League
narrower: Rugby Union
narrower: Sjumannarugby

Esport
type: Concept
definition: Tävlingar mellan deltagare som spelar spel på datorer eller speciella spelmaskiner. Kan vara både sportbaserade spel och militärt inriktade spel.
in scheme: mediatopic
created: 2018-04-19T12:00:00+00:00
modified: 2021-07-12T12:00:00+00:00
broader: Tävlingsidrott

Styrketräning
type: Concept
definition: Fysiska aktiviteter som mest syftar till att öka en persons muskelstyrka.
in scheme: mediatopic
created: 2019-06-26T12:00:00+00:00
modified: 2021-07-12T12:00:00+00:00
broader: Tävlingsidrott

Raquetboll
type: Concept
definition: Bollsport som är väldigt lik Squash.
in scheme: mediatopic
created: 2019-10-07T12:00:00+00:00
modified: 2021-07-12T12:00:00+00:00
broader: Tävlingsidrott

Ringette
type: Concept
definition: Spelas på en vanlig hockeyrink men spelarna har käppar istället för klubbor och man spelar med en ring istället för en puck.
in scheme: mediatopic
created: 2019-10-07T12:00:00+00:00
modified: 2021-07-12T12:00:00+00:00
broader: Tävlingsidrott

Armbrytning
type: Concept
definition: Kallas och armsport. Två tävlande vilar armbågen på ett bord och försöker tvinga ner den andres hand på bordet.
in scheme: mediatopic
created: 2019-11-25T12:00:00+00:00
modified: 2021-07-12T12:00:00+00:00
broader: Tävlingsidrott

Padel
type: Concept
definition: Racketsport, ibland kallad padeltennis, där tvåmannalag möts i en stängd bana.
in scheme: mediatopic
created: 2021-02-18T12:00:00+00:00
modified: 2021-07-12T12:00:00+00:00
broader: Tävlingsidrott

Kitesurf
type: Concept
definition: De tävlande står på en lite bräda på vatten och dras fram av en drake som de kan styra för att utföra trick.
in scheme: mediatopic
created: 2021-02-18T12:00:00+00:00
modified: 2021-07-12T12:00:00+00:00
broader: Tävlingsidrott

SUP
type: Concept
definition: De tävlande står på brädor liknande windsurfing och paddlar sig fram.
in scheme: mediatopic
created: 2021-02-18T12:00:00+00:00
modified: 2021-07-12T12:00:00+00:00
broader: Tävlingsidrott

Cheerleeding
type: Concept
definition: Grupper som utför gymnastiska program avsedda att heja på något lag tävlar mot varandra.
in scheme: mediatopic
created: 2021-02-18T12:00:00+00:00
modified: 2021-07-12T12:00:00+00:00
broader: Tävlingsidrott

3x3
type: Concept
definition: Variant av basketboll med tre personer per lag som spelar mot en korg.
in scheme: mediatopic
created: 2021-07-12T12:00:00+00:00
modified: 2021-12-21T12:00:00+00:00
broader: Tävlingsidrott

Kanotslalom
type: Concept
definition: Kanotslalom är en olympisk tävlingssport som går ut på att föra en kanadensare eller kajak på snabbast tid genom portar som hänger över banan. Varje port består av två stänger som är antingen röda/vita eller gröna/vita, och portarna ska passeras i nummerordning.
in scheme: mediatopic
created: 2021-07-12T12:00:00+00:00
modified: 2021-12-21T12:00:00+00:00
broader: Tävlingsidrott

Kanotsprint
type: Concept
definition: Olympisk tävlingsport med kanot eller kajak på sträckorna 200, 500 och 1000 meter.
in scheme: mediatopic
created: 2021-07-12T12:00:00+00:00
modified: 2021-12-21T12:00:00+00:00
broader: Tävlingsidrott

Landsvägscykling
type: Concept
definition: Cykeltävlingar på vanliga vägar och gator.
in scheme: mediatopic
created: 2021-07-12T12:00:00+00:00
modified: 2021-12-21T12:00:00+00:00
broader: Tävlingsidrott

Bancykel
type: Concept
definition: Cykeltävling på en oval bana som är kraftigt doserad och medger hög fart även i kurvorna.
in scheme: mediatopic
created: 2021-07-12T12:00:00+00:00
modified: 2021-12-21T12:00:00+00:00
broader: Tävlingsidrott

5-mannafotboll
type: Concept
definition: Variant av fotboll med fem spelare på en mindre plan.
in scheme: mediatopic
created: 2021-07-12T12:00:00+00:00
modified: 2021-12-21T12:00:00+00:00
broader: Tävlingsidrott

Goalball
type: Concept
definition: Lagbollsport för personer med synnedsättning där bollen innehåller pinglor.
in scheme: mediatopic
created: 2021-07-12T12:00:00+00:00
modified: 2021-12-21T12:00:00+00:00
broader: Tävlingsidrott

Armborstskytte
type: Concept
definition: Som bågskytte, men med en armborst som skjuter hårdare och längre än en pilbåge och behöver laddas innan den kan avfyras.
in scheme: mediatopic
created: 2009-10-22T02:00:00+00:00
modified: 2021-02-18T12:00:00+00:00
broader: Bågskytte

Långbågeskytte
type: Concept
definition: Bågskytte, men utan de hjälpmedel som finns moderna pilbågar. En långbåge ska mer påminna om gamla tiders pilbågar.
in scheme: mediatopic
created: 2009-10-22T02:00:00+00:00
modified: 2021-05-05T12:00:00+00:00
broader: Bågskytte
broad match: http://cv.iptc.org/newscodes/subjectcode/15004000

Terränglöpning
type: Concept
definition: Lopp längs en utmärkt väg över blandad terräng.
in scheme: mediatopic
created: 2009-10-22T02:00:00+00:00
modified: 2021-05-05T12:00:00+00:00
broader: Friidrott
broad match: http://cv.iptc.org/newscodes/subjectcode/15005000

Tiokamp
type: Concept
definition: En friidrottsgren där de tävlande utför tio olika grenar under två dagars tävlande. Varje resultat ger poäng så grenarna blir jämförbara och vinnaren är den med högst totalsumma.
in scheme: mediatopic
created: 2009-10-22T02:00:00+00:00
modified: 2021-02-18T12:00:00+00:00
broader: Friidrott

Diskus
type: Concept
definition: Tävlande kastar en rund skiva så långt som möjligt.
in scheme: mediatopic
created: 2009-10-22T02:00:00+00:00
modified: 2021-02-18T12:00:00+00:00
broader: Friidrott

Slägga
type: Concept
definition: De tävlande kastar ett redskap som består av ett handtag, en kedja och en kula så långt som möjligt.
in scheme: mediatopic
created: 2009-10-22T02:00:00+00:00
modified: 2021-02-18T12:00:00+00:00
broader: Friidrott

Sjukamp
type: Concept
definition: Friidrottsgren för kvinnor med sju grenar under två dagar. Bästa resultatet i varje gren ger en jämförbar poäng och högsta summa vinner.
in scheme: mediatopic
created: 2009-10-22T02:00:00+00:00
modified: 2021-02-18T12:00:00+00:00
broader: Friidrott

Höjdhopp
type: Concept
definition: De tävlande försöker hoppa över en horisontell pinne som vilar på ett stativ.
in scheme: mediatopic
created: 2009-10-22T02:00:00+00:00
modified: 2021-02-18T12:00:00+00:00
broader: Friidrott

Häcklöpning
type: Concept
definition: De tävlande springer en sträcka samtidigt som de hoppar över utställda hinder.
in scheme: mediatopic
created: 2009-10-22T02:00:00+00:00
modified: 2021-05-05T12:00:00+00:00
broader: Friidrott
broad match: http://cv.iptc.org/newscodes/subjectcode/15005000

Spjutkastning
type: Concept
definition: De tävlande kastar ett spjut så långt som möjligt.
in scheme: mediatopic
created: 2009-10-22T02:00:00+00:00
modified: 2021-02-18T12:00:00+00:00
broader: Friidrott

Långdistanslöpning
type: Concept
definition: Alla former av springtävlingar som är längre än 1500 meter.
in scheme: mediatopic
created: 2009-10-22T02:00:00+00:00
modified: 2021-02-18T12:00:00+00:00
broader: Friidrott
broad match: http://cv.iptc.org/newscodes/subjectcode/15005000

Längdhopp
type: Concept
definition: Tävlande tar sats och hoppar så långt som möjligt.
in scheme: mediatopic
created: 2009-10-22T02:00:00+00:00
modified: 2021-02-18T12:00:00+00:00
broader: Friidrott

Medeldistanslöpning
type: Concept
definition: Springtävlingar som är mellan 400 och 1500 meter.
in scheme: mediatopic
created: 2009-10-22T02:00:00+00:00
modified: 2021-02-18T12:00:00+00:00
broader: Friidrott
broad match: http://cv.iptc.org/newscodes/subjectcode/15005000

Femkamp
type: Concept
definition: Inomhustävling där de tävlande genomför fem olika grenar, jämförbar med tiokamp utomhus.
in scheme: mediatopic
created: 2009-10-22T02:00:00+00:00
modified: 2021-02-18T12:00:00+00:00
broader: Friidrott

Stavhopp
type: Concept
definition: Med hjälp av en stav ska de tävlande ta sig över så hög höjd som möjligt.
in scheme: mediatopic
created: 2009-10-22T02:00:00+00:00
modified: 2021-02-18T12:00:00+00:00
broader: Friidrott

Gång
type: Concept
definition: De tävlande ska avverka en bana på så kort tid som möjligt utan att springa. De tävlande måste alltid ha en fot i kontakt med marken.
in scheme: mediatopic
created: 2009-10-22T02:00:00+00:00
modified: 2021-02-18T12:00:00+00:00
broader: Friidrott
broad match: http://cv.iptc.org/newscodes/subjectcode/15005000

Stafett
type: Concept
definition: Springtävlingar där personer i ett lag tar en delsträcka var.
in scheme: mediatopic
created: 2009-10-22T02:00:00+00:00
modified: 2021-02-18T12:00:00+00:00
broader: Friidrott
broad match: http://cv.iptc.org/newscodes/subjectcode/15005000

Kulstötning
type: Concept
definition: De tävlande stöter en metallkula så långt som möjligt.
in scheme: mediatopic
created: 2009-10-22T02:00:00+00:00
modified: 2021-02-18T12:00:00+00:00
broader: Friidrott

Sprintdistanser
type: Concept
definition: Springtävlingar på distanser till och med 400 meter.
in scheme: mediatopic
created: 2009-10-22T02:00:00+00:00
modified: 2021-02-18T12:00:00+00:00
broader: Friidrott

Tresteg
type: Concept
definition: En variant av längdhopp där de tävlande får ta tre steg efter avstamp från hoppbrädan.
in scheme: mediatopic
created: 2009-10-22T02:00:00+00:00
modified: 2021-02-18T12:00:00+00:00
broader: Friidrott

Hinderlöpning
type: Concept
definition: Löptävlingar på bana med olika hinder som bockar och vattengrav.
in scheme: mediatopic
created: 2019-07-23T12:00:00+00:00
modified: 2021-07-12T12:00:00+00:00
broader: Friidrott

Baseboll med gummiboll
type: Concept
definition: Som baseboll fast med en boll gjord av gummi.
in scheme: mediatopic
created: 2009-10-22T02:00:00+00:00
modified: 2021-05-05T12:00:00+00:00
broader: Baseboll

Bantamvikt, (Boxning)
type: Concept
in scheme: mediatopic
created: 2009-10-22T02:00:00+00:00
retired: 2015-02-24T12:00:00+00:00
modified: 2021-12-21T12:00:00+00:00
broader: Boxning

Cruiservikt, (Boxning)
type: Concept
in scheme: mediatopic
created: 2009-10-22T02:00:00+00:00
retired: 2015-02-24T12:00:00+00:00
modified: 2021-12-21T12:00:00+00:00
broader: Boxning

Fjädervikt, (Boxning)
type: Concept
in scheme: mediatopic
created: 2014-04-08T12:00:00+00:00
retired: 2015-02-24T12:00:00+00:00
modified: 2021-12-21T12:00:00+00:00
broader: Boxning

Flugvikt, (Boxning)
type: Concept
in scheme: mediatopic
created: 2009-10-22T02:00:00+00:00
retired: 2015-02-24T12:00:00+00:00
modified: 2021-12-21T12:00:00+00:00
broader: Boxning

Tungvikt, (Boxning)
type: Concept
in scheme: mediatopic
created: 2009-10-22T02:00:00+00:00
retired: 2015-02-24T12:00:00+00:00
modified: 2021-12-21T12:00:00+00:00
broader: Boxning

Lätt flugvikt, (Boxning)
type: Concept
in scheme: mediatopic
created: 2009-10-22T02:00:00+00:00
retired: 2015-02-24T12:00:00+00:00
modified: 2021-12-21T12:00:00+00:00
broader: Boxning

Lätt tungvikt, (Boxning)
type: Concept
in scheme: mediatopic
created: 2009-10-22T02:00:00+00:00
retired: 2015-02-24T12:00:00+00:00
modified: 2021-12-21T12:00:00+00:00
broader: Boxning

Lätt mellanvikt, (Boxning)
type: Concept
in scheme: mediatopic
created: 2009-10-22T02:00:00+00:00
retired: 2015-02-24T12:00:00+00:00
modified: 2021-12-21T12:00:00+00:00
broader: Boxning

Lätt weltervikt, (Boxning)
type: Concept
in scheme: mediatopic
created: 2009-10-22T02:00:00+00:00
retired: 2015-02-24T12:00:00+00:00
modified: 2021-12-21T12:00:00+00:00
broader: Boxning

Lättvikt, (Boxning)
type: Concept
in scheme: mediatopic
created: 2009-10-22T02:00:00+00:00
retired: 2015-02-24T12:00:00+00:00
modified: 2021-12-21T12:00:00+00:00
broader: Boxning

Mellanvikt, (Boxning)
type: Concept
in scheme: mediatopic
created: 2009-10-22T02:00:00+00:00
retired: 2015-02-24T12:00:00+00:00
modified: 2021-12-21T12:00:00+00:00
broader: Boxning

Minivikt, (Boxning)
type: Concept
in scheme: mediatopic
created: 2009-10-22T02:00:00+00:00
retired: 2015-02-24T12:00:00+00:00
modified: 2021-12-21T12:00:00+00:00
broader: Boxning
broad match: http://cv.iptc.org/newscodes/subjectcode/15014000

Tung bantamvikt, (Boxning)
type: Concept
in scheme: mediatopic
created: 2009-10-22T02:00:00+00:00
retired: 2015-02-24T12:00:00+00:00
modified: 2021-12-21T12:00:00+00:00
broader: Boxning

Tung fjädervikt, (Boxning)
type: Concept
in scheme: mediatopic
created: 2009-10-22T02:00:00+00:00
retired: 2015-02-24T12:00:00+00:00
modified: 2021-12-21T12:00:00+00:00
broader: Boxning

Tung flugvikt, (Boxning)
type: Concept
in scheme: mediatopic
created: 2009-10-22T02:00:00+00:00
retired: 2015-02-24T12:00:00+00:00
modified: 2021-12-21T12:00:00+00:00
broader: Boxning

Supertungvikt, (Boxning)
type: Concept
in scheme: mediatopic
created: 2009-10-22T02:00:00+00:00
retired: 2015-02-24T12:00:00+00:00
modified: 2021-12-21T12:00:00+00:00
broader: Boxning

Tung mellanvikt, (Boxning)
type: Concept
in scheme: mediatopic
created: 2009-10-22T02:00:00+00:00
retired: 2015-02-24T12:00:00+00:00
modified: 2021-12-21T12:00:00+00:00
broader: Boxning

Weltervikt, (Boxning)
type: Concept
in scheme: mediatopic
created: 2009-10-22T02:00:00+00:00
retired: 2015-02-24T12:00:00+00:00
modified: 2021-12-21T12:00:00+00:00
broader: Boxning

C1
type: Concept
in scheme: mediatopic
created: 2009-10-22T02:00:00+00:00
retired: 2015-02-24T12:00:00+00:00
modified: 2021-12-21T12:00:00+00:00
broader: Kanot (kanadensare)

C2
type: Concept
in scheme: mediatopic
created: 2009-10-22T02:00:00+00:00
retired: 2015-02-24T12:00:00+00:00
modified: 2021-12-21T12:00:00+00:00
broader: Kanot (kanadensare)

C4
type: Concept
in scheme: mediatopic
created: 2009-10-22T02:00:00+00:00
retired: 2015-02-24T12:00:00+00:00
modified: 2021-12-21T12:00:00+00:00
broader: Kanot (kanadensare)
broad match: http://cv.iptc.org/newscodes/subjectcode/15015010

Kanotsegling
type: Concept
definition: Tävling med kanoter där kanoterna är utrustade med segel.
in scheme: mediatopic
created: 2009-10-22T02:00:00+00:00
retired: 2017-07-04T12:00:00+00:00
modified: 2021-05-05T12:00:00+00:00
broader: Kanot (kanadensare)

Pontonering
type: Concept
definition: Båtsport i lag med militära traditioner.
in scheme: mediatopic
created: 2009-10-22T02:00:00+00:00
retired: 2017-07-04T12:00:00+00:00
modified: 2021-02-18T12:00:00+00:00
broader: Kanot (kanadensare)

Isklättring
type: Concept
definition: Tävlingar i att ta sig uppför frusna vattenfall eller klippor där vattnet frusit.
in scheme: mediatopic
created: 2009-10-22T02:00:00+00:00
modified: 2021-02-18T12:00:00+00:00
broader: Klättring
broad match: http://cv.iptc.org/newscodes/subjectcode/15016000

Bergsklättring
type: Concept
definition: Tävlingar i att klättra uppför berg. Olika leder och svårighetsgrader.
in scheme: mediatopic
created: 2009-10-22T02:00:00+00:00
modified: 2023-10-02T12:00:00+00:00
broader: Klättring

Isstock
type: Concept
definition: Påminner om curling men i stället för stenar är det en platta med rakt handtag. Spelas mest i Mellaneuropa kring Alperna.
in scheme: mediatopic
created: 2009-10-22T02:00:00+00:00
modified: 2021-02-18T12:00:00+00:00
broader: Curling

Konstcykling
type: Concept
definition: Individuell eller lagtävling där de tävlande gör olika trick som bedöms av domare.
in scheme: mediatopic
created: 2009-10-22T02:00:00+00:00
modified: 2021-02-18T12:00:00+00:00
broader: Cykel

Hinderbana
type: Concept
definition: Cykeltävling där de tävlande ska passera en bana med hinder så fort som möjligt
in scheme: mediatopic
created: 2009-10-22T02:00:00+00:00
retired: 2017-07-04T12:00:00+00:00
modified: 2021-02-18T12:00:00+00:00
broader: Cykel

BMX
type: Concept
definition: Cykeltävling med en speciell typ av cykel, en så kallad BMX-cykel, som utövas på en bana liknande en motocrossbana med olika typer av hopp och doserade kurvor.
in scheme: mediatopic
created: 2009-10-22T02:00:00+00:00
modified: 2021-07-12T12:00:00+00:00
broader: Cykel
has facet: bmxfreestyletype
broad match: http://cv.iptc.org/newscodes/subjectcode/15019000

Cykelboll
type: Concept
definition: Bollsport där de tävlande sitter på cyklar och försöker flytta bollen med cykelns hjul utan att sätta ner fötterna i marken.
in scheme: mediatopic
created: 2009-10-22T02:00:00+00:00
modified: 2021-02-18T12:00:00+00:00
broader: Cykel

Sprint
type: Concept
definition: Två tävlande i taget kör två eller tre varv på en bana och tiden tas de sista 200 meterna.
in scheme: mediatopic
created: 2009-10-22T02:00:00+00:00
retired: 2017-07-04T12:00:00+00:00
modified: 2021-02-18T12:00:00+00:00
broader: Cykel

Cykelcross
type: Concept
definition: Cykeltävling på bana där flera varv körs. Banan ska ha olika typer av terräng och lutning och även ha en betydande del hinder där cyklisten måste bära cykeln.
in scheme: mediatopic
created: 2009-10-22T02:00:00+00:00
retired: 2017-07-04T12:00:00+00:00
modified: 2021-02-18T12:00:00+00:00
broader: Cykel

Förföljelselopp, individuellt
type: Concept
definition: Tävlande startar på motsatt sida av rundbanan. Om någon hinner ikapp motståndaren är loppet slut, annars vinner bästa tid.
in scheme: mediatopic
created: 2009-10-22T02:00:00+00:00
retired: 2017-07-04T12:00:00+00:00
modified: 2021-02-18T12:00:00+00:00
broader: Cykel

Termpolopp
type: Concept
definition: En tävlingsform där de deltagande cyklisterna startar med ett visst tidsintervall för att i kamp mot klockan tillryggalägga en sträcka som är kortare än vid linjelopp. Den cyklist som vid målgång förbrukat minst tid blir vinnare.
in scheme: mediatopic
created: 2009-10-22T02:00:00+00:00
retired: 2017-07-04T12:00:00+00:00
modified: 2021-02-18T12:00:00+00:00
broader: Cykel

Keirin
type: Concept
definition: De tävlande startar bakom en apparat som håller farten och sakta ökar den. Med några hundra meter kvar kör farthållaren undan och loppet avgörs i en spurt.
in scheme: mediatopic
created: 2009-10-22T02:00:00+00:00
retired: 2017-07-04T12:00:00+00:00
modified: 2021-02-18T12:00:00+00:00
broader: Cykel

Madison
type: Concept
definition: Partävling där de två cyklisterna turas om att cykla fort medan den andra vilar cyklande ovanför en markerad linje. Under loppet är det inlagda sprinter som ger bonuspoäng.
in scheme: mediatopic
created: 2009-10-22T02:00:00+00:00
retired: 2017-07-04T12:00:00+00:00
modified: 2021-02-18T12:00:00+00:00
broader: Cykel

Mountainbike
type: Concept
definition: Terrängcykling med speciella cyklar, bygger på uthållighet.
in scheme: mediatopic
created: 2009-10-22T02:00:00+00:00
modified: 2021-02-18T12:00:00+00:00
broader: Cykel
has facet: mountainbikingtype
broad match: http://cv.iptc.org/newscodes/subjectcode/15019015

Poängrace
type: Concept
definition: Masstartslopp där cyklisterna samlar poäng i de regelbundna spurterna. Man kan även få poäng genom att varva klungan.
in scheme: mediatopic
created: 2009-10-22T02:00:00+00:00
retired: 2017-07-04T12:00:00+00:00
modified: 2021-02-18T12:00:00+00:00
broader: Cykel

Landsvägscykling
type: Concept
definition: Cykeltävling på landsväg med masstart.
in scheme: mediatopic
created: 2009-10-22T02:00:00+00:00
retired: 2017-07-04T12:00:00+00:00
modified: 2024-07-01T12:00:00+00:00
broader: Cykel

Etapplopp
type: Concept
definition: Cykeltävlingar som avgörs över ett antal etapper under flera dagar. Tiderna adderas från varje dags tävling och den som har lägst tid när alla etapper körts vinner.
in scheme: mediatopic
created: 2009-10-22T02:00:00+00:00
retired: 2017-07-04T12:00:00+00:00
modified: 2021-05-05T12:00:00+00:00
broader: Cykel

Lagsprint
type: Concept
definition: Cykeltävling på bana där lagen åker i en rak formation efter varandra, på vardera sida av velodromen. Varje förare i ett lag åker ett varv längst fram för att sedan köra ut mot sidan. Inför det sista varvet åker den siste föraren i vardera lag ensam in mot sin mållinje.
in scheme: mediatopic
created: 2009-10-22T02:00:00+00:00
retired: 2017-07-04T12:00:00+00:00
modified: 2021-02-18T12:00:00+00:00
broader: Cykel
broad match: http://cv.iptc.org/newscodes/subjectcode/15019000

Förföljelselopp, lag
type: Concept
definition: Tävlande lag startar på motsatt sida av rundbanan. Om något lag hinner ikapp motståndarlaget är loppet slut, annars vinner bästa tid.
in scheme: mediatopic
created: 2009-10-22T02:00:00+00:00
retired: 2017-07-04T12:00:00+00:00
modified: 2021-02-18T12:00:00+00:00
broader: Cykel
broad match: http://cv.iptc.org/newscodes/subjectcode/15019000

Lagtempolopp
type: Concept
definition: En tävlingsform där de deltagande lagen startar med ett visst tidsintervall för att i kamp mot klockan tillryggalägga en sträcka som är kortare än vid linjelopp. Det lag som vid målgång förbrukat minst tid blir vinnare.
in scheme: mediatopic
created: 2009-10-22T02:00:00+00:00
retired: 2017-07-04T12:00:00+00:00
modified: 2021-02-18T12:00:00+00:00
broader: Cykel
broad match: http://cv.iptc.org/newscodes/subjectcode/15019000

Bancykel
type: Concept
definition: Cykeltävling på en oval bana som är kraftigt doserad och medger hög fart även i kurvorna.
in scheme: mediatopic
created: 2009-10-22T02:00:00+00:00
retired: 2017-07-04T12:00:00+00:00
modified: 2021-02-18T12:00:00+00:00
broader: Cykel

BMX freestyle
type: Concept
in scheme: mediatopic
created: 2021-07-12T12:00:00+00:00
modified: 2024-03-28T12:00:00+00:00
broader: Cykel

Breaking
type: Concept
definition: Tävlingsdans med ursprung i breakdance
in scheme: mediatopic
created: 2024-05-09T12:00:00+00:00
modified: 2024-05-09T12:00:00+00:00
broader: Danssport

Höga hopp
type: Concept
definition: Simhopp från hög höjd, vanligen 10 meter.
in scheme: mediatopic
created: 2009-10-22T02:00:00+00:00
modified: 2021-02-18T12:00:00+00:00
broader: Simhopp
has facet: platformheight
broad match: http://cv.iptc.org/newscodes/subjectcode/15021000

Svikthopp
type: Concept
definition: Simhopp från trampolin, vanligen från 1, 3 eller 5 meters höjd.
in scheme: mediatopic
created: 2009-10-22T02:00:00+00:00
modified: 2021-02-18T12:00:00+00:00
broader: Simhopp
has facet: platformheight
broad match: http://cv.iptc.org/newscodes/subjectcode/15021000

Synkro
type: Concept
definition: Två tävlande hoppar från varsin plats och försöker göra samma hopp samtidigt. Poäng både för hoppets utförande och synkroniseringen.
in scheme: mediatopic
created: 2009-10-22T02:00:00+00:00
modified: 2021-02-18T12:00:00+00:00
broader: Simhopp
broad match: http://cv.iptc.org/newscodes/subjectcode/15021004
has facet: platformheight

Hundkapplöpning
type: Concept
definition: Tävlingslopp där hundar jagar en artificiell kanin runt en oval bana.
in scheme: mediatopic
created: 2009-10-22T02:00:00+00:00
retired: 2017-07-04T12:00:00+00:00
modified: 2021-02-18T12:00:00+00:00
broader: Hundsport

Draghundsport
type: Concept
definition: Tävlingslopp där hundar drar en släde.
in scheme: mediatopic
created: 2009-10-22T02:00:00+00:00
retired: 2017-07-04T12:00:00+00:00
modified: 2021-02-18T12:00:00+00:00
broader: Hundsport

Terrängritt
type: Concept
definition: Hästtävling på en bana i naturen där det finns både naturliga och konstruerade hinder.
in scheme: mediatopic
created: 2009-10-22T02:00:00+00:00
retired: 2017-07-04T12:00:00+00:00
modified: 2021-05-05T12:00:00+00:00
broader: Ridsport

Dressyr
type: Concept
definition: Hästtävling där olika rörelser ska utföras på en bana och sedan bedömas av domare.
in scheme: mediatopic
created: 2009-10-22T02:00:00+00:00
retired: 2017-07-04T12:00:00+00:00
modified: 2021-02-18T12:00:00+00:00
broader: Ridsport

Hästhoppning
type: Concept
definition: Hästtävling i en arena där det finns ett antal hinder med olika svårighet. Det gäller att klara banan på så kort tid som möjligt, men om det sker rivningar så ger det tidstillägg.
in scheme: mediatopic
created: 2009-10-22T02:00:00+00:00
retired: 2017-07-04T12:00:00+00:00
modified: 2021-02-18T12:00:00+00:00
broader: Ridsport

Fälttävlan
type: Concept
definition: Kombinationstävling med häst och ryttare. Grenarna är dressyr, fältritt och hoppning.
in scheme: mediatopic
created: 2009-10-22T02:00:00+00:00
retired: 2017-07-04T12:00:00+00:00
modified: 2021-02-18T12:00:00+00:00
broader: Ridsport

Sportkörning
type: Concept
definition: Hästtävling där ett ekipage med en eller flera hästar ska ta sig runt en hinderbana i en arena.
in scheme: mediatopic
created: 2009-10-22T02:00:00+00:00
retired: 2017-07-04T12:00:00+00:00
modified: 2021-02-18T12:00:00+00:00
broader: Ridsport
broad match: http://cv.iptc.org/newscodes/subjectcode/15022000

Värja
type: Concept
definition: Värja är den tyngsta och största av fäktredskapen, bladet är trekantigt och man försöker träffa motståndaren genom att stöta värjan framåt.
in scheme: mediatopic
created: 2009-10-22T02:00:00+00:00
retired: 2017-07-04T12:00:00+00:00
modified: 2021-07-12T12:00:00+00:00
broader: Fäktning

Florett
type: Concept
definition: Florett skapades som ett träningsvapen. Strikta regler för hur attacker måste avvärjas innan motattack får ske.
in scheme: mediatopic
created: 2009-10-22T02:00:00+00:00
retired: 2017-07-04T12:00:00+00:00
modified: 2021-02-18T12:00:00+00:00
broader: Fäktning

Sabel
type: Concept
definition: En sabel för tävling har inget gemensamt med traditionella bilder av sablar. I fäktningstävling med sabel kan man både stöta och hugga.
in scheme: mediatopic
created: 2009-10-22T02:00:00+00:00
retired: 2017-07-04T12:00:00+00:00
modified: 2021-02-18T12:00:00+00:00
broader: Fäktning

Isdans
type: Concept
definition: Tredagarstävling där de tävlande gör obligatoriska saker två dagar och frivilligt program tredje dagen.
in scheme: mediatopic
created: 2009-10-22T02:00:00+00:00
retired: 2017-07-04T12:00:00+00:00
modified: 2021-02-18T12:00:00+00:00
broader: Konståkning

Bangolf
type: Concept
definition: Spelas på konstgjorda korta banor med hinder. Spelarna har en klubba liknande puttern i vanlig golf och olika bollar med olika egenskaper. Normalt 18 banor på en runda.
in scheme: mediatopic
created: 2009-10-22T02:00:00+00:00
modified: 2021-02-18T12:00:00+00:00
broader: Golf

Rytmisk sportgymnastik
type: Concept
definition: De tävlande utför olika rörelser och bedöms av domare. Både individuellt och i trupp,med fem olika handredskap (band, boll, käglor, rep och tunnband) och fristående (utan redskap).
in scheme: mediatopic
created: 2009-10-22T02:00:00+00:00
modified: 2021-02-18T12:00:00+00:00
broader: Gymnastik
narrower: Boll
narrower: Käglor
narrower: Tunnband
narrower: Band
narrower: Rep
has facet: rhythmgymtype

Trampolin
type: Concept
definition: De tävlande ska hoppa på en en studsmatta och på den utföra tio stycken övningar (trick) i följd. Bedöms av domare.
in scheme: mediatopic
created: 2009-10-22T02:00:00+00:00
modified: 2021-02-18T12:00:00+00:00
broader: Gymnastik

Artistisk gymnastik
type: Concept
definition: De tävlande utför rörelser på olika redskap och bedöms av domare.
in scheme: mediatopic
created: 2014-04-11T12:00:00+00:00
modified: 2021-07-12T12:00:00+00:00
broader: Gymnastik
narrower: Bom
narrower: Fristående
narrower: Räck
narrower: Barr, herrar
narrower: Bygelhäst
narrower: Ringar
narrower: Barr, damer
narrower: Hopp
has facet: artisticgymtype

Boll
type: Concept
in scheme: mediatopic
created: 2009-10-22T02:00:00+00:00
retired: 2015-02-24T12:00:00+00:00
modified: 2021-12-21T12:00:00+00:00
broader: Rytmisk sportgymnastik

Bom
type: Concept
in scheme: mediatopic
created: 2009-10-22T02:00:00+00:00
retired: 2015-02-24T12:00:00+00:00
modified: 2021-12-21T12:00:00+00:00
broader: Artistisk gymnastik

Käglor
type: Concept
in scheme: mediatopic
created: 2009-10-22T02:00:00+00:00
retired: 2015-02-24T12:00:00+00:00
modified: 2021-12-21T12:00:00+00:00
broader: Rytmisk sportgymnastik

Fristående
type: Concept
in scheme: mediatopic
created: 2009-10-22T02:00:00+00:00
retired: 2015-02-24T12:00:00+00:00
modified: 2021-12-21T12:00:00+00:00
broader: Artistisk gymnastik

Tunnband
type: Concept
in scheme: mediatopic
created: 2009-10-22T02:00:00+00:00
retired: 2015-02-24T12:00:00+00:00
modified: 2021-12-21T12:00:00+00:00
broader: Rytmisk sportgymnastik

Räck
type: Concept
in scheme: mediatopic
created: 2009-10-22T02:00:00+00:00
retired: 2015-02-24T12:00:00+00:00
modified: 2021-12-21T12:00:00+00:00
broader: Artistisk gymnastik

Barr, herrar
type: Concept
in scheme: mediatopic
created: 2009-10-22T02:00:00+00:00
retired: 2015-02-24T12:00:00+00:00
modified: 2021-12-21T12:00:00+00:00
broader: Artistisk gymnastik

Bygelhäst
type: Concept
in scheme: mediatopic
created: 2009-10-22T02:00:00+00:00
retired: 2015-02-24T12:00:00+00:00
modified: 2021-12-21T12:00:00+00:00
broader: Artistisk gymnastik

Band
type: Concept
in scheme: mediatopic
created: 2009-10-22T02:00:00+00:00
retired: 2015-02-24T12:00:00+00:00
modified: 2021-12-21T12:00:00+00:00
broader: Rytmisk sportgymnastik

Rep
type: Concept
in scheme: mediatopic
created: 2009-10-22T02:00:00+00:00
retired: 2015-02-24T12:00:00+00:00
modified: 2021-12-21T12:00:00+00:00
broader: Rytmisk sportgymnastik

Ringar
type: Concept
in scheme: mediatopic
created: 2009-10-22T02:00:00+00:00
retired: 2015-02-24T12:00:00+00:00
modified: 2021-12-21T12:00:00+00:00
broader: Artistisk gymnastik

Barr, damer
type: Concept
in scheme: mediatopic
created: 2009-10-22T02:00:00+00:00
retired: 2015-02-24T12:00:00+00:00
modified: 2021-12-21T12:00:00+00:00
broader: Artistisk gymnastik

Hopp
type: Concept
in scheme: mediatopic
created: 2009-10-22T02:00:00+00:00
retired: 2015-02-24T12:00:00+00:00
modified: 2021-12-21T12:00:00+00:00
broader: Artistisk gymnastik

Flat racing
type: Concept
definition: Hästtävlingar på platt mark utan hinder där loppen kan vara olika längd från 400 meter till flera kilometer.
in scheme: mediatopic
created: 2009-10-22T02:00:00+00:00
retired: 2017-07-04T12:00:00+00:00
modified: 2021-02-18T12:00:00+00:00
broader: Galopp

Trav
type: Concept
definition: Hästtävlingar med människan i en liten vagn bakom hästen. Hästen får inte galoppera.
in scheme: mediatopic
created: 2009-10-22T02:00:00+00:00
retired: 2017-07-04T12:00:00+00:00
modified: 2021-02-18T12:00:00+00:00
broader: Galopp

Steeplechase
type: Concept
definition: Hästtävling där ryttare och hästar och ska över åtta hinder, varav minst fyra ska vara olika.
in scheme: mediatopic
created: 2009-10-22T02:00:00+00:00
retired: 2017-07-04T12:00:00+00:00
modified: 2021-02-18T12:00:00+00:00
broader: Galopp

Kälkhockey
type: Concept
definition: Lagidrott som liknar ishockey, men spelarna sitter på en liten kälke och tar sig fram med kraft från armarna.
in scheme: mediatopic
created: 2009-10-22T02:00:00+00:00
modified: 2021-02-18T12:00:00+00:00
broader: Ishockey

Judo
type: Concept
definition: Judo har utvecklats från jujutsu men har inga sparkar och slag utan är mer en försvarsteknik med kast och balans.
in scheme: mediatopic
created: 2009-10-22T02:00:00+00:00
modified: 2021-02-18T12:00:00+00:00
broader: Kampsport
narrower: Extra lättvikt, (Judo)
narrower: Halv tungvikt, (Judo)
narrower: Halv lättvikt, (Judo)
narrower: Halv mellanvikt, (Judo)
narrower: Tungvikt, (Judo)
narrower: Lättvikt, (Judo)
narrower: Mellanvikt
has facet: weightclasstype

Extra lättvikt, (Judo)
type: Concept
in scheme: mediatopic
created: 2009-10-22T02:00:00+00:00
retired: 2015-02-24T12:00:00+00:00
modified: 2021-12-21T12:00:00+00:00
broader: Judo

Halv tungvikt, (Judo)
type: Concept
in scheme: mediatopic
created: 2009-10-22T02:00:00+00:00
retired: 2015-02-24T12:00:00+00:00
modified: 2021-12-21T12:00:00+00:00
broader: Judo

Halv lättvikt, (Judo)
type: Concept
in scheme: mediatopic
created: 2009-10-22T02:00:00+00:00
retired: 2015-02-24T12:00:00+00:00
modified: 2021-12-21T12:00:00+00:00
broader: Judo

Halv mellanvikt, (Judo)
type: Concept
in scheme: mediatopic
created: 2009-10-22T02:00:00+00:00
retired: 2015-02-24T12:00:00+00:00
modified: 2021-12-21T12:00:00+00:00
broader: Judo

Tungvikt, (Judo)
type: Concept
in scheme: mediatopic
created: 2009-10-22T02:00:00+00:00
retired: 2015-02-24T12:00:00+00:00
modified: 2021-12-21T12:00:00+00:00
broader: Judo

Lättvikt, (Judo)
type: Concept
in scheme: mediatopic
created: 2009-10-22T02:00:00+00:00
retired: 2015-02-24T12:00:00+00:00
modified: 2021-12-21T12:00:00+00:00
broader: Judo

Mellanvikt
type: Concept
in scheme: mediatopic
created: 2009-10-22T02:00:00+00:00
retired: 2015-02-24T12:00:00+00:00
modified: 2021-12-21T12:00:00+00:00
broader: Judo

Jukendo
type: Concept
definition: Traditionell japansk stridskonst där vapnet utgörs av en modell av ett bajonettförsett gevär.
in scheme: mediatopic
created: 2009-10-22T02:00:00+00:00
modified: 2021-02-18T12:00:00+00:00
broader: Kampsport

K1
type: Concept
in scheme: mediatopic
created: 2009-10-22T02:00:00+00:00
retired: 2015-02-24T12:00:00+00:00
modified: 2021-12-21T12:00:00+00:00
broader: Kanot (kajak)

K2
type: Concept
in scheme: mediatopic
created: 2009-10-22T02:00:00+00:00
retired: 2015-02-24T12:00:00+00:00
modified: 2021-12-21T12:00:00+00:00
broader: Kanot (kajak)

K4
type: Concept
in scheme: mediatopic
created: 2009-10-22T02:00:00+00:00
retired: 2015-02-24T12:00:00+00:00
modified: 2021-12-21T12:00:00+00:00
broader: Kanot (kajak)

Karate
type: Concept
definition: Stridskonst ursprungligen från Okinawa, där främst slag och sparkar används för att besegra en motståndare.
in scheme: mediatopic
created: 2009-10-22T02:00:00+00:00
modified: 2021-02-18T12:00:00+00:00
broader: Kampsport

Kendo
type: Concept
definition: Japansk stridskonst där vapnet är ett *svärd* av bambu.
in scheme: mediatopic
created: 2009-10-22T02:00:00+00:00
modified: 2021-03-15T12:00:00+00:00
broader: Kampsport

Japanskt bågskytte
type: Concept
definition: Japansk stridskonst med en pilbåge gjord av bambu.
in scheme: mediatopic
created: 2009-10-22T02:00:00+00:00
modified: 2021-02-18T12:00:00+00:00
broader: Kampsport

Endurance
type: Concept
definition: Motorburet uthållighetslopp över lång distans eller tid.
in scheme: mediatopic
created: 2009-10-22T02:00:00+00:00
retired: 2017-07-04T12:00:00+00:00
modified: 2021-02-18T12:00:00+00:00
broader: Motorsport

F3000
type: Concept
definition: Fungerar som F1 men med mindre starka motorer.
in scheme: mediatopic
created: 2009-10-22T02:00:00+00:00
retired: 2017-07-04T12:00:00+00:00
modified: 2021-02-18T12:00:00+00:00
broader: Motorsport

F1
type: Concept
definition: Motortävling med bilar med de största motorerna. Cirka 20 bilar per lopp. Startposition erhålls genom bra träningstider dagarna före loppet. Både en individuell tävling och en lagtävling.
in scheme: mediatopic
created: 2009-10-22T02:00:00+00:00
retired: 2017-07-04T12:00:00+00:00
modified: 2021-02-18T12:00:00+00:00
broader: Motorsport

Indy
type: Concept
definition: Nordamerikansk motsvarighet till F1. Loppen går på ovaler i höga hastigheter.
in scheme: mediatopic
created: 2009-10-22T02:00:00+00:00
retired: 2017-07-04T12:00:00+00:00
modified: 2021-02-18T12:00:00+00:00
broader: Motorsport

Rallycross
type: Concept
definition: Motortävlingar med bilar som ser mer ut som vanliga bilar. Tävlingen sker på grusbanor med nivåskillnader.
in scheme: mediatopic
created: 2009-10-22T02:00:00+00:00
retired: 2017-07-04T12:00:00+00:00
modified: 2021-02-18T12:00:00+00:00
broader: Motorsport

Rally
type: Concept
definition: Rally körs med bilar som har förare och kartläsare, på allmäna men avstängda vägar. Varje tävling har flera etapper och underlaget varierar beroende på plats och årstid. Deltävlingarna räknas ihop till ett mästerskap.
in scheme: mediatopic
created: 2009-10-22T02:00:00+00:00
retired: 2017-07-04T12:00:00+00:00
modified: 2021-02-18T12:00:00+00:00
broader: Motorsport

Endurance, mc
type: Concept
definition: Motortävling där uthållighet och taktik med depåstopp är mer avgörande än farten. Ofta väldigt långa lopp så lagen byter förare vid olika intervall.
in scheme: mediatopic
created: 2009-10-22T02:00:00+00:00
retired: 2017-07-04T12:00:00+00:00
modified: 2021-02-18T12:00:00+00:00
broader: MC-sport

Enduro
type: Concept
definition: Uthållighetstävling på motorcykel, ofta med svår terräng.
in scheme: mediatopic
created: 2009-10-22T02:00:00+00:00
retired: 2017-07-04T12:00:00+00:00
modified: 2021-02-18T12:00:00+00:00
broader: MC-sport

Grasstrack
type: Concept
definition: Påminner om speedway men sker på gräsbanor.
in scheme: mediatopic
created: 2009-10-22T02:00:00+00:00
retired: 2017-07-04T12:00:00+00:00
modified: 2021-02-18T12:00:00+00:00
broader: MC-sport

Motorcykelpolo
type: Concept
definition: Liknande fotboll, men utespelarna åker motorcykel. Målvakterna har ingen motorcykel.
in scheme: mediatopic
created: 2009-10-22T02:00:00+00:00
retired: 2017-07-04T12:00:00+00:00
modified: 2021-02-18T12:00:00+00:00
broader: MC-sport

Motocross
type: Concept
definition: Motorcykeltävling runt en bana med grus och kraftiga hopp.
in scheme: mediatopic
created: 2009-10-22T02:00:00+00:00
retired: 2017-07-04T12:00:00+00:00
modified: 2021-02-18T12:00:00+00:00
broader: MC-sport

Roadracing
type: Concept
definition: Motorcykeltävling på asfaltsbana, ofta samma banor som används för motsvarande biltävlingar.
in scheme: mediatopic
created: 2009-10-22T02:00:00+00:00
retired: 2017-07-04T12:00:00+00:00
modified: 2021-02-18T12:00:00+00:00
broader: MC-sport

Motorcykelrally
type: Concept
definition: Ta sig på motorcykel till olika punkter, i Sverige ofta som en kortege och inte så mycket tävling.
in scheme: mediatopic
created: 2009-10-22T02:00:00+00:00
retired: 2017-07-04T12:00:00+00:00
modified: 2021-02-18T12:00:00+00:00
broader: MC-sport

Sidvagn
type: Concept
definition: Motorcykeltävling där motorcykeln har en sidvagn monterad och en passagerare hjälper till att hålla balans.
in scheme: mediatopic
created: 2009-10-22T02:00:00+00:00
retired: 2017-07-04T12:00:00+00:00
modified: 2021-05-05T12:00:00+00:00
broader: MC-sport

Speedway
type: Concept
definition: Motorcykeltävling på en oval bana med normalt fyra tävlande per heat. En tävling består av flera heat där varje åkare är med i några av heaten. Det tävlas både individuellt och i lag. Motorcyklarna har bara en växel och ingen broms.
in scheme: mediatopic
created: 2009-10-22T02:00:00+00:00
retired: 2017-07-04T12:00:00+00:00
modified: 2021-02-18T12:00:00+00:00
broader: MC-sport

Trial
type: Concept
definition: Motorcykeltävling över avancerade hinder där snabbast tid vinner och där fotisättningar ger tidstillägg.
in scheme: mediatopic
created: 2009-10-22T02:00:00+00:00
retired: 2017-07-04T12:00:00+00:00
modified: 2021-02-18T12:00:00+00:00
broader: MC-sport

Naginata
type: Concept
definition: Japansk stridskonst där vapnet är en stång med en vass klinga i änden.
in scheme: mediatopic
created: 2009-10-22T02:00:00+00:00
modified: 2021-02-18T12:00:00+00:00
broader: Kampsport

Skidorientering
type: Concept
definition: Fungerar som orientering på barmark med den skillnaden att de tävlande har skidor på fötterna. Med hjälp av karta och kompass ska åkaren hitta fram till ett antal kontroller.
in scheme: mediatopic
created: 2009-10-22T02:00:00+00:00
modified: 2021-02-18T12:00:00+00:00
broader: Orientering

Sadellös inridning av hästar
type: Concept
definition: Ridning på en sadellös häst, som försöker kasta av ryttaren, från början skapad för att hästar måste ridas in av den yrkesutövande cowboyen.
in scheme: mediatopic
created: 2009-10-22T02:00:00+00:00
modified: 2021-07-12T12:00:00+00:00
broader: Rodeo

Barrel racing
type: Concept
definition: Tävling där ryttaren rider sin häst på en bana på tid.
in scheme: mediatopic
created: 2009-10-22T02:00:00+00:00
modified: 2021-07-12T12:00:00+00:00
broader: Rodeo

Tjurridning
type: Concept
definition: Tävling där ryttaren rider på en tjur.
in scheme: mediatopic
created: 2009-10-22T02:00:00+00:00
modified: 2021-07-12T12:00:00+00:00
broader: Rodeo

Steer wrestling
type: Concept
definition: Tävling där ryttaren hoppar från sin häst och brottar ned en ungtjur genom att ta tag i dess horn.
in scheme: mediatopic
created: 2009-10-22T02:00:00+00:00
modified: 2021-07-12T12:00:00+00:00
broader: Rodeo

Lasso (kalvar)
type: Concept
definition: Infångning av kalvar med hjälp av en lasso, från början skapad för att fånga in kalvar för märkning och dylikt.
in scheme: mediatopic
created: 2009-10-22T02:00:00+00:00
modified: 2021-07-12T12:00:00+00:00
broader: Rodeo

Lasso (getter)
type: Concept
definition: Infångning av getter med hjälp av en lasso, från början skapad för att fånga in getter för märkning och dylikt.
in scheme: mediatopic
created: 2009-10-22T02:00:00+00:00
modified: 2021-07-12T12:00:00+00:00
broader: Rodeo

Inridning (med sadel) av hästar
type: Concept
definition: Ridning på en sadelförsedd häst, som försöker kasta av ryttaren, från början skapad för att hästar måste ridas in av den yrkesutövande cowboyen.
in scheme: mediatopic
created: 2009-10-22T02:00:00+00:00
modified: 2021-07-12T12:00:00+00:00
broader: Rodeo

Inlinehockey
type: Concept
definition: Själva spelet är som ishockey men de tävlande har rullskridskor (inlines) och underlaget är inte is.
in scheme: mediatopic
created: 2009-10-22T02:00:00+00:00
modified: 2021-02-18T12:00:00+00:00
broader: Rullskridskosport

Fyra med styrman
type: Concept
in scheme: mediatopic
created: 2009-10-22T02:00:00+00:00
retired: 2015-02-24T12:00:00+00:00
modified: 2021-12-21T12:00:00+00:00
broader: Rodd
broad match: http://cv.iptc.org/newscodes/subjectcode/15047000

Tvåa med styrman
type: Concept
in scheme: mediatopic
created: 2009-10-22T02:00:00+00:00
retired: 2015-02-24T12:00:00+00:00
modified: 2021-12-21T12:00:00+00:00
broader: Rodd
broad match: http://cv.iptc.org/newscodes/subjectcode/15047000

Fyra utan styrman
type: Concept
in scheme: mediatopic
created: 2009-10-22T02:00:00+00:00
retired: 2015-02-24T12:00:00+00:00
modified: 2021-12-21T12:00:00+00:00
broader: Rodd

Tvåa utan styrman
type: Concept
in scheme: mediatopic
created: 2009-10-22T02:00:00+00:00
retired: 2015-02-24T12:00:00+00:00
modified: 2021-12-21T12:00:00+00:00
broader: Rodd

Dubbelsculler
type: Concept
in scheme: mediatopic
created: 2009-10-22T02:00:00+00:00
retired: 2015-02-24T12:00:00+00:00
modified: 2021-12-21T12:00:00+00:00
broader: Rodd

Åttamanna
type: Concept
in scheme: mediatopic
created: 2009-10-22T02:00:00+00:00
retired: 2015-02-24T12:00:00+00:00
modified: 2021-12-21T12:00:00+00:00
broader: Rodd
broad match: http://cv.iptc.org/newscodes/subjectcode/15047006

Fyrsculler
type: Concept
in scheme: mediatopic
created: 2009-10-22T02:00:00+00:00
retired: 2015-02-24T12:00:00+00:00
modified: 2021-12-21T12:00:00+00:00
broader: Rodd

Singelsculler
type: Concept
in scheme: mediatopic
created: 2009-10-22T02:00:00+00:00
retired: 2015-02-24T12:00:00+00:00
modified: 2021-12-21T12:00:00+00:00
broader: Rodd

Rugby League
type: Concept
definition: Variant av rugby där två 13-mannalag spelar på en bana där de passar och springer med en oval boll. Poäng får lagen genom att placera bollen i motståndarnas målzon eller sparka den mellan målstolparna.
in scheme: mediatopic
created: 2009-10-22T02:00:00+00:00
modified: 2021-07-12T12:00:00+00:00
broader: Rugby

Rugby Union
type: Concept
definition: Variant av rugby där två 15-mannalag spelar på en bana där de passar och springer med en oval boll. Poäng får lagen genom att placera bollen i motståndarnas målzon eller sparka den mellan målstolparna.
in scheme: mediatopic
created: 2009-10-22T02:00:00+00:00
modified: 2021-02-18T12:00:00+00:00
broader: Rugby

Sjumannarugby
type: Concept
definition: Variant av rugby där två sjumannalag spelar på en bana där de passar och springer med en oval boll. Poäng får lagen genom att placera bollen i motståndarnas målzon eller sparka den mellan målstolparna.
in scheme: mediatopic
created: 2009-10-22T02:00:00+00:00
modified: 2021-07-12T12:00:00+00:00
broader: Rugby

Katamaran och trimaran
type: Concept
definition: Tävlingar med segelbåtar med flera skrov.
in scheme: mediatopic
created: 2009-10-22T02:00:00+00:00
retired: 2017-07-04T12:00:00+00:00
modified: 2021-05-05T12:00:00+00:00
broader: Segling

Jolle
type: Concept
definition: Tävlingar med en typ av segelbåt med centerbord i stället för fast köl.
in scheme: mediatopic
created: 2009-10-22T02:00:00+00:00
retired: 2017-07-04T12:00:00+00:00
modified: 2021-02-18T12:00:00+00:00
broader: Segling
broad match: http://cv.iptc.org/newscodes/subjectcode/15050013

Kölbåt
type: Concept
definition: Tävlingar med en typ av segelbåt där kölen helt består av eller innehåller ballast.
in scheme: mediatopic
created: 2009-10-22T02:00:00+00:00
retired: 2017-07-04T12:00:00+00:00
modified: 2021-05-05T12:00:00+00:00
broader: Segling
broad match: http://cv.iptc.org/newscodes/subjectcode/15050013

Regatta
type: Concept
definition: En enstaka eller en serie segeltävlingar.
in scheme: mediatopic
created: 2009-10-22T02:00:00+00:00
retired: 2017-07-04T12:00:00+00:00
modified: 2021-05-05T12:00:00+00:00
broader: Segling
broad match: http://cv.iptc.org/newscodes/subjectcode/15050000

Havskappsegling
type: Concept
definition: Segeltävlingar över en eller flera oceaner.
in scheme: mediatopic
created: 2009-10-22T02:00:00+00:00
retired: 2017-07-04T12:00:00+00:00
modified: 2021-05-05T12:00:00+00:00
broader: Segling
broad match: http://cv.iptc.org/newscodes/subjectcode/15050000

Världsomsegling
type: Concept
definition: Segeltävlingar runt jorden.
in scheme: mediatopic
created: 2009-10-22T02:00:00+00:00
retired: 2017-07-04T12:00:00+00:00
modified: 2021-05-05T12:00:00+00:00
broader: Segling

Ensamsegling
type: Concept
definition: Segeltävlingar där seglaren måste vara ensam.
in scheme: mediatopic
created: 2009-10-22T02:00:00+00:00
retired: 2017-07-04T12:00:00+00:00
modified: 2021-05-05T12:00:00+00:00
broader: Segling
broad match: http://cv.iptc.org/newscodes/subjectcode/15050000

Ensamsegling jorden runt
type: Concept
definition: Segeltävlingar runt jorden där seglaren måste vara ensam och inte får lägga till i någon hamn på vägen.
in scheme: mediatopic
created: 2009-10-22T02:00:00+00:00
retired: 2017-07-04T12:00:00+00:00
modified: 2021-02-18T12:00:00+00:00
broader: Segling
broad match: http://cv.iptc.org/newscodes/subjectcode/15050012

Pistol
type: Concept
definition: En sportskyttegren där man använder en pistol.
in scheme: mediatopic
created: 2009-10-22T02:00:00+00:00
retired: 2017-07-04T12:00:00+00:00
modified: 2021-02-18T12:00:00+00:00
broader: Sportskytte
broad match: http://cv.iptc.org/newscodes/subjectcode/15051001

Gevär
type: Concept
definition: En sportskyttegren där man använder ett gevär.
in scheme: mediatopic
created: 2009-10-22T02:00:00+00:00
retired: 2017-07-04T12:00:00+00:00
modified: 2021-05-05T12:00:00+00:00
broader: Sportskytte
broad match: http://cv.iptc.org/newscodes/subjectcode/15051002

Running target
type: Concept
definition: En sportskyttegren för luftpistol med rörliga mål på olika långa målbanor och med olika långa visningstider.
in scheme: mediatopic
created: 2009-10-22T02:00:00+00:00
retired: 2017-07-04T12:00:00+00:00
modified: 2021-05-05T12:00:00+00:00
broader: Sportskytte
broad match: http://cv.iptc.org/newscodes/subjectcode/15051003

Hagelgevär
type: Concept
definition: En sportskyttegren där man använder ett hagelgevär.
in scheme: mediatopic
created: 2009-10-22T02:00:00+00:00
retired: 2017-07-04T12:00:00+00:00
modified: 2021-05-05T12:00:00+00:00
broader: Sportskytte
broad match: http://cv.iptc.org/newscodes/subjectcode/15051004

Lerduveskytte
type: Concept
definition: En sportskyttegren för hagelgevär mot lerduvor, som kastats ut av en maskin eller för hand i disciplinerna skeet, trap och sporting.
in scheme: mediatopic
created: 2009-10-22T02:00:00+00:00
retired: 2017-07-04T12:00:00+00:00
modified: 2021-05-05T12:00:00+00:00
broader: Sportskytte
broad match: http://cv.iptc.org/newscodes/subjectcode/15051005

Alpint
type: Concept
definition: Tävling nedför snöklädda backar genom att använda alpin teknik och utrustning. Backarna har markerade portar som är utplacerade olika beroende på vilken sorts utförsåkning det gäller.
in scheme: mediatopic
created: 2009-10-22T02:00:00+00:00
modified: 2021-02-18T12:00:00+00:00
broader: Skidor
has facet: alpineskiingtype

Freestyle
type: Concept
definition: Alternativ form av skidtävling i alpin miljö. De tävlande åker puckelpist, gör konstnärliga hopp eller genomför konstnärliga rörelser på väg nedför backen. Kombination av tid och domarpoäng.
in scheme: mediatopic
created: 2009-10-22T02:00:00+00:00
modified: 2022-02-03T12:00:00+00:00
broader: Skidor
has facet: freestyleskiingtype

Grässkidåkning
type: Concept
definition: Alpin skidåkning med rullskidor på gräs.
in scheme: mediatopic
created: 2009-10-22T02:00:00+00:00
modified: 2021-02-18T12:00:00+00:00
broader: Skidor

Längdåkning, nordisk
type: Concept
definition: Skidåkning i preparerade spår av varierande distans genom olika terränger.
in scheme: mediatopic
created: 2009-10-22T02:00:00+00:00
retired: 2019-08-01T12:00:00+00:00
modified: 2021-02-18T12:00:00+00:00
broader: Skidor
has facet: nordicskiingtype

Backhoppning
type: Concept
definition: De tävlande åker nedför en ramp med speciella skidor på fötterna. De hoppar ut över en kant och försöker flyga så långt och kontrollerat som möjligt. Resultatet är en kombination av längd och domarsiffror.
in scheme: mediatopic
created: 2009-10-22T02:00:00+00:00
modified: 2021-02-18T12:00:00+00:00
broader: Skidor

Längdåkning
type: Concept
definition: Tävlingar med relativt smala skidor med eller utan valla. Loppen är av olika längd och i olika banprofiler, ibland som klassisk stil och ibland i fri stil. Finns även en sprintvariant med kval och sedan utslagsheat. Vissa lopp kan gå som stafett.
in scheme: mediatopic
created: 2014-01-17T12:00:00+00:00
modified: 2021-02-18T12:00:00+00:00
broader: Skidor

Nordisk kombination
type: Concept
definition: En kombination där de tävlande dels åker längdskidor och dels tävlar i backhoppning.
in scheme: mediatopic
created: 2014-01-20T12:00:00+00:00
modified: 2021-02-18T12:00:00+00:00
broader: Skidor

Telemark
type: Concept
definition: Norsk idrott där man använder bindningar där pjäxan endast sitter fast på skidan vid tårna och åker utför.
in scheme: mediatopic
created: 2014-11-07T12:00:00+00:00
modified: 2021-07-12T12:00:00+00:00
broader: Skidor

Skidalpinism
type: Concept
definition: En skidsport där utövarna bestiger berg med skidor, för att sedan åka utför.
in scheme: mediatopic
created: 2025-03-31T12:00:00+00:00
modified: 2025-03-31T12:00:00+00:00
broader: Skidor

http://cv.iptc.org/newscodes/mediatopic/20001393
type: Concept
in scheme: mediatopic
created: 2025-10-09T12:00:00+00:00
modified: 2025-10-09T12:00:00+00:00
broader: Fotboll

http://cv.iptc.org/newscodes/mediatopic/20001394
type: Concept
in scheme: mediatopic
created: 2025-10-09T12:00:00+00:00
modified: 2025-10-09T12:00:00+00:00
broader: Fotboll

Ryggsim
type: Concept
in scheme: mediatopic
created: 2009-10-22T02:00:00+00:00
retired: 2015-02-24T12:00:00+00:00
modified: 2021-12-21T12:00:00+00:00
broader: Simning
broad match: http://cv.iptc.org/newscodes/subjectcode/15062000

Bröstsim
type: Concept
in scheme: mediatopic
created: 2009-10-22T02:00:00+00:00
retired: 2015-02-24T12:00:00+00:00
modified: 2021-12-21T12:00:00+00:00
broader: Simning
broad match: http://cv.iptc.org/newscodes/subjectcode/15062000

Fjärilssim
type: Concept
in scheme: mediatopic
created: 2009-10-22T02:00:00+00:00
retired: 2015-02-24T12:00:00+00:00
modified: 2021-12-21T12:00:00+00:00
broader: Simning
broad match: http://cv.iptc.org/newscodes/subjectcode/15062000

Frisim
type: Concept
in scheme: mediatopic
created: 2009-10-22T02:00:00+00:00
retired: 2015-02-24T12:00:00+00:00
modified: 2021-12-21T12:00:00+00:00
broader: Simning

Medley
type: Concept
in scheme: mediatopic
created: 2009-10-22T02:00:00+00:00
retired: 2015-02-24T12:00:00+00:00
modified: 2021-12-21T12:00:00+00:00
broader: Simning
broad match: http://cv.iptc.org/newscodes/subjectcode/15062000

Öppet vatten
type: Concept
definition: Simtävling i öppet vatten.
in scheme: mediatopic
created: 2009-10-22T02:00:00+00:00
modified: 2021-07-12T12:00:00+00:00
broader: Simning
broad match: http://cv.iptc.org/newscodes/subjectcode/15062000

Kappsim, fritt
type: Concept
in scheme: mediatopic
created: 2009-10-22T02:00:00+00:00
retired: 2015-02-24T12:00:00+00:00
modified: 2021-12-21T12:00:00+00:00
broader: Simning
broad match: http://cv.iptc.org/newscodes/subjectcode/15062000

Kappsim, medley
type: Concept
in scheme: mediatopic
created: 2009-10-22T02:00:00+00:00
retired: 2015-02-24T12:00:00+00:00
modified: 2021-12-21T12:00:00+00:00
broader: Simning
broad match: http://cv.iptc.org/newscodes/subjectcode/15062000

Kort bana
type: Concept
in scheme: mediatopic
created: 2009-10-22T02:00:00+00:00
retired: 2015-02-24T12:00:00+00:00
modified: 2021-12-21T12:00:00+00:00
broader: Simning
broad match: http://cv.iptc.org/newscodes/subjectcode/15062000

Fria programmet
type: Concept
definition: Musiksimning där utövaren genomför rörelser till musik och får poäng av domare. Programmet är inte förutbestämt.
in scheme: mediatopic
created: 2009-10-22T02:00:00+00:00
modified: 2021-02-18T12:00:00+00:00
broader: Konstsim

Tekniska programmet
type: Concept
definition: Figursimning där utövaren ska genomföra en specifik serie rörelser och får poäng av domare.
in scheme: mediatopic
created: 2009-10-22T02:00:00+00:00
modified: 2021-02-18T12:00:00+00:00
broader: Konstsim

Taekwondo
type: Concept
definition: Kampsport med koreanskt ursprung. De tävlande ska med sparkar och slag träffa speciellt markerade platser på motståndaren. Slag och sparkar mot huvudet är förbjudet.
in scheme: mediatopic
created: 2009-10-22T02:00:00+00:00
modified: 2021-02-18T12:00:00+00:00
broader: Kampsport

Beachvolleyboll
type: Concept
definition: Själva spelet är som volleyboll, men spelas på sand med två personer i varje lag.
in scheme: mediatopic
created: 2009-10-22T02:00:00+00:00
modified: 2021-02-18T12:00:00+00:00
broader: Volleyboll

Stöt
type: Concept
definition: En variant av tyngdlyftning där man först lyfter till skulderhöjd och sedan stöter upp till raka armar och står kvar med raka ben.
in scheme: mediatopic
created: 2009-10-22T02:00:00+00:00
retired: 2017-07-04T12:00:00+00:00
modified: 2021-07-12T12:00:00+00:00
broader: Tyngdlyftning

Styrkelyft
type: Concept
definition: Påminner om traditionell tyngdlyftning men här tävlar man i stället i knäböj, bänkpress och marklyft. De tävlande har tre försök per gren. Högsta vikt per gren räknas.
in scheme: mediatopic
created: 2009-10-22T02:00:00+00:00
retired: 2017-07-04T12:00:00+00:00
modified: 2021-02-18T12:00:00+00:00
broader: Tyngdlyftning

Ryck
type: Concept
definition: En variant av tynglyftning där lyftet ska ske från marken till sträckta armar i en rörelse.
in scheme: mediatopic
created: 2009-10-22T02:00:00+00:00
retired: 2017-07-04T12:00:00+00:00
modified: 2021-07-12T12:00:00+00:00
broader: Tyngdlyftning

Fristil
type: Concept
definition: En variant av brottning där benen kan användas.
in scheme: mediatopic
created: 2009-10-22T02:00:00+00:00
modified: 2021-02-18T12:00:00+00:00
broader: Brottning

Grekisk-romersk stil
type: Concept
definition: En variant av brottning där man bara får ta grepp mellan midjan och huvudet.
in scheme: mediatopic
created: 2009-10-22T02:00:00+00:00
modified: 2021-02-18T12:00:00+00:00
broader: Brottning

Schwingen
type: Concept
definition: En schweizisk variant av brottning.
in scheme: mediatopic
created: 2009-10-22T02:00:00+00:00
modified: 2021-02-18T12:00:00+00:00
broader: Brottning

Wushu
type: Concept
definition: Kinesisk traditionell stridskonst.
in scheme: mediatopic
created: 2009-10-22T02:00:00+00:00
modified: 2021-02-18T12:00:00+00:00
broader: Kampsport

Dopning
type: Concept
definition: Olovlig användning av läkemedel för att öka prestationsförmågan inom en idrott.
in scheme: mediatopic
created: 2009-10-22T02:00:00+00:00
retired: 2022-09-23T12:00:00+00:00
modified: 2022-09-23T12:00:00+00:00
broader: Idrottsmedicin
broad match: http://cv.iptc.org/newscodes/subjectcode/15000000

Dopningskontroll
type: Concept
definition: Medel för att undersöka användning av lovliga och olovliga läkemedel inom idrotten.
in scheme: mediatopic
created: 2009-10-22T02:00:00+00:00
retired: 2022-09-23T12:00:00+00:00
modified: 2022-09-23T12:00:00+00:00
broader: Idrottsmedicin
broad match: http://cv.iptc.org/newscodes/subjectcode/15000000

Tillåtna läkemedel
type: Concept
definition: Användning av tillåtna läkemedel.
in scheme: mediatopic
created: 2009-10-22T02:00:00+00:00
retired: 2022-09-23T12:00:00+00:00
modified: 2022-09-23T12:00:00+00:00
broader: Idrottsmedicin
broad match: http://cv.iptc.org/newscodes/subjectcode/15000000

Kontinentala mästerskap
type: Concept
definition: Mästerskap där atleter eller lag från olika länder på en viss kontinent kan delta.
in scheme: mediatopic
created: 2009-10-22T02:00:00+00:00
retired: 2021-12-17T12:00:00+00:00
modified: 2021-12-17T12:00:00+00:00
broader: Idrottshändelse
broad match: http://cv.iptc.org/newscodes/subjectcode/15073028

Kontinental cup
type: Concept
definition: Cup där atleter eller lag från olika länder på en viss kontinent kan delta.
in scheme: mediatopic
created: 2009-10-22T02:00:00+00:00
retired: 2021-12-17T12:00:00+00:00
modified: 2021-12-17T12:00:00+00:00
broader: Idrottshändelse

Kontinentala spel
type: Concept
definition: Tävling där atleter eller lag från olika länder på en viss kontinent kan delta.
in scheme: mediatopic
created: 2009-10-22T02:00:00+00:00
retired: 2021-12-17T12:00:00+00:00
modified: 2021-12-17T12:00:00+00:00
broader: Idrottshändelse
broad match: http://cv.iptc.org/newscodes/subjectcode/15073000

Internationella mästerskap
type: Concept
definition: Mästerskap där atleter eller lag från olika länder kan delta.
in scheme: mediatopic
created: 2009-10-22T02:00:00+00:00
retired: 2021-12-17T12:00:00+00:00
modified: 2021-12-17T12:00:00+00:00
broader: Idrottshändelse
broad match: http://cv.iptc.org/newscodes/subjectcode/15073000

Internationella cuper
type: Concept
definition: Cup där atleter eller lag från olika länder kan delta.
in scheme: mediatopic
created: 2009-10-22T02:00:00+00:00
retired: 2021-12-17T12:00:00+00:00
modified: 2021-12-17T12:00:00+00:00
broader: Idrottshändelse

Internationella spel
type: Concept
definition: Tävling där atleter eller lag från olika länder kan delta.
in scheme: mediatopic
created: 2009-10-22T02:00:00+00:00
retired: 2021-12-17T12:00:00+00:00
modified: 2021-12-17T12:00:00+00:00
broader: Idrottshändelse
broad match: http://cv.iptc.org/newscodes/subjectcode/15073000

Nationella mästerskap
type: Concept
definition: Mästerskap där atleter eller lag från ett visst land kan delta.
in scheme: mediatopic
created: 2009-10-22T02:00:00+00:00
retired: 2021-12-17T12:00:00+00:00
modified: 2021-12-17T12:00:00+00:00
broader: Idrottshändelse
broad match: http://cv.iptc.org/newscodes/subjectcode/15073000

Nationell cup
type: Concept
definition: Cup där atleter eller lag från ett visst land kan delta.
in scheme: mediatopic
created: 2009-10-22T02:00:00+00:00
retired: 2021-12-17T12:00:00+00:00
modified: 2021-12-17T12:00:00+00:00
broader: Idrottshändelse

Nationella spel
type: Concept
definition: Tävling där atleter eller lag från ett visst land kan delta.
in scheme: mediatopic
created: 2009-10-22T02:00:00+00:00
retired: 2021-12-17T12:00:00+00:00
modified: 2021-12-17T12:00:00+00:00
broader: Idrottshändelse
broad match: http://cv.iptc.org/newscodes/subjectcode/15073000

Distriktsmästerskap
type: Concept
definition: Mästerskap där atleter eller lag från en viss del av landet kan delta.
in scheme: mediatopic
created: 2009-10-22T02:00:00+00:00
retired: 2021-12-17T12:00:00+00:00
modified: 2021-12-17T12:00:00+00:00
broader: Idrottshändelse

Distriktscup
type: Concept
definition: Cup där atleter eller lag från en viss del av landet kan delta.
in scheme: mediatopic
created: 2009-10-22T02:00:00+00:00
retired: 2021-12-17T12:00:00+00:00
modified: 2021-12-17T12:00:00+00:00
broader: Idrottshändelse

Distriktstävlingar
type: Concept
definition: Tävling där atleter eller lag från en viss del av landet kan delta.
in scheme: mediatopic
created: 2009-10-22T02:00:00+00:00
retired: 2021-12-17T12:00:00+00:00
modified: 2021-12-17T12:00:00+00:00
broader: Idrottshändelse
broad match: http://cv.iptc.org/newscodes/subjectcode/15073000

Världsmästerskap
type: Concept
definition: Mästerskap där atleter eller lag från samtliga världsdelar kan delta.
in scheme: mediatopic
created: 2009-10-22T02:00:00+00:00
retired: 2021-12-17T12:00:00+00:00
modified: 2021-12-17T12:00:00+00:00
broader: Idrottshändelse

Världscup
type: Concept
definition: Cup där atleter eller lag från samtliga världsdelar kan delta.
in scheme: mediatopic
created: 2009-10-22T02:00:00+00:00
retired: 2021-12-17T12:00:00+00:00
modified: 2021-12-17T12:00:00+00:00
broader: Idrottshändelse

World Games
type: Concept
definition: Tävling där atleter eller lag från samtliga världsdelar kan delta.
in scheme: mediatopic
created: 2009-10-22T02:00:00+00:00
retired: 2021-12-17T12:00:00+00:00
modified: 2021-12-17T12:00:00+00:00
broader: Idrottshändelse

Olympiska spel
type: Concept
definition: Internationella idrottstävlingar med antik förebild som arrangeras vart fjärde år.
in scheme: mediatopic
created: 2016-08-24T12:00:00+00:00
modified: 2021-12-17T12:00:00+00:00
broader: Idrottshändelse

Paralympics
type: Concept
definition: Internationella idrottstävlingar för elitidrottare med funktionsnedsättning.
in scheme: mediatopic
created: 2016-08-24T12:00:00+00:00
modified: 2021-12-17T12:00:00+00:00
broader: Idrottshändelse

Seriespel
type: Concept
definition: Tävlingar under en säsong där lag eller individer kämpar om platser i tabell, eller ranking.
in scheme: mediatopic
created: 2021-12-17T12:00:00+00:00
modified: 2021-12-21T12:00:00+00:00
broader: Idrottshändelse

Slutspel
type: Concept
definition: Spelas efter seriespel med målsättning att utse slutlig vinnare eller lag/tävlande som flyttas upp eller ner mellan serier.
in scheme: mediatopic
created: 2021-12-17T12:00:00+00:00
modified: 2021-12-21T12:00:00+00:00
broader: Idrottshändelse

Final
type: Concept
definition: Sista tävlingen som avgör vilket lag eller person som slutligen vinner.
in scheme: mediatopic
created: 2021-12-17T12:00:00+00:00
modified: 2021-12-21T12:00:00+00:00
broader: Idrottshändelse

Mässor
type: Concept
definition: Större utställning med viss typ av varor från flera olika försäljare, vanligtvis avsedd för återförsäljare.
in scheme: mediatopic
created: 2012-10-04T12:00:00+00:00
modified: 2023-03-31T12:00:00+00:00
broader: Företagsservice

Köpråd
type: Concept
definition: En analytikers rekommendation att köpa en specifik aktie.
in scheme: mediatopic
created: 2012-10-04T12:00:00+00:00
retired: 2023-03-31T12:00:00+00:00
modified: 2023-03-31T12:00:00+00:00
broader: Aktieråd

Råd att behålla
type: Concept
definition: En analytikers rekommendation att behålla en specifik aktie.
in scheme: mediatopic
created: 2012-10-04T12:00:00+00:00
retired: 2023-03-31T12:00:00+00:00
modified: 2023-03-31T12:00:00+00:00
broader: Aktieråd

Säljråd
type: Concept
definition: En analytikers rekommendation att sälja en specifik aktie.
in scheme: mediatopic
created: 2012-10-04T12:00:00+00:00
retired: 2023-03-31T12:00:00+00:00
modified: 2023-03-31T12:00:00+00:00
broader: Aktieråd

Skateboard
type: Concept
definition: De tävlande använder en liten platta med fyra hjul och åker runt och gör olika trick.
in scheme: mediatopic
created: 2014-11-07T12:00:00+00:00
modified: 2021-07-12T12:00:00+00:00
broader: Rullskridskosport

MMA
type: Concept
definition: (Mixed martial arts) Fullkontaktsport där utövarna får använda slag, kast, sparkar mm. Det är mer reglerat vad man inte får göra.
in scheme: mediatopic
created: 2019-04-06T12:00:00+00:00
modified: 2021-07-12T12:00:00+00:00
broader: Kampsport

Krav maga
type: Concept
definition: Kombination av flera andra saker som boxning, judo och karate både för självförsvar och tävling.
in scheme: mediatopic
created: 2021-02-18T12:00:00+00:00
modified: 2021-07-12T12:00:00+00:00
broader: Kampsport

Kickboxning
type: Concept
definition: Upprättstående kontaktsport där de tävlande både för slå och sparka varandra.
in scheme: mediatopic
created: 2021-02-18T12:00:00+00:00
modified: 2021-07-12T12:00:00+00:00
broader: Kampsport

Sambo
type: Concept
definition: Brottningsliknande sport med rötter i Sovjetunionen.
in scheme: mediatopic
created: 2021-02-18T12:00:00+00:00
modified: 2021-07-12T12:00:00+00:00
broader: Kampsport

Kapitalförvaltare
type: Concept
definition: Tjänster för att få tillgångar att växa genom investering i aktier, fonder och dylikt.
in scheme: mediatopic
created: 2016-04-04T12:00:00+00:00
modified: 2023-03-31T12:00:00+00:00
broader: Finansiella tjänster

Betalningstjänster
type: Concept
definition: Tjänster för att genomföra betalningar, inklusive kontanter, checkar, betalkort, internetbanker och betalningar med hjälp av datorer eller mobiltelefoner.
in scheme: mediatopic
created: 2016-04-04T12:00:00+00:00
modified: 2023-03-31T12:00:00+00:00
broader: Företagsservice

Medicinsk utrustning
type: Concept
definition: Tillverkning av medicinska eller kirurgiska produkter som används för diagnosticering och behandling av sjuka.
in scheme: mediatopic
created: 2016-04-04T12:00:00+00:00
modified: 2023-03-31T12:00:00+00:00
broader: Hälsovårdsproduktion

Influencers
type: Concept
definition: Personer som lägger ut saker på nätet, får många följare och därmed influerar dem.
in scheme: mediatopic
created: 2019-04-06T12:00:00+00:00
modified: 2021-07-12T12:00:00+00:00
broader: Sociala medier

Motion & hälsa
type: Concept
definition: Fysiska aktiviteter som mest utförs för personens egen skull och inte för att utveckla idrottsliga färdigheter
in scheme: mediatopic
created: 2019-06-26T12:00:00+00:00
modified: 2021-12-17T12:00:00+00:00
broader: Friskvård

Värme och ventilation
type: Concept
definition: Verksamhet som tillhandahåller värme, ventilation och luftkonditionering till privata hem och företag.
in scheme: mediatopic
created: 2020-08-05T12:00:00+00:00
modified: 2023-03-31T12:00:00+00:00
broader: Samhällsservice

Tatuering
type: Concept
definition: Dekorering av den egna kroppen genom att bläck förs in i skinnet och bildar en permanent bild eller text.
in scheme: mediatopic
created: 2019-07-30T12:00:00+00:00
modified: 2021-07-12T12:00:00+00:00
broader: Kroppsdekoration

Piercing
type: Concept
definition: Dekorering av den egna kroppen genom att hål tas där smycken placeras.
in scheme: mediatopic
created: 2019-07-30T12:00:00+00:00
modified: 2021-07-12T12:00:00+00:00
broader: Kroppsdekoration

Rekord (sport och idrott)
type: Concept
definition: Bästa resultat i världen eller annat område, säsongsbästa osv.
in scheme: mediatopic
created: 2021-02-18T12:00:00+00:00
modified: 2022-09-23T12:00:00+00:00
broader: Sportsliga framgång

Medaljer
type: Concept
definition: Medaljer från OS, VM osv. Sammanställningar av medaljskörd per nation.
in scheme: mediatopic
created: 2021-02-18T12:00:00+00:00
modified: 2022-09-23T12:00:00+00:00
broader: Sportsliga framgång
broad match: Q15229207

Sportutmärkelser
type: Concept
definition: Erkännande av en idrottspersons framgångar som årets idrottare, eller inval i någon Hall of fame.
in scheme: mediatopic
created: 2021-02-18T12:00:00+00:00
modified: 2022-09-23T12:00:00+00:00
broader: Sportsliga framgång

Mentalt välbefinnande
type: Concept
definition: Aktiviteter som meditation och stresshantering för att öka mentalt välbefinnande.
in scheme: mediatopic
created: 2021-12-17T12:00:00+00:00
modified: 2021-12-21T12:00:00+00:00
broader: Friskvård

Saknad i krig
type: Concept
definition: Militär personal som saknas i strid och inte är bekräftat döda eller återfunna.
in scheme: mediatopic
created: 2024-03-28T12:00:00+00:00
retired: 2024-07-01T12:00:00+00:00
modified: 2024-03-28T12:00:00+00:00
broader: Krigsoffer