Media Topic
type: ConceptScheme
pref scheme alias: medtop
authority: http://www.iptc.org
rights holder: IPTC, International Press Telecommunications Council - https://iptc.org
licence link: http://creativecommons.org/licenses/by/4.0/
date released: 2026-07-02T12:00:00+00:00
definition: Indicates a subject of an item.
note: The Media Topic NewsCodes has been IPTC's primary subject taxonomy since 2010, with a focus on classification of text. The development started with our previous Subject Codes taxonomy and extended the tree to 5 levels and reused the same 17 top level terms. The terms below the top level have been revised and rearranged. Most Media Topic concepts provide a mapping back to one of the Subject Codes, and many provide a mapping to Wikidata.
has top concept: arts, culture, entertainment and media
has top concept: crime, law and justice
has top concept: disaster, accident and emergency incident
has top concept: economy, business and finance
has top concept: education
has top concept: environment
has top concept: health
has top concept: human interest
has top concept: labour
has top concept: lifestyle and leisure
has top concept: politics and government
has top concept: religion
has top concept: science and technology
has top concept: society
has top concept: sport
has top concept: conflict, war and peace
has top concept: weather

arts, culture, entertainment and media
type: Concept
preferred label: فنون، ثقافة وترفيه @ar
preferred label: Arts, culture, divertissement et médias @fr
preferred label: Artes, cultura, entretenimiento y medios @es
preferred label: Konst, kultur och nöje @se
preferred label: Kultur, Kunst, Unterhaltung und Medien @de
preferred label: artes, cultura, entretenimento e média @pt-pt
preferred label: artes, cultura, entretenimento e mídia @pt-br
preferred label: kunst, kultur, underholdning og medier @dk
preferred label: 艺术、文化、娱乐和媒体 @zh-hans
preferred label: kultur, underholdning og medier @no-nb
preferred label: kultur, underhaldning og media @no-nn
definition: All forms of arts, entertainment, cultural heritage and media
definition: Todas las formas de arte, entretenimiento cultura y medios @es
definition: Ämnen som rör utveckling och förfining av det mänskliga medvetandet, av intressen, färdigheter, smak och känslor, inklusive sådant som språk, radio, och tv. @se
definition: Toutes les formes d'arts, de divertissement, de culture et de médias @fr
definition: Alle Formen von Kunst, Unterhaltung, Kulturerbe und Medien @de
definition: Todas as formas de arte, entretenimento, herança cultural e média. @pt-pt
definition: Todas as formas de arte, entretenimento, herança cultural e mídia. @pt-br
definition: Kunst, kultur, underholdning og medier. @dk
definition: 各种形式的艺术、娱乐、文化遗产和媒体 @zh-hans
definition: Alle former for kunst, kultur, underhaldning og medium. @no-nn
definition: Alle former for kunst, kultur, underholdning og medier. @no-nb
in scheme: Media Topic
created: 2009-10-22T02:00:00+00:00
modified: 2021-02-18T12:00:00+00:00
narrower: arts and entertainment
narrower: culture
narrower: mass media

arts and entertainment
type: Concept
preferred label: Kunst und Unterhaltung @de
preferred label: Konst och underhållning @se
preferred label: فنون وتسلية @ar
preferred label: Arte y entretenimiento @es
preferred label: Arts et divertissement @fr
preferred label: arte e entretenimento @pt-pt
preferred label: kunst og underholdning @dk
preferred label: 艺术与娱乐 @zh-hans
preferred label: kunst og underhaldning @no-nn
definition: All forms of arts and entertainment
definition: Todas las formas de arte y de entretenimiento @es
definition: Alla former av konst och underhållning som inte hör till nöje. @se
definition: Alle Formen von Kunst und Unterhaltung @de
definition: Toutes les formes d'arts et de divertissement @fr
definition: Todas as formas de arte e entretenimento. @pt-pt
definition: Alle former for kunst og underholdning. @dk
definition: 各种形式的艺术和娱乐 @zh-hans
definition: Alle former for kunst og underhaldning. @no-nn
in scheme: Media Topic
created: 2009-10-22T02:00:00+00:00
modified: 2021-02-18T12:00:00+00:00
broader: arts, culture, entertainment and media
narrower: animation
narrower: cartoon
narrower: cinema
narrower: dance
narrower: fashion
narrower: literature
narrower: music
narrower: theatre
narrower: visual arts
narrower: series
narrower: festival
broad match: http://cv.iptc.org/newscodes/subjectcode/01000000

culture
type: Concept
preferred label: Cultura @es
preferred label: Kultur @de
preferred label: Culture @fr
preferred label: ثقافة @ar
preferred label: cultura @pt-pt
preferred label: kultur @dk
preferred label: 文化 @zh-hans
definition: The ideas, customs, arts, traditions of a particular group of persons
definition: Ideas, costumbres, artes, tradiciones de un grupo particular @es
definition: Gemensamma idéer, seder, traditioner och konst hos en grupp människor. @se
definition: Die Ideen, Bräuche, Künste und Traditionen einer bestimmten Gruppe von Menschen @de
definition: Idées, coutumes, arts, traditions d'un groupe particulier de personnes @fr
definition: Ideias, costumes, artes, tradições de um grupo em particular. @pt-pt
definition: Ideer, skikke, traditioner og kunst for en gruppe mennesker. @dk
definition: 特定人群的思想、习俗、艺术和传统 @zh-hans
in scheme: Media Topic
created: 2009-10-22T02:00:00+00:00
modified: 2021-02-18T12:00:00+00:00
broader: arts, culture, entertainment and media
narrower: cultural development
narrower: customs and tradition
narrower: festive event (culture)
narrower: language
narrower: library and museum
narrower: monument and heritage site
narrower: art exhibition

mass media
type: Concept
preferred label: Massmedier @se
preferred label: اعلام جماهيري @ar
preferred label: Massenmedien @de
preferred label: Médias @fr
preferred label: Medios masivos de comunicación @es
preferred label: meios de comunicação @pt-pt
preferred label: mídia de massas @pt-br
preferred label: massemedie @dk
preferred label: 大众传媒 @zh-hans
preferred label: massemedier @no-nb
preferred label: massemedium @no-nn
definition: Text, ljud och bild som satts ihop för att presenteras för en större publik. @se
definition: Medien, die ein großes Publikum erreichen @de
definition: Media addressing a large audience
definition: Médias s'adressant à une large audience @fr
definition: Meios de comunicação que se destinam a um grande público, como a televisão, o rádio, as revistas, os jornais, etc. @pt-pt
definition: Meios de comunicação que se destinam a um grande público, como a televisão, o rádio, as revistas, os jornais etc. @pt-br
definition: Tekst, lyd og billede sammensat for at blive præsenteret for et større publikum. @dk
definition: 面向大量受众的媒体 @zh-hans
in scheme: Media Topic
created: 2009-10-22T02:00:00+00:00
modified: 2021-02-18T12:00:00+00:00
broader: arts, culture, entertainment and media
narrower: news media
narrower: newspaper
narrower: online media outlet
narrower: periodical
narrower: radio
narrower: television
narrower: social media
narrower: disinformation and misinformation

crime, law and justice
type: Concept
preferred label: جريمة، قانون وقضاء @ar
preferred label: Criminalité, droit et justice @fr
preferred label: Brott, lag och rätt @se
preferred label: Policía y justicia @es
preferred label: Justiz, Kriminalität @de
preferred label: crime, lei e justiça @pt-pt
preferred label: kriminalitet, lov og retfærdighed @dk
preferred label: 犯罪、法律和司法 @zh-hans
preferred label: kriminalitet, rett og rettsvesen @no-nb
definition: Festlegung und/oder Verlautbarung von Verhaltensregeln einer Gesellschaft, die Durchsetzung dieser Regeln, ihre Verstöße und die Bestrafung der Täter. Organisationen und Einheiten, die mit diesen Aktivitäten betraut sind @de
definition: The establishment and/or statement of the rules of behaviour in society, the enforcement of these rules, breaches of the rules, the punishment of offenders and the organisations and bodies involved in these activities
definition: Etablering och/eller konstaterande av samhällets regler, dessa reglers genomförande, brott mot reglerna och bestraffning av förbrytarna. Organisationer och myndigheter inblandade i dessa aktiviteter. Brott, domstolsväsende, polis, straff, fängelse. @se
definition: Estabelecimento e/ou declaração das regras de comportamento em sociedade, aplicação dessas regras, quebra das regras e penas para os infratores. Organizações e pessoas envolvidas nessas atividades. @pt-pt
definition: Oprettelse og/eller etablering af samfundets regler, håndhævelsen af disse regler, overtrædelse af reglerne og straf for kriminelle, herunder enkel personer, grupper, organisationer og andre enheder. @dk
definition: 制订和发布社会行为守则、执行这些守则、违反守则、惩罚违法者，以及参与这些活动的组织和机构 @zh-hans
definition: The establishment and/or statement of the rules of behavior in society, the enforcement of these rules, breaches of the rules, the punishment of offenders and the organizations and bodies involved in these activities
in scheme: Media Topic
created: 2009-10-22T02:00:00+00:00
modified: 2021-05-05T12:00:00+00:00
narrower: crime
narrower: judiciary
narrower: justice
narrower: law
narrower: law enforcement

crime
type: Concept
preferred label: Kriminalität @de
preferred label: Brottslighet @se
preferred label: Criminalidad @es
preferred label: Criminalité @fr
preferred label: جريمة @ar
preferred label: forbrydelse @dk
preferred label: 犯罪 @zh-hans
preferred label: kriminalitet @no-nb
definition: Verletzung von etablierten Gesetzen durch Individuen, Firmen und Organisationen @de
definition: När individer, företag eller organisationer bryter mot gällande lagar. @se
definition: Violations of laws by individuals, companies or organisations
definition: Violação das leis por indivíduos, empresas ou organizações. @pt-pt
definition: Enkeltpersoner, virksomheder eller organisationer overtræder gældende love. @dk
definition: 个人、公司或组织违反法律的行为 @zh-hans
definition: Violations of laws by individuals, companies or organizations
in scheme: Media Topic
created: 2009-10-22T02:00:00+00:00
modified: 2021-02-18T12:00:00+00:00
broader: crime, law and justice
narrower: genocide
narrower: arson
narrower: assault
narrower: cyber crime
narrower: corporate crime
narrower: corruption
narrower: drug related crimes
narrower: fraud
narrower: hijacking
narrower: homicide
narrower: kidnapping
narrower: organised crime
narrower: terrorism
narrower: robbery and theft
narrower: war crime
narrower: reckless driving
narrower: human smuggling and trafficking
narrower: vandalism
narrower: shootings
narrower: animal abuse
narrower: torture

judiciary
type: Concept
preferred label: Rättssystem @se
preferred label: Justiz @de
preferred label: Système judiciaire @fr
preferred label: سلطة قضائية @ar
preferred label: Magistratura @es
preferred label: judicial (sistema de justiça) @pt-pt
preferred label: judiciário (sistema de justiça) @pt-br
preferred label: retsvæsen @dk
preferred label: 司法 @zh-hans
preferred label: rettsvesen @no-nb
definition: System, das eingesetzt wird zum Umgang mit Kriminalität und Kriminellen @de
definition: De instanser i ett samhälle som bidrar till att upprätthålla lagen och straffa dem som bryter mot lagen. @se
definition: The system of courts of law
definition: Sistema estabelecido para administrar as leis e aqueles que as infringem. @pt-pt
definition: De organer i et samfund, der hjælper med at opretholde loven og straffe dem, der krænker loven. @dk
definition: 为管理法律和违法者而建立的制度 @zh-hans
in scheme: Media Topic
created: 2009-10-22T02:00:00+00:00
modified: 2021-02-18T12:00:00+00:00
broader: crime, law and justice
narrower: court
narrower: out of court procedures
narrower: prosecution and prosecutors

justice
type: Concept
preferred label: Rättvisa och rättigheter @se
preferred label: Rechtsprechung @de
preferred label: عدالة وحقوق @ar
preferred label: Droits juridiques @fr
preferred label: Justicia y derechos @es
preferred label: justiça @pt-pt
preferred label: justiça e direitos @pt-br
preferred label: retfærdighed @dk
preferred label: 公正 @zh-hans
preferred label: juss @no-nb
definition: Die gerechte Anwendung von Gesetzen und Regularien @de
definition: The equitable administration of laws and regulations
definition: Att ett samhälle sköts så att medborgarna åtnjuter det som stadgas i landets lagar. @se
definition: Administração equitativa de leis e regulamentos. @pt-pt
definition: En retfærdig administration af love og regler. @dk
definition: 维护法律法规公平 @zh-hans
change note: Retired. Use a more specific term instead.
in scheme: Media Topic
created: 2009-10-22T02:00:00+00:00
retired: 2023-10-02T12:00:00+00:00
modified: 2023-10-02T12:00:00+00:00
broader: crime, law and justice

law
type: Concept
preferred label: قانون @ar
preferred label: Legislación @es
preferred label: Lag @se
preferred label: Lois @fr
preferred label: Gesetz @de
preferred label: leis @pt-pt
preferred label: lov @dk
preferred label: 法律 @zh-hans
preferred label: lov og rett @no-nb
definition: Regler som bestämts av ett lands lagstadgande instans. @se
definition: The codification of rules of behaviour
definition: Die systematische Aufzeichnung von Verhaltensvorschriften @de
definition: Codificação de regras de conduta em sociedade. @pt-pt
definition: Regler fastlagt af et lands lovgivende myndigheder. @dk
definition: 行为规则 @zh-hans
definition: The codification of rules of behavior
in scheme: Media Topic
created: 2009-10-22T02:00:00+00:00
modified: 2021-02-18T12:00:00+00:00
broader: crime, law and justice
narrower: civil law
narrower: criminal law
narrower: international law
narrower: administrative law

law enforcement
type: Concept
preferred label: Brottsbekämpning @se
preferred label: تطبيق القانون @ar
preferred label: Forces de l'ordre @fr
preferred label: Autoridades @es
preferred label: Sicherheitskräfte (BGS, LKA, BKA) @de
preferred label: forças policiais @pt-pt
preferred label: retshåndhævelse @dk
preferred label: 执法机构 @zh-hans
preferred label: rettshåndhevelse @no-nb
preferred label: rettshandheving @no-nn
definition: Olika aktiviteter för att minimera brottslighet. @se
definition: Agencies that attempt to prevent disobedience to established laws or bring to justice those who disobey those laws
definition: Tätigkeitsbereiche, die eingebunden sind in Präventivmaßnahmen zur Verhinderung von Verstößen gegen gültige Gesetze, oder die Gesetzesbrecher vor Gericht zu bringen. @de
definition: Agências envolvidas na prevenção da desobediência às leis estabelecidas e em levar a tribunal os que desobedecem a essas leis. @pt-pt
definition: Forskellige aktiviteter for at forhindre kriminalitet eller straffe dem, der har begået kriminalitet. @dk
definition: 防止违反既定法律或将违反法律的人绳之以法的机构 @zh-hans
in scheme: Media Topic
created: 2009-10-22T02:00:00+00:00
modified: 2021-02-18T12:00:00+00:00
broader: crime, law and justice
narrower: arrest
narrower: investigation (criminal)
narrower: police
narrower: surveillance

disaster, accident and emergency incident
type: Concept
preferred label: Katastrophe und Unglück @de
preferred label: Catástrofes y accidentes @es
preferred label: كوارث وحوادث @ar
preferred label: Désastres et accidents @fr
preferred label: Katastrofer och olyckor @se
preferred label: desastres, acidentes e emergências @pt-pt
preferred label: katastrofe, ulykke og nødsituation @dk
preferred label: 灾难、事故和突发事件 @zh-hans
preferred label: ulykker og naturkatastrofer @no-nb
preferred label: ulykker og naturkatastrofar @no-nn
definition: Man made or natural event resulting in loss of life or injury to living creatures and/or damage to inanimate objects or property
definition: Naturliga eller av människan skapade händelser som orsakar död eller skada för människor eller skador på ting och egendomar. @se
definition: Von Menschen erzeugte oder naturgegebene Ereignisse, die zu Todesfällen oder Verletzungen von Lebewesen und/oder der Zerstörung von Objekten oder Eigentum führen @de
definition: Desastres naturais ou provocados pelo homem, de que resultam perda de vidas ou ferimentos de criaturas e/ou danos a objetos ou propriedades. @pt-pt
definition: Naturlige eller menneskeskabte begivenheder, der forårsager død eller skade på mennesker eller skade på ting og ejendom. @dk
definition: 人为或自然因素导致的生命伤亡或财产损失 @zh-hans
in scheme: Media Topic
created: 2009-10-22T02:00:00+00:00
modified: 2021-05-05T12:00:00+00:00
narrower: accident and emergency incident
narrower: disaster
narrower: emergency incident
narrower: emergency planning
narrower: emergency response

accident and emergency incident
type: Concept
preferred label: Accidente @es
preferred label: Olyckor och akuta händelser @se
preferred label: حادث @ar
preferred label: Accident @fr
preferred label: Unglück @de
preferred label: acidente (geral) @pt-pt
preferred label: ulykke og nødsituation @dk
preferred label: 事故和突发事件 @zh-hans
preferred label: ulykker @no-nb
definition: Mer eller mindre akuta oönskade händelser. @se
definition: Jedes ungeplante Ereignis mit ungewollten Konsequenzen @de
definition: A sudden, unexpected event that causes unwanted consequences or requires immediate action
definition: Qualquer evento inesperado e repentino com consequências indesejadas e que requer medidas imediatas para evitar consequências sérias. @pt-pt
definition: Pludselig uventet hændelser, der forsager konsekvenser eller kræver øjeblikkelig handling for at forhindre alvorlige konsekvenser. @dk
definition: 突发、意料外的事件，如不采取立即行动可能造成严重后果 @zh-hans
change note: Change Note 2015-08-27: Concept medtop:20000160 was merged into this one as their semantics were not sufficiently different
in scheme: Media Topic
created: 2009-10-22T02:00:00+00:00
modified: 2021-02-18T12:00:00+00:00
broader: disaster, accident and emergency incident
narrower: explosion accident and incident
narrower: industrial accident and incident
narrower: transportation accident and incident
narrower: structural failure
narrower: drowning

disaster
type: Concept
preferred label: Katastrophe @de
preferred label: Catástrofes @es
preferred label: Katastrofer @se
preferred label: كارثة @ar
preferred label: Désastres @fr
preferred label: desastre (geral) @pt-pt
preferred label: katastrofe @dk
preferred label: 灾难 @zh-hans
preferred label: katastrofer @no-nb
preferred label: katastrofar @no-nn
definition: A sudden, unplanned event that causes great damage or loss of life, such as an accident or a natural catastrophe
definition: Mer allvarliga akuta oönskade händelser. @se
definition: Ernsthaftes und plötzliches Leid @de
definition: Desgraça imprevista e grave. @pt-pt
definition: Azar sério ou súbito. @pt-br
definition: Alvorlig eller pludselig ulykke. @dk
definition: 严重的或突然发生的不幸 @zh-hans
in scheme: Media Topic
created: 2009-10-22T02:00:00+00:00
modified: 2021-02-18T12:00:00+00:00
broader: disaster, accident and emergency incident
narrower: famine
narrower: fire
narrower: natural disaster

emergency incident
type: Concept
preferred label: Situation d'urgence @fr
preferred label: Notfall @de
preferred label: Incidentes de emergencia @es
preferred label: حادث طارىء @ar
preferred label: caso de emergência @pt-pt
preferred label: nødsituation @dk
preferred label: 突发事件 @zh-hans
preferred label: ulykke @no-nb
definition: A sudden, unexpected event that requires immediate action to prevent serious consequences
definition: Ein plötzliches, unerwartetes Ereignis, was eine sofortige Reaktion erfordert, um schwere Folgen zu verhindern @de
definition: Evento súbito, inesperado que requer ação imediata. @pt-pt
definition: En pludselig, uventet begivenhed, der kræver øjeblikkelig handling for at forhindre alvorlige konsekvenser. @dk
definition: 需要立即采取行动以避免严重后果的突发、意外事件 @zh-hans
change note: Change Note 2015-08-27: This concept was merged into concept medtop:20000139 as their semantics were not sufficiently different
in scheme: Media Topic
created: 2009-10-22T02:00:00+00:00
retired: 2015-08-27T12:00:00+00:00
modified: 2021-12-21T12:00:00+00:00
broader: disaster, accident and emergency incident
narrower: transport incident

emergency planning
type: Concept
preferred label: Planificación de emergencia @es
preferred label: Beredskapsplanering @se
preferred label: Prévention et organisation des secours @fr
preferred label: خطط الطوارىء @ar
preferred label: Katastrophenschutz @de
preferred label: planos de emergência @pt-pt
preferred label: beredskabsplanlægning @dk
preferred label: 应急计划 @zh-hans
preferred label: krisehåndtering @no-nb
preferred label: krisehandtering @no-nn
definition: Planning for actions to deal with sudden, unplanned events
definition: Vorbereitung auf Aktionen, um mit unvorhergesehenen Ereignissen umgehen zu können @de
definition: Planer för aktiviteter som vidtar vid plötsligt uppkomna krissituationer. @se
definition: Planos de ação para lidar com eventos súbitos e inesperados. @pt-pt
definition: Planer for aktiviteter, der skal finde sted i pludselige nødsituationer. @dk
definition: 应对突发事件的行动计划 @zh-hans
change note: 2019-12-11: Retired. Use medtop:20000168 emergency response instead
in scheme: Media Topic
created: 2009-10-22T02:00:00+00:00
retired: 2019-12-11T12:00:00+00:00
modified: 2021-02-18T12:00:00+00:00
broader: disaster, accident and emergency incident

emergency response
type: Concept
preferred label: Secours d'urgence @fr
preferred label: Hilfsorganisation @de
preferred label: استجابة لحالة طوارىء @ar
preferred label: Katastrofhjälp @se
preferred label: Socorro de emergencia @es
preferred label: resposta de emergência @pt-pt
preferred label: beredskabsindsats @dk
preferred label: 应急响应 @zh-hans
preferred label: katastrofeinnsats @no-nb
definition: Organisationen, die jenen Hilfe anbieten, die Mangel an Nahrungsmitteln, Wasser oder Unterkunft haben @de
definition: The planning and efforts made by people and organizations to help victims of a sudden, unplanned event, natural disaster or crisis
definition: Organisationer som har som syfte att hjälpa personer utan hem, mat och vatten vid plötsligt uppkomna krissituationer. @se
definition: Organizações criadas para fornecer ajuda a quem tem falta de comida, água ou abrigo. @pt-pt
definition: Organisationer, der sigter mod at hjælpe mennesker uden mad, vand og ly i pludselige nødsituationer. @dk
definition: 为那些因缺乏食物、水或住所的人们提供帮助而设立的组织机构。为帮助突发、意外事件、自然灾害或危机的受害者而进行的计划和努力 @zh-hans
in scheme: Media Topic
created: 2009-10-22T02:00:00+00:00
modified: 2021-02-18T12:00:00+00:00
broader: disaster, accident and emergency incident
broad match: http://cv.iptc.org/newscodes/subjectcode/03012000

economy, business and finance
type: Concept
preferred label: Economía, negocios y finanzas @es
preferred label: Wirtschaft und Finanzen @de
preferred label: Économie et finances @fr
preferred label: Ekonomi, affärer, finans @se
preferred label: اقتصاد، اعمال ومال @ar
preferred label: economia, negócios e finanças @pt-pt
preferred label: økonomi, erhvervsliv og finans @dk
preferred label: 经济、商业和金融 @zh-hans
preferred label: økonomi og næringsliv @no-nb
definition: All matters concerning the planning, production and exchange of wealth.
definition: Allt som rör planering, produktion och utbyte av egendom. Jordbruk, dator- och IT-teknik, byggbransch och mark, energi och resurser, finans och affär, varutransport, makroekonomi, media, turism, transporter generellt. @se
definition: Alle Inhalte, die Planung, Produktion und Austausch von Vermögen betreffen @de
definition: Assuntos relativos à planificação, produção e troca de riqueza. @pt-pt
definition: Alt om planlægning, produktion og udveksling af ejendom. @dk
definition: 一切与财富的规划、生产和交换有关的事宜 @zh-hans
in scheme: Media Topic
created: 2009-10-22T02:00:00+00:00
modified: 2021-07-12T12:00:00+00:00
narrower: business information
narrower: products and services
narrower: economy
narrower: business enterprise
narrower: market and exchange

business information
type: Concept
preferred label: Firmeninformation @de
preferred label: معلومات تجارية @ar
preferred label: Microéconomie @fr
preferred label: Företagsinformation @se
preferred label: Información sobre empresas @es
preferred label: informação sobre empresas @pt-pt
preferred label: virksomhedsinformation @dk
preferred label: 企业信息 @zh-hans
preferred label: selskapsinformasjon @no-nb
definition: Information about individual business entities, including companies, corporations, charities
definition: Information om enskilda företag, stiftelser, ekonomiska föreningar med mera. @se
definition: Information über einzelne Firmen, Konzerne und Wohltätigkeitsorganisationen @de
definition: Informação sobre empresas individuais ou companhias de negócios. @pt-pt
definition: Oplysninger om individuelle virksomheder, fonde og mere. @dk
definition: 有关单个企业实体的信息，包括公司、慈善机构 @zh-hans
in scheme: Media Topic
created: 2009-10-22T02:00:00+00:00
modified: 2021-05-05T12:00:00+00:00
broader: economy, business and finance
narrower: business finance
narrower: business financing
narrower: human resources
narrower: business strategy and marketing
narrower: business governance
narrower: business reporting and performance
narrower: business restructuring

products and services
type: Concept
preferred label: Sector económico @es
preferred label: Näringsliv @se
preferred label: قطاع اقتصادي @ar
preferred label: Branchen @de
preferred label: Secteurs économiques @fr
preferred label: setor económico @pt-pt
preferred label: setor econômico @pt-br
preferred label: økonomisk sektor @dk
preferred label: 经济门类 @zh-hans
preferred label: produkter og tjenester @no-nb
preferred label: produkt og tenester @no-nn
definition: Gruppierung der Wirtschaftszweige durch Produkte oder Dienstleistungen @de
definition: Gruppering av ekonomiska aktiviteter indelade efter produkter eller tjänster. @se
definition: Products and services consumed by companies and individuals and the companies that manufacture or manage them
definition: Agrupamento de atividades económicas por produtos ou serviços. @pt-pt
definition: Agrupamento de atividades econômicas por produtos ou serviços. @pt-br
definition: Gruppering af økonomiske aktiviteter efter produkt eller service. @dk
definition: 按产品或服务分组的经济活动 @zh-hans
in scheme: Media Topic
created: 2009-10-22T02:00:00+00:00
modified: 2023-03-31T12:00:00+00:00
broader: economy, business and finance
narrower: agriculture
narrower: commercial fishing
narrower: forestry and timber
narrower: chemicals
narrower: plastic
narrower: computing and information technology
narrower: construction and property
narrower: consumer goods
narrower: energy and resource
narrower: financial and business service
narrower: manufacturing and engineering
narrower: media and entertainment industry
narrower: metal and mineral mining and refining
narrower: process industry
narrower: tourism and leisure industry
narrower: transport
narrower: utilities
narrower: sales channel
narrower: healthcare industry
narrower: financial service
narrower: business service
broad match: http://cv.iptc.org/newscodes/subjectcode/04000000

economy
type: Concept
preferred label: Economía @es
preferred label: Wirtschaft @de
preferred label: Économie @fr
preferred label: Ekonomi @se
preferred label: اقتصاد @ar
preferred label: economia (geral) @pt-pt
preferred label: økonomi @dk
preferred label: 经济 @zh-hans
definition: Production, consumption, distribution and trade activities affecting regions or countries as a whole
definition: Inhalte grundsätzlicher Art über Handel und Ökonomie @de
definition: Saker som rör handel och ekonomin. @se
definition: Conteúdo geral sobre comércio e economia. @pt-pt
definition: Sager relateret til handel og økonomi. @dk
definition: 关于贸易和经济的一般性内容 @zh-hans
in scheme: Media Topic
created: 2009-10-22T02:00:00+00:00
modified: 2024-03-28T12:00:00+00:00
broader: economy, business and finance
narrower: economic trends and indicators
narrower: central bank
narrower: currency
narrower: economic organisation
narrower: emerging market
narrower: international economic institution
narrower: international trade
narrower: monetary policy
narrower: mutual funds
narrower: sharing economy

business enterprise
type: Concept
preferred label: Entreprises @fr
preferred label: Företag @se
preferred label: Empresas @es
preferred label: شركات كبيرة @ar
preferred label: Unternehmen @de
preferred label: empresas @pt-pt
preferred label: erhvervsliv @dk
preferred label: 企业 @zh-hans
preferred label: virksomhet @no-nb
preferred label: verksemd @no-nn
definition: Organisations set up to create and sell a product or service
definition: Självständig ekonomisk organisation för produktion av varor eller tjänster för vinnings skull. @se
definition: Zusammenschlüsse, die ein Produkt oder Dienstleistung anbieten, mit der Absicht diese gewinnbringend zu verkaufen. @de
definition: Organizações estabelecidas com fins lucrativos, mediante a criação e venda de um produto ou serviço. @pt-pt
definition: Uafhængige økonomiske organisationer for produktion af varer eller tjenester med fortjeneste. @dk
definition: 为创造和销售某产品或服务而设立的组织，通常以营利为目的 @zh-hans
definition: Organizations set up to create and sell a product or service
in scheme: Media Topic
created: 2009-10-22T02:00:00+00:00
modified: 2024-03-28T12:00:00+00:00
broader: economy, business and finance
narrower: start-up and entrepreneurial business
narrower: small and medium enterprise
narrower: cooperative

market and exchange
type: Concept
preferred label: Marknader och börser @se
preferred label: Mercados y bolsas @es
preferred label: Marchés @fr
preferred label: Markt und Börse @de
preferred label: سوق ومبادلة @ar
preferred label: mercado e bolsa @pt-pt
preferred label: marked og børsvæsen @dk
preferred label: 市场和交易 @zh-hans
preferred label: børs og marked @no-nb
preferred label: børs og marknad @no-nn
definition: Market for buying and selling stocks, currencies, commodities and other goods
definition: Oganisierte Körperschaften, die Aktien, Währungen, Rohstoffe und andere Güter kaufen und verkaufen. @de
definition: Organiserad handel med aktier, valutor, råvaror med mera. @se
definition: Entidades organizadas para a compra e venda de ações, divisas, matérias-primas e outros bens. @pt-pt
definition: Organiseret handel med aktier, valutaer, råvarer med mere. @dk
definition: 有组织地买卖股票、货币、大宗商品和其他商品 @zh-hans
in scheme: Media Topic
created: 2009-10-22T02:00:00+00:00
modified: 2024-03-28T12:00:00+00:00
broader: economy, business and finance
narrower: commodities market
narrower: debt market
narrower: foreign exchange market
narrower: loan market

education
type: Concept
preferred label: تربية @ar
preferred label: Erziehung, Ausbildung @de
preferred label: Éducation @fr
preferred label: Utbildning @se
preferred label: Educación @es
preferred label: educação @pt-pt
preferred label: uddannelse @dk
preferred label: 教育 @zh-hans
preferred label: utdanning @no-nb
definition: Allt som rör mänskligt lärande från födsel till död. Vuxenutbildning, vidareutbildning, föräldraorganisationer, förskolor, skolor, lärarfack, universitet, etc. @se
definition: Alle Aspekte der Förderung von Wissen für den Menschen von der Geburt bis zum Tod. @de
definition: All aspects of furthering knowledge, formally or informally
definition: Tudo o que contribui para o alargamento do conhecimento dos indivíduos, desde o nascimento até à morte. @pt-pt
definition: Tudo o que contribui para o alargamento do conhecimento dos indivíduos, desde o nascimento até a morte. @pt-br
definition: Alt, hvad angår menneskelig læring fra fødsel til død. Voksenundervisning, videreuddannelse, forældreorganisationer, børnehaver, skoler, lærerforeninger, universiteter osv. @dk
definition: 从生到死，增进人类个体知识的各个方面 @zh-hans
in scheme: Media Topic
created: 2009-10-22T02:00:00+00:00
modified: 2021-09-30T12:00:00+00:00
narrower: parents group
narrower: religious education
narrower: school
narrower: social learning
narrower: teaching and learning
narrower: curriculum
narrower: educational testing and examinations
narrower: entrance examination
narrower: students
narrower: teachers
narrower: vocational education
narrower: educational grading
narrower: online and remote learning

parents group
type: Concept
preferred label: Eltern @de
preferred label: Parents d'élèves @fr
preferred label: Asociaciones de padres de alumnos @es
preferred label: Föräldraföreningar @se
preferred label: منظمة الآباء @ar
preferred label: associações de pais @pt-pt
preferred label: forældrebestyrelse @dk
preferred label: 家长组织 @zh-hans
preferred label: foreldregruppe @no-nb
definition: Elterngruppen, die sich für die Schule engagieren @de
definition: Group of parents set up to support educational activities of their children
definition: Förskola som startats av en föräldraförening och sköts genom en, av denna, vald styrelse. @se
definition: Grupos de pais que se organizam para apoiar as atividades educacionais dos filhos. @pt-pt
definition: Gruppe af forældre nedsat for at støtte deres børns uddannelsesaktiviteter. @dk
definition: 为支持孩子的教育活动而成立的家长团体 @zh-hans
in scheme: Media Topic
created: 2009-10-22T02:00:00+00:00
modified: 2021-09-30T12:00:00+00:00
broader: education

religious education
type: Concept
preferred label: Religiös utbildning @se
preferred label: Educación religiosa @es
preferred label: تربية دينية @ar
preferred label: Religionserziehung @de
preferred label: Éducation religieuse @fr
preferred label: educação religiosa @pt-pt
preferred label: Educação religiosa @pt-br
preferred label: religiøs undervisning @dk
preferred label: 宗教教育 @zh-hans
preferred label: religionsutdanning @no-nb
definition: Förmedling av kunskaper om en religion, vanligtvis, men inte alltid, i skolor som drivs av religiösa organisationer. @se
definition: Instruction by any faith about that faith's principles and beliefs, including Sunday school or preparation for a religious rite, such as a bar mitzvah
definition: Einführung durch Gläubige in eine bestimmte oder andere Glaubensrichtungen, oft aber nicht immer in Schulen durch religiöse Institutionen. @de
definition: Instrução religiosa ou a propósito de religiões, geralmente, mas não sempre, ministrada em escolas dirigidas por religiosos. @pt-pt
definition: Formidling af viden om en religion, som regel, men ikke altid, i skoler, der drives af religiøse organisationer. @dk
definition: 任何被信仰指导，或者关于宗教信仰或其他信仰的指导，通常但不总是在宗教机构开办的学校中进行 @zh-hans
in scheme: Media Topic
created: 2009-10-22T02:00:00+00:00
modified: 2021-09-30T12:00:00+00:00
broader: education

school
type: Concept
preferred label: Schule @de
preferred label: Écoles, collèges, lycées @fr
preferred label: مدرسة @ar
preferred label: Escuelas @es
preferred label: Skola @se
preferred label: escolas @pt-pt
preferred label: skole @dk
preferred label: 学校 @zh-hans
preferred label: skoler @no-nb
preferred label: skular @no-nn
definition: A building or institution in which education is provided
definition: Institution där undervisning bedrivs. @se
definition: Gebäude oder Einrichtung, wo verschiedenartige Ausbildung angeboten wird. @de
definition: Edifício ou instituição onde educação de vários níveis é fornecida. @pt-pt
definition: Institution, hvor undervisning foregår. @dk
definition: 提供各种教育的建筑物或机构 @zh-hans
in scheme: Media Topic
created: 2009-10-22T02:00:00+00:00
modified: 2021-09-30T12:00:00+00:00
broader: education
narrower: primary education
narrower: further education
narrower: adult and continuing education
narrower: upper secondary education
narrower: college and university
narrower: lower secondary education
narrower: early childhood education
narrower: religious school
narrower: state school
narrower: private school
narrower: independent school

social learning
type: Concept
preferred label: Apprentissage social @fr
preferred label: Erziehung @de
preferred label: Uppfostran @se
preferred label: تعليم اجتماعي @ar
preferred label: Crianza @es
preferred label: aprendizagem social @pt-pt
preferred label: opdragelse @dk
preferred label: 社会学习 @zh-hans
preferred label: oppdragelse @no-nb
preferred label: oppdraging @no-nn
definition: Överföring av normer och värderingar från en generation till nästa. @se
definition: Soziale Kompetenz, die Eltern und andere vermitteln, während man heranwächst @de
definition: The learning of social skills and behaviours through the imitation and observation of others. This can include formal and informal instruction around empathy, emotions and mental health.
definition: Aprendizagem das competências sociais através dos pais e de outros à medida que o indivíduo cresce. @pt-pt
definition: At lære sociale kompetencer fra forældre og andre, når man vokser op. @dk
definition: 在成长过程中从父母和其他人那里学习社交能力 @zh-hans
definition: The learning of social skills and behaviors through the imitation and observation of others. This can include formal and informal instruction around empathy, emotions and mental health.
in scheme: Media Topic
created: 2009-10-22T02:00:00+00:00
modified: 2024-07-01T12:00:00+00:00
broader: education
broad match: http://cv.iptc.org/newscodes/subjectcode/05008000

teaching and learning
type: Concept
preferred label: Undervisning och lärande @se
preferred label: تعليم وتعلم @ar
preferred label: Pédagogie @fr
preferred label: Enseñanza y aprendizaje @es
preferred label: Lehren und Lernen @de
preferred label: ensino / aprendizagem @pt-pt
preferred label: ensino/aprendizado @pt-br
preferred label: undervisning og læring @dk
preferred label: 教学和学习 @zh-hans
preferred label: undervising og læring @no-nn
definition: Beide Eckpfeiler des Gleichgewichts in der Ausbildung @de
definition: Förmedling av kunskaper i organiserad form och på systematiskt sätt, särskilt i skola, och mottagandet av denna förmedling. @se
definition: Either end of the education equation
definition: Os dois objetivos da equação escolar: ensinar e aprender. @pt-pt
definition: Formidling af viden i organiseret form og på en systematisk måde, især i skolen, og modtagelse af denne formidling. @dk
definition: 教与学 @zh-hans
change note: Retired. Use more specific terms instead.
in scheme: Media Topic
created: 2009-10-22T02:00:00+00:00
retired: 2021-09-30T12:00:00+00:00
modified: 2021-09-30T12:00:00+00:00
broader: education

curriculum
type: Concept
preferred label: Malla curricular @es
preferred label: Programmes d'études @fr
preferred label: Läroplan @se
preferred label: برنامج تعليمي @ar
preferred label: Lehrplan @de
preferred label: currículo @pt-pt
preferred label: pensum @dk
preferred label: 课程 @zh-hans
preferred label: læreplan @no-nb
definition: Övergripande anvisningar om skolundervisningens innehåll, mål och metoder. @se
definition: Unterrichtseinheiten einer Bildungseinrichtung und deren Regularien @de
definition: The courses offered by a learning institution and the regulation of those courses
definition: Conjunto dos cursos oferecidos por uma instituição de ensino e regulamentação desses cursos. @pt-pt
definition: Omfattende instruktioner om skolens uddannelsesindhold, mål og metoder. @dk
definition: 学习机构提供的课程和这些课程的规定 @zh-hans
in scheme: Media Topic
created: 2009-10-22T02:00:00+00:00
modified: 2021-09-30T12:00:00+00:00
broader: education

educational testing and examinations
type: Concept
preferred label: Exámen @es
preferred label: Examen @fr
preferred label: Prov @se
preferred label: فحص @ar
preferred label: Prüfung @de
preferred label: exame @pt-pt
preferred label: prova @pt-br
preferred label: eksamen @dk
preferred label: 考试 @zh-hans
preferred label: eksamen og prøver @no-nb
preferred label: eksamen og prøvar @no-nn
definition: Formell utfrågning för fastställande av en elevs kunskapsnivå. @se
definition: Messung und Bewertung der Fertigkeiten von Schülern. @de
definition: Polices and standards around the testing and assessment of students, including the merits of standardised testing, and testing methods
definition: Medição do desempenho do estudante. @pt-pt
definition: Formel høring for at bestemme den studerendes vidensniveau. @dk
definition: 检查学生的成绩 @zh-hans
definition: Polices and standards around the testing and assessment of students, including the merits of standardized testing, and testing methods
in scheme: Media Topic
created: 2009-10-22T02:00:00+00:00
modified: 2021-09-30T12:00:00+00:00
broader: education
broad match: http://cv.iptc.org/newscodes/subjectcode/05010004

entrance examination
type: Concept
preferred label: Examen de admisión @es
preferred label: Aufnhameprüfung/Abschluss @de
preferred label: Antagningsprov @se
preferred label: امتحانات قبول @ar
preferred label: Examen ou concours d'entrée @fr
preferred label: exame de admissão @pt-pt
preferred label: optagelsesprøve @dk
preferred label: 入学考试 @zh-hans
preferred label: opptaksprøve @no-nb
definition: Prüfungen für die Aufnahme ins Gymnasium, zur Universität, Fachhochschulen und allen anderen Bildungseinrichtungen, inklusive Vorbereitung, die den Schülern bei der Examensprüfung helfen auch für weiterführende Schulen @de
definition: Exams for entering colleges, universities and all other higher and lower education institutions
definition: Tester för att komma in på olika utbildningar. @se
definition: Exames para entrar em universidades, institutos superiores e outras instituições de ensino. @pt-pt
definition: Test for at komme ind på forskellige kurser. @dk
definition: 进入大学、大学、初中和高中，以及所有其他高等和低等教育机构的考试，包括帮助学生准备进入名牌学校的考试的补习班 @zh-hans
in scheme: Media Topic
created: 2009-10-22T02:00:00+00:00
modified: 2021-09-30T12:00:00+00:00
broader: education

students
type: Concept
preferred label: Estudiantes @es
preferred label: طلاب @ar
preferred label: Schüler @de
preferred label: Étudiants @fr
preferred label: Elever @se
preferred label: alunos @pt-pt
preferred label: elev/studerende @dk
preferred label: 学生 @zh-hans
preferred label: elever og studenter @no-nb
preferred label: elevar og studentar @no-nn
definition: Menschen jeden Alters die sich in einer strukturellen Umgebung befinden, nicht notwendigerweise ein Klassenraum, um etwas zu lernen. @de
definition: Person som får undervisning. @se
definition: Students as a demographic, including student protests and requests for change and trends among students
definition: Pessoas de todas as idades em ambiente estruturado, não necessariamente uma sala de aula, para aprender alguma coisa. @pt-pt
definition: Person, der modtager undervisning. @dk
definition: 任何年龄层的人，在结构化的环境中（不一定是在教室里）进行学习 @zh-hans
in scheme: Media Topic
created: 2009-10-22T02:00:00+00:00
modified: 2021-09-30T12:00:00+00:00
broader: education

teachers
type: Concept
preferred label: Lehrender @de
preferred label: Profesores @es
preferred label: Lärare @se
preferred label: Enseignants @fr
preferred label: مدرسون @ar
preferred label: professores @pt-pt
preferred label: lærer @dk
preferred label: 老师 @zh-hans
preferred label: lærar @no-nn
definition: Teachers as a demographic, including teacher unions, teacher education and training and the criteria for teachers in various locations
definition: Menschen, die ihr Wissen anderen vermitteln @de
definition: Person som yrkesmässigt ägnar sig åt undervisning, mest i skola eller under skolliknande former. @se
definition: Pessoas dotadas de conhecimento e de meios e técnicas para o transmitir a outros. @pt-pt
definition: Person, der er professionelt engageret i undervisning, mest i skole eller i skolelignende former. @dk
definition: 有知识并能够把这些知识传授给别人的人 @zh-hans
in scheme: Media Topic
created: 2009-10-22T02:00:00+00:00
modified: 2021-09-30T12:00:00+00:00
broader: education

vocational education
type: Concept
preferred label: Yrkesutbildning @se
preferred label: ensino profissional @pt-pt
preferred label: erhvervsuddannelse @dk
preferred label: 职业教育 @zh-hans
preferred label: yrkesutdanning @no-nb
preferred label: Berufsausbildung @de
preferred label: Enseignement professionnel @fr
preferred label: Educación vocacional @es
preferred label: تعليم مهني @ar
definition: Education that provides students with practical experience and training in a particular occupational field. It is sometimes referred to as career education or technical education
definition: Utbildning som är planerad och genomförs för att ge de studerande kunskaper att direkt kunna utföra ett specifikt yrke. @se
definition: Educação que prepara os alunos, fornece experiência prática e treino num campo ocupacional específico. Por vezes é designada por educação profissional ou educação técnica. @pt-pt
definition: Educação que prepara os alunos, fornece experiência prática e treinamento em um campo ocupacional específico. Por vezes é designada por educação profissional ou educação técnica. @pt-br
definition: Uddannelse, der er planlagt og implementeret for at give de studerende viden om at kunne udføre et specifikt erhverv direkte. @dk
definition: 提供特定职业领域的实践经验和培训来培养学生的教育，有时被称为职业教育或技术教育 @zh-hans
definition: Eine Ausbildung, die die Studenten vorbereitet, bietet praktische Erfahrung und Ausbildung in einem bestimmten Berufsfeld. Sie wird manchmal auch als Berufsausbildung oder technische Ausbildung bezeichnet @de
in scheme: Media Topic
created: 2019-04-06T12:00:00+00:00
modified: 2021-09-30T12:00:00+00:00
broader: education

educational grading
type: Concept
preferred label: Betyg @se
preferred label: classificação @pt-pt
preferred label: karaktergivning @dk
preferred label: 教育评分 @zh-hans
preferred label: karaktersystem @no-nb
preferred label: pädagogische Einstufung @de
preferred label: Classement scolaire @fr
preferred label: Calificación educativa @es
preferred label: تصنيف مدرسي @ar
definition: The evaluation of a student's achievement on a test, assignment or course and the policies and methods around assigning those grades
definition: Värdera elevers kunskaper i olika ämnen efter det system och mätmetoder som gäller. Vanligt förekommande är bokstäver eller siffror. @se
definition: Nota ou avaliação do desempenho de um aluno num teste, tarefa ou determinado curso. @pt-pt
definition: Nota ou avaliação do desempenho de um aluno em um teste, tarefa ou determinado curso. @pt-br
definition: Et mærke eller måling af den studerendes præstation på en prøve, en opgave eller i et bestemt kursus. @dk
definition: 学生在考试，作业或特定课程中取得的成绩的标记或衡量标准 @zh-hans
definition: Eine Note oder ein Maß für die Leistung eines Studenten in einem Test, einer Aufgabe oder in einem bestimmten Kurs @de
in scheme: Media Topic
created: 2019-04-06T12:00:00+00:00
modified: 2021-09-30T12:00:00+00:00
broader: education

online and remote learning
type: Concept
preferred label: nett- og fjernundervisning @no-nb
preferred label: Distansundervisning @se
preferred label: Educación a distancia @es
preferred label: Enseignement à distance @fr
preferred label: سياسة تعليمية @ar
preferred label: E-Learning @de
definition: Learning where a student and teacher are not physically present in the same location. Instruction can occur synchronously or asynchronously and utilizes technology such as video conferencing, online assessments and video conferencing.
definition: Former av utbildning där läraren och eleven befinner sig på olika platser. Kan ske synkront med digitala hjälpmedel eller asynkront med inspelat eller förberett material. @se
definition: Undervisning der lærar og elev/student ikkje er på den same fysiske staden. @no-nn
definition: Undervisning der lærer og elver/studenter ikke er på samme fysiske sted. @no-nb
definition: Lernen, bei dem Schüler und Lehrer nicht physisch am selben Ort anwesend sind. Der Unterricht kann synchron oder asynchron erfolgen und nutzt Technologien wie Videokonferenzen, Online-Bewertungen und Videokonferenzen. @de
in scheme: Media Topic
created: 2021-09-30T12:00:00+00:00
modified: 2021-12-21T12:00:00+00:00
broader: education

environment
type: Concept
preferred label: Environnement @fr
preferred label: Medio ambiente @es
preferred label: بيئة @ar
preferred label: Miljö och natur @se
preferred label: Umwelt @de
preferred label: ambiente @pt-pt
preferred label: miljø og natur @dk
preferred label: 环境 @zh-hans
preferred label: natur og miljø @no-nb
definition: The protection, damage, and condition of the ecosystem of the planet Earth and its surroundings
definition: Alle Aspekte des Schutzes, der Zerstörung und die Bedingungen des Ökosystems der Erde und ihrer Umgebung @de
definition: Alla aspekter av skydd, skador och hälsa hos planetens ekosystem, med omnejd. Alternativa energikällor, bevarande av arter, energisparande, miljöpolitik, miljöförstöring, naturtillgångar, naturen, befolkningsfrågor, avfall, vattentillgångar. @se
definition: Todos os aspetos relativos a proteção, estragos e preservação do ecossistema do planeta Terra e do seu ambiente. @pt-pt
definition: Todos os aspetos relativos a proteção, estragos e preservação do ecossistema do planeta Terra e de seu ambiente. @pt-br
definition: Alle aspekter af beskyttelse, skader og tilstand på planetens økosystem og dens omgivelser. @dk
definition: 关于地球生态系统及其周围的保护、破坏和状况的各个方面 @zh-hans
in scheme: Media Topic
created: 2009-10-22T02:00:00+00:00
modified: 2025-10-09T12:00:00+00:00
narrower: climate change
narrower: conservation
narrower: environmental pollution
narrower: natural resource
narrower: nature
narrower: sustainability

climate change
type: Concept
preferred label: Changement climatique @fr
preferred label: Cambio climático @es
preferred label: Klimatförändringar @se
preferred label: Klimaveränderung @de
preferred label: تبدل مناخي @ar
preferred label: alterações climáticas @pt-pt
preferred label: klimaforandring @dk
preferred label: 气候变化 @zh-hans
preferred label: klimaendringer @no-nb
preferred label: klimaendringar @no-nn
definition: Signifikante Änderungen bei der Messung von Klima (wie Temperatur, Niederschlag oder Wind) über einen ausgedehnten Zeitraum @de
definition: Förändring hos klimatet (temperatur, nederbörd, vind) på en enstaka plats, i en region eller på jorden som helhet, över en längre period. @se
definition: All issues relating to extreme changes in climate, including rising global temperature, debate on the causes and solutions of global warming, greenhouse gases and ways to reduce emissions
definition: Mudança significativa nas medições médias relativas ao clima (como temperatura, precipitação ou vento), que se mantém por um período longo. @pt-pt
definition: Klimaændringer (temperatur, nedbør, vind) på et enkelt sted, i en region eller på jorden som helhed over en længere periode. @dk
definition: 持续较长时间的气候测量值(如温度、降水或风)的显著变化 @zh-hans
in scheme: Media Topic
created: 2009-10-22T02:00:00+00:00
modified: 2025-06-30T12:00:00+00:00
broader: environment
narrower: global warming

conservation
type: Concept
preferred label: Preservación @es
preferred label: حفظ @ar
preferred label: Naturvård @se
preferred label: Protection de la nature @fr
preferred label: Naturschutz @de
preferred label: conservação @pt-pt
preferred label: naturbevaring @dk
preferred label: 环境保护 @zh-hans
preferred label: miljøvern @no-nb
definition: Erhaltung der Wildnis, Flora und Fauna, inklusive aussterbender Arten. @de
definition: Förebyggande skydd och vård av naturen. @se
definition: Preservation of the natural world, such as wilderness areas, flora and fauna
definition: Preservação de áreas selvagens, flora e fauna, incluindo extinção de espécies. @pt-pt
definition: Forebyggende beskyttelse og pleje af naturen. @dk
definition: 荒原、植物、动物的保护，以及物种灭绝等 @zh-hans
in scheme: Media Topic
created: 2009-10-22T02:00:00+00:00
modified: 2025-06-30T12:00:00+00:00
broader: environment
narrower: energy saving
narrower: nature preserve

environmental pollution
type: Concept
preferred label: Umweltverschmutzung @de
preferred label: Contaminación ambiental @es
preferred label: Pollution de l'environnement @fr
preferred label: Föroreningar @se
preferred label: تلوث بيئي @ar
preferred label: poluição ambiental @pt-pt
preferred label: forurening @dk
preferred label: 环境污染 @zh-hans
preferred label: forurensning @no-nb
preferred label: forureining @no-nn
definition: The contamination of natural resources by harmful substances
definition: Ämnen som blivit över när man framställt något eller använt det och som sprids där man inte vill ha det, i vatten, mark och luft. @se
definition: Verschmutzung von Luft, Wasser, Land etc. durch schädliche Stoffe @de
definition: Contaminação de ar, água, terra, etc., por substâncias nocivas. @pt-pt
definition: Contaminação de ar, água, terra etc., por substâncias nocivas. @pt-br
definition: Skadeliges stoffers betydning for forringelsen af luft, jord og vand. @dk
definition: 有害物质对空气、水、土地等的破坏 @zh-hans
in scheme: Media Topic
created: 2009-10-22T02:00:00+00:00
modified: 2025-10-09T12:00:00+00:00
broader: environment
narrower: air pollution
narrower: environmental clean-up
narrower: hazardous material
narrower: waste material
narrower: water pollution

natural resource
type: Concept
preferred label: Recursos naturales @es
preferred label: Naturresurser @se
preferred label: Ressourcen @de
preferred label: موارد طبيعية @ar
preferred label: Ressources naturelles @fr
preferred label: recursos naturais @pt-pt
preferred label: naturressource @dk
preferred label: 自然资源 @zh-hans
preferred label: naturressurs @no-nb
definition: Miljöfrågor som rör användbara tillgångar i naturen. @se
definition: Assets afforded by nature without human intervention that can be used for various purposes, such as providing energy or industrial materials
definition: Umweltangelegenheiten bezogen auf die Ausbeutung der natürlichen Ressourcen durch die menschliche Verwertung. @de
definition: Questões ambientais relativas à exploração de recursos naturais. @pt-pt
definition: Miljøspørgsmål i forbindelse med udnyttelse af naturressourcer. @dk
definition: 与自然资源开发相关的环境问题 @zh-hans
in scheme: Media Topic
created: 2009-10-22T02:00:00+00:00
modified: 2025-06-30T12:00:00+00:00
broader: environment
narrower: energy resources
narrower: land resources
narrower: population growth
narrower: renewable energy
narrower: water

nature
type: Concept
preferred label: Nature @fr
preferred label: Natur @de
preferred label: Naturaleza @es
preferred label: طبيعة @ar
preferred label: natureza @pt-pt
preferred label: natur @dk
preferred label: 自然 @zh-hans
preferred label: naturen @no-nb
definition: The natural world
definition: Allt som har med den naturliga världen att göra. @se
definition: Gesamtheit von Flora und Fauna @de
definition: O mundo natural na sua totalidade. @pt-pt
definition: O mundo natural em sua totalidade. @pt-br
definition: Alt, hvad der har at gøre med den naturlige verden. @dk
definition: 整个自然界 @zh-hans
in scheme: Media Topic
created: 2009-10-22T02:00:00+00:00
modified: 2025-10-09T12:00:00+00:00
broader: environment
narrower: forest
narrower: mountain
narrower: ocean
narrower: river
narrower: wetland
narrower: ecosystem
narrower: endangered species
narrower: invasive species
narrower: animal
narrower: flowers and plants

sustainability
type: Concept
preferred label: berekraft @no-nn
preferred label: bærekraft @no-nb
preferred label: Hållbarhet @se
preferred label: Nachhaltigkeit @de
definition: Actions by organizations, governments, and individuals in response to environmental problems
definition: Åtgärder av företag, myndigheter och personer för att motverka miljöförstöring, klimatförändring och liknande. @se
definition: Maßnahmen von Unternehmen, Regierungen und Einzelpersonen zur Bekämpfung der wichtigsten Umweltprobleme, einschließlich Klimawandel, Verlust der biologischen Vielfalt, Verlust von Ökosystemleistungen, Bodendegradation sowie Luft- und Wasserverschmutzung @de
in scheme: Media Topic
created: 2023-10-02T12:00:00+00:00
modified: 2025-10-09T12:00:00+00:00
broader: environment

health
type: Concept
preferred label: Santé @fr
preferred label: Medizin, Gesundheit @de
preferred label: صحة @ar
preferred label: Medicin och hälsa @se
preferred label: Salud @es
preferred label: saúde @pt-pt
preferred label: sundhed @dk
preferred label: 卫生 @zh-hans
preferred label: helse og medisin @no-nb
definition: Ämnen som rör människors fysiska och mentala hälsa. @se
definition: All aspects of physical and mental well-being
definition: Alle Aspekte des körperlichen und geistigen Wohlbefindens von Menschen. @de
definition: Todos os aspetos relativos ao bem-estar físico e mental dos seres humanos. @pt-pt
definition: Todos os aspectos relativos ao bem-estar físico e mental dos seres humanos. @pt-br
definition: Alle aspekter vedrørende levende væseners fysiske og mentale velfærd. @dk
definition: 与人类的身体和精神福利相关的方方面面 @zh-hans
in scheme: Media Topic
created: 2009-10-22T02:00:00+00:00
modified: 2022-06-14T12:00:00+00:00
narrower: disease and condition
narrower: health facility
narrower: health organisation
narrower: health treatment and procedure
narrower: government health care
narrower: health insurance
narrower: private health care
narrower: medical profession
narrower: non-human diseases
narrower: public health

disease and condition
type: Concept
preferred label: Maladies et état de santé @fr
preferred label: Krankheit @de
preferred label: Sjukdomar och sjukdomstillstånd @se
preferred label: امراض وظروف @ar
preferred label: Enfermedades @es
preferred label: doenças e condições @pt-pt
preferred label: sygdom og sygdomstilstand @dk
preferred label: 疾病和病况 @zh-hans
preferred label: sykdommer og sykdomstilstander @no-nb
preferred label: sjukdommar og sjukdomstilstandar @no-nn
definition: Any health conditions affecting humans
definition: Jeder gesundheitsgefährdende oder zerstörerische Zustand @de
definition: Alla skadliga eller destruktiva hälsotillstånd som påverkar människor. @se
definition: Qualquer condição de saúde lesiva ou destrutiva que afete seres humanos. @pt-pt
definition: Enhver skadelig eller destruktiv helbredstilstand, der påvirker mennesker. @dk
definition: 影响人类的所有有害或破坏性的健康状况 @zh-hans
definition: Alle helsetilstandar som påverkar menneske. @no-nn
definition: Alle helsetilstander som påvirker mennesker @no-nb
in scheme: Media Topic
created: 2009-10-22T02:00:00+00:00
modified: 2022-06-14T12:00:00+00:00
broader: health
narrower: cancer
narrower: communicable disease
narrower: heart disease
narrower: illness
narrower: injury
narrower: medical condition
narrower: mental health and disorder
narrower: poisoning
narrower: developmental disorder
broad match: http://cv.iptc.org/newscodes/subjectcode/07001000

health facility
type: Concept
preferred label: Centre de soins @fr
preferred label: Vårdinrättningar @se
preferred label: منشأة صحية @ar
preferred label: Gesundheitseinrichtung @de
preferred label: Establecimientos de salud @es
preferred label: estabelecimento de saúde @pt-pt
preferred label: sundhedsfacilitet @dk
preferred label: 医疗设施 @zh-hans
preferred label: helsefasiliteter @no-nb
preferred label: helsefasilitetar @no-nn
definition: Einrichtungen die genutzt werden für jede Art der Gesundheitsfürsorge @de
definition: Inrättningar som används för alla former av hälso- och sjukvård. @se
definition: Facilities used for any kind of health care
definition: Instalações usadas para qualquer tipo de cuidados de saúde. @pt-pt
definition: Faciliteter, der bruges til enhver form for sundhedsydelser. @dk
definition: 用于任何医疗保健的设施 @zh-hans
definition: Fasilitetar og installasjonar som blir nytt til å yte helsehjelp. @no-nn
definition: Fasiliteter og installasjoner som brukes til å yte helsehjelp. @no-nb
in scheme: Media Topic
created: 2009-10-22T02:00:00+00:00
modified: 2022-06-14T12:00:00+00:00
broader: health
narrower: hospital
narrower: healthcare clinic
broad match: http://cv.iptc.org/newscodes/subjectcode/07010000

health organisation
type: Concept
preferred label: Hälsovårdsorganisationer @se
preferred label: Organisations de santé @fr
preferred label: منظمات صحية @ar
preferred label: Organizaciones de salud @es
preferred label: Gesundheitsorganisation @de
preferred label: organizações de saúde @pt-pt
preferred label: sundhedsorganisation @dk
preferred label: 卫生组织 @zh-hans
preferred label: helseorganisasjon @no-nb
preferred label: health organization
definition: Spezielle Gesundheitsorganisationen, inklusive professionelle Zusammenschlüsse, non-profit und internationale Gruppen. @de
definition: Specific health organisations, including professional associations, non-profit and international groups
definition: Specifika organsationer inriktade på hälso- och sjukvård, såsom yrkesorganisationer och internationella grupperingar. @se
definition: Organizações de saúde específicas, incluindo associações profissionais, organismos sem fins lucrativos e grupos internacionais. @pt-pt
definition: Specifikke organisationer fokuseret på sundhedsvæsen, såsom patientforeninger, faglige organisationer og internationale grupper. @dk
definition: 特定的卫生组织，包括专业协会、非营利性国际组织 @zh-hans
definition: Specific health organizations, including professional associations, non-profit and international groups
in scheme: Media Topic
created: 2009-10-22T02:00:00+00:00
modified: 2022-06-14T12:00:00+00:00
broader: health

health treatment and procedure
type: Concept
preferred label: Behandlingar @se
preferred label: Tratamiento de salud @es
preferred label: Traitements @fr
preferred label: Medizinische Behandlung @de
preferred label: علاج صحي @ar
preferred label: tratamento de saúde @pt-pt
preferred label: sundhedsbehandling @dk
preferred label: 健康治疗 @zh-hans
preferred label: medisinsk behandling @no-nb
definition: Remedies, therapies, interventions, medications, testing and treatments to prevent, diagnose, manage or improve a health condition
definition: Aktiv vård av människa som lider av sjukdom. @se
definition: Behandlung von Krankheiten und Heilungsbedingungen @de
definition: Em geral, tratamento de doenças e de outras condições para gerar bem-estar. @pt-pt
definition: Aktiv pleje af mennesker, der lider af sygdom. @dk
definition: 通过常用疾病治疗方法和其他条件恢复健康 @zh-hans
in scheme: Media Topic
created: 2009-10-22T02:00:00+00:00
modified: 2022-06-14T12:00:00+00:00
broader: health
narrower: diet
narrower: non-prescription drug
narrower: prescription drug
narrower: medical test
narrower: health care approach
narrower: physical fitness
narrower: preventative medicine
narrower: vaccine
narrower: therapy
narrower: drug rehabilitation
narrower: emergency care
narrower: surgery

government health care
type: Concept
preferred label: رعاية طبية حكومية @ar
preferred label: Offentlig sjukvård @se
preferred label: Atención estatal de salud @es
preferred label: Soins de santé publics @fr
preferred label: Gesetzliche Krankenversicherung @de
preferred label: sistema público de saúde @pt-pt
preferred label: offentlig sygesikring @dk
preferred label: 政府医疗保健 @zh-hans
preferred label: helsevesen @no-nb
definition: Gesundheitsfürsorge, die von der Regierung unterstützt wird @de
definition: Sjukvård som tillhandahålles av staten. @se
definition: Health care provided by governments at any level
definition: Cuidados de saúde fornecidos pelos governos nacionais. @pt-pt
definition: Sundhedspleje leveret af staten. @dk
definition: 指政府提供的医疗保健 @zh-hans
definition: Helsetilbod administrert og levert av offentlege styresmakter. @no-nn
definition: Helsetilbud administrert og levert av offentlige myndigheter @no-nb
in scheme: Media Topic
created: 2009-10-22T02:00:00+00:00
modified: 2022-06-14T12:00:00+00:00
broader: health
narrower: Medicaid
narrower: Medicare

health insurance
type: Concept
preferred label: Zusatzversicherung @de
preferred label: تأمين صحي @ar
preferred label: Assurance maladie @fr
preferred label: Sjukförsäkringar @se
preferred label: Seguro de salud @es
preferred label: seguro de saúde @pt-pt
preferred label: privat sygesikring @dk
preferred label: 健康保险 @zh-hans
preferred label: helseforsikring @no-nb
definition: Privat försäkring som vid sjukdom och olycksfall ger ersättning för kostnader som läkararvoden, sjukhusvård, operation med mera. @se
definition: Versicherung, die besondere medizinische Kosten übernimmt @de
definition: Insurance covering medical costs
definition: Seguro que cobre custos médicos extraordinários. @pt-pt
definition: Privat forsikring, som i tilfælde af sygdom og ulykke giver godtgørelse for omkostninger såsom medicinske udgifter, hospital pleje, operation og mere. @dk
definition: 保险覆盖的超常规的医疗费用 @zh-hans
in scheme: Media Topic
created: 2009-10-22T02:00:00+00:00
modified: 2022-06-14T12:00:00+00:00
broader: health

private health care
type: Concept
preferred label: القطاع الصحي الخاص @ar
preferred label: Private Krankenversicherung @de
preferred label: Soins de santé privés @fr
preferred label: Privat sjukvård @se
preferred label: Medicina privada @es
preferred label: sistemas privados de saúde @pt-pt
preferred label: privat sundhedspleje @dk
preferred label: 私人健康护理 @zh-hans
preferred label: privat helsevesen @no-nb
definition: Health care provided by private organisations
definition: Gesundheitsfürsorge, die von privat finanzierten oder Versicherungsorganisationen unterstützt wird @de
definition: Sjukvård som tillhandahålles av privat finansierade eller försäkrade organisationer. @se
definition: Cuidados de saúde fornecidos por organizações de fundos ou seguros privados. @pt-pt
definition: Sundhedsydelser leveret af privatfinansierede organisationer. @dk
definition: 私人资助或保险机构提供的医疗保健服务 @zh-hans
definition: Health care provided by private organizations
in scheme: Media Topic
created: 2009-10-22T02:00:00+00:00
modified: 2022-06-14T12:00:00+00:00
broader: health

medical profession
type: Concept
preferred label: Vårdyrken @se
preferred label: Profesión médica @es
preferred label: مهنة طبية @ar
preferred label: Medizin @de
preferred label: Profession médicale @fr
preferred label: profissão médica @pt-pt
preferred label: sundhedspersonale @dk
preferred label: 医疗职业 @zh-hans
preferred label: helse- og omsorgsyrker @no-nb
preferred label: helse- og omsorgsyrke @no-nn
definition: Beruf, der ein spezielles Studium in Diagnostik, Behandlung Pflege und Prävention von Krankheiten, Verletzungen und medizinische Bedingungen verlangt. @de
definition: Profession som kräver formell träning i studiet, diagnosticeringen, behandlingen och förebyggandet av sjukdom eller skada. @se
definition: Profession requiring formal training in the study, diagnosis, treatment, care and prevention of disease, medical condition or injury
definition: Profissão que requer formação formal no estudo, diagnóstico, tratamento, cuidado e prevenção de doenças, condições médicas ou lesões. @pt-pt
definition: Erhverv, der kræver formel træning i undersøgelsen, diagnose, behandling, pleje og forebyggelse af sygdom, medicinsk tilstand eller skade. @dk
definition: 需要在研究、诊断、治疗、护理和预防疾病、疾病病情或损伤方面接受正规培训的职业 @zh-hans
in scheme: Media Topic
created: 2009-10-22T02:00:00+00:00
modified: 2022-06-14T12:00:00+00:00
broader: health
narrower: medical service
narrower: medical specialisation
narrower: medical staff
broad match: http://cv.iptc.org/newscodes/subjectcode/07006000

non-human diseases
type: Concept
preferred label: امراض غير بشرية @ar
preferred label: Icke-mänskliga sjukdomar @se
preferred label: Nicht-menschliche Krankheit @de
preferred label: Enfermedades no humanas @es
preferred label: Maladies non-humaines @fr
preferred label: doenças não humanas @pt-pt
preferred label: ikke-menneskelig sygdom @dk
preferred label: 非人类疾病 @zh-hans
preferred label: ikke-menneskelige sykdommer @no-nb
preferred label: ikkje-menneskelege sjukdommar @no-nn
definition: Skadliga eller destruktiva hälsotillstånd som drabbar djur, växter och mikroorganismer. @se
definition: Jeder gesundheitsgefährdende oder zerstörerische Zustand der Tiere, Pflanzen oder Mikroorganismen betrifft @de
definition: Any harmful or destructive health condition affecting animals, plants or microorganisms.
definition: Qualquer condição de saúde lesiva ou destrutiva que afete animais, plantas ou microrganismos. @pt-pt
definition: Enhver skadelig eller destruktiv helbredstilstand, der påvirker dyr, planter eller mikroorganismer. @dk
definition: 影响动物、植物或微生物的健康的有害或破坏性状况 @zh-hans
change note: Retired. Use medtop:20000494 animal disease or medtop:20000495 plant disease instead.
in scheme: Media Topic
created: 2009-10-22T02:00:00+00:00
retired: 2022-06-14T12:00:00+00:00
modified: 2022-06-14T12:00:00+00:00
broader: health
broad match: http://cv.iptc.org/newscodes/subjectcode/07001000

public health
type: Concept
preferred label: Salud pública @es
preferred label: Santé publique @fr
preferred label: صحة عامة @ar
preferred label: folkehelse @no-nn
preferred label: Öffentliche Gesundheit @de
preferred label: Folkhälsa @se
definition: Organised public or private measures designed to prevent disease, promote health and prolong life among the population as a whole
definition: Organized public or private measures designed to prevent disease, promote health and prolong life among the population as a whole
definition: Offentliga eller privat organiserade åtgärder för att förebygga sjukdomar, förbättra hälsan och öka livslängden hos befolkningen. @se
definition: Organisierte öffentliche oder private Maßnahmen, die der Vorbeugung von Krankheiten, der Förderung der Gesundheit und der Verlängerung des Lebens der gesamten Bevölkerung dienen @de
in scheme: Media Topic
created: 2022-06-14T12:00:00+00:00
modified: 2022-06-14T12:00:00+00:00
broader: health

human interest
type: Concept
preferred label: Vermischtes @de
preferred label: قضية انسانية @ar
preferred label: Mänskligt @se
preferred label: Gens animaux insolite @fr
preferred label: Interés humano, animales, insólito @es
preferred label: interesse humano @pt-pt
preferred label: folk og fæ @dk
preferred label: 人性 @zh-hans
preferred label: folk og fe @no-nb
definition: Lättare berättelser om individer, grupper av människor, djur eller ting. @se
definition: Item that discusses individuals, groups, animals, plants or other objects in an emotional way
definition: Artikel über Einzelpersonen, Gruppen, Tiere, Pflanzen oder andere Objekte mit Blick auf emotionale Aspekte @de
definition: Temas sobre indivíduos, grupos, animais, plantas ou outros objetos, com foco em aspetos emocionais. @pt-pt
definition: Historier om enkeltpersoner, grupper, dyr, planter eller andre genstande med fokus på følelsesmæssige facetter. @dk
definition: 关于个人、团体、动物、植物或其他关注情感层面方面的条目 @zh-hans
definition: Forteljingar om menneske dyr og anna, gjerne med vektlegging av kjenslemessige aspekt. @no-nn
definition: Fortellinger om mennesker dyr og annet, gjerne med fokus på følelsesmessige aspekter. @no-nb
in scheme: Media Topic
created: 2009-10-22T02:00:00+00:00
modified: 2021-05-05T12:00:00+00:00
narrower: accomplishment
narrower: award and prize
narrower: record and achievement
narrower: ceremony
narrower: people
narrower: human mishap
narrower: high society
narrower: celebrity
narrower: anniversary
narrower: birthday

accomplishment
type: Concept
preferred label: Erungenschaft @de
preferred label: Logros @es
preferred label: انجاز @ar
preferred label: Prestationer @se
preferred label: Succès @fr
preferred label: feitos @pt-pt
preferred label: præstation @dk
preferred label: 成就 @zh-hans
preferred label: prestasjon @no-nb
definition: Achievements by individuals or groups, animals, plants or other objects, such as winning a competitive contest etc
definition: Nicht-sportliche Leistungen eines Einzelnen oder einer Gruppe, Tiere, Pflanzen oder andere Objekte, wie Gewinnen eines Wettbewerbs etc. @de
definition: Bedrift av person eller grupp, djur, växter eller andra objekt, t ex att vinna en tävling. @se
definition: Conquistas de indivíduos ou grupos, animais, plantas ou outros objetos, como ganhar uma competição, etc. @pt-pt
definition: Conquistas de indivíduos ou grupos, animais, plantas ou outros objetos, como ganhar uma competição etc. @pt-br
definition: Præstationer fra enkeltpersoner eller grupper, dyr, planter eller andre genstande, såsom at vinde en konkurrencepræget konkurrence. @dk
definition: 由个人或团体，动物、植物或其他对象获得的成就，例如在比赛中获胜等 @zh-hans
change note: 2021-05-05: Retired. Use award and prize (20000498) or record and achievement (20000499) instead.
in scheme: Media Topic
created: 2009-10-22T02:00:00+00:00
retired: 2021-05-05T12:00:00+00:00
modified: 2021-05-05T12:00:00+00:00
broader: human interest

award and prize
type: Concept
preferred label: Auszeichnung und Preis @de
preferred label: Utmärkelser och priser @se
preferred label: مكافات وجوائز @ar
preferred label: Prix et récompenses @fr
preferred label: Premios @es
preferred label: prémios e recompensas @pt-pt
preferred label: prêmios e galardões @pt-br
preferred label: pris og præmie @dk
preferred label: 奖励 @zh-hans
preferred label: priser og utmerkelser @no-nb
preferred label: heidersteikn @no-nn
definition: Hedersbetygelser och belöning för viss prestation, inklusive sådana utdelade av staten. @se
definition: The recognition of an achievement in a field in the form of a symbolic item, such as a plaque or trophy or in the form of a monetary gift, such as a cash prize or grant, given by a government or private institution
definition: Orden, Auszeichnungen und Preise inklusive der, die durch die Regierung vergeben werden. @de
definition: Condecorações, prémios e recompensas, incluindo os que são atribuídos pelo governo. @pt-pt
definition: Condecorações, prêmios e recompensas, incluindo os que são atribuídos pelo governo. @pt-br
definition: Ære og belønning for en eller anden præstation, herunder dem, der tildeles af staten. @dk
definition: 包括政府颁发的勋章、奖状、奖品、奖金 @zh-hans
in scheme: Media Topic
created: 2009-10-22T02:00:00+00:00
modified: 2021-05-05T12:00:00+00:00
broader: human interest

record and achievement
type: Concept
preferred label: Récord @es
preferred label: رقم قياسي @ar
preferred label: Rekord @se
preferred label: Record @fr
preferred label: recordes e proezas @pt-pt
preferred label: rekord @dk
preferred label: 纪录和成绩 @zh-hans
preferred label: rekorder @no-nb
preferred label: rekordar @no-nn
definition: Nicht-sportliche Leistung eines Einzelnen oder einer Gruppe, die neue Rekorde aufstellt, wie Rekord im Bücherlesen oder Luft anhalten. @de
definition: Resultat som överträffar tidigare presterade och som oftast kan anges i siffror, men som inte har med sport att göra. @se
definition: Non-sport achievement by an individual or group that sets a new record, such as most books read or holding one's breath the longest
definition: Proeza não desportiva, realizada por um indivíduo ou por um grupo, que estabelece um novo recorde, como o maior número de livros lidos, respiração sustida durante mais tempo, etc. @pt-pt
definition: Proeza não esportiva, realizada por um indivíduo ou por um grupo, que estabelece um novo recorde, como o maior número de livros lidos, respiração sustida durante mais tempo etc. @pt-br
definition: Resultater, der overgår tidligere udført, og som normalt kan angives i antal eller tid, men som ikke er relateret til sport. @dk
definition: 个人或团体取得的非体育运动纪录。如最大书籍阅读量、最长屏住呼吸等 @zh-hans
definition: Ikkje-sportslege rekordar. @no-nn
definition: Ikke-sportslige rekorder @no-nb
in scheme: Media Topic
created: 2009-10-22T02:00:00+00:00
modified: 2021-05-05T12:00:00+00:00
broader: human interest

ceremony
type: Concept
preferred label: Cérémonie @fr
preferred label: Ceremonier @se
preferred label: Zeremonie @de
preferred label: Ceremonia @es
preferred label: احتفال @ar
preferred label: cerimónia @pt-pt
preferred label: cerimônia @pt-br
preferred label: ceremoni @dk
preferred label: 仪式 @zh-hans
preferred label: seremoni @no-nb
definition: Rituals, such as dedications, wreath laying or celebrating the launching of a ship
definition: Icke-religiösa ritualer såsom kransnedläggning, skeppsdop och liknande. @se
definition: Rituale nicht-religiöser Art wie Weihung, Kranzniederlegungen, Schiffstaufen etc. @de
definition: Rituais de natureza não religiosa, como cerimónias de consagração, deposição de coroa de flores, lançamento de barcos, etc. @pt-pt
definition: Rituais de natureza não religiosa, como cerimônias de consagração, deposição de coroa de flores, lançamento de barcos etc. @pt-br
definition: Ikke-religiøse ritualer såsom kransenedlægning, dåb og lignende. @dk
definition: 非宗教仪式。如献礼、献花、轮船下水等 @zh-hans
in scheme: Media Topic
created: 2009-10-22T02:00:00+00:00
modified: 2021-05-05T12:00:00+00:00
broader: human interest
narrower: name ceremony
narrower: graduation
narrower: funeral and memorial service
narrower: wedding

people
type: Concept
preferred label: Gens @fr
preferred label: Människor @se
preferred label: Leute @de
preferred label: شخصيات @ar
preferred label: Interés humano @es
preferred label: pessoas @pt-pt
preferred label: personhistorie @dk
preferred label: 人 @zh-hans
preferred label: personlige fortellinger @no-nb
preferred label: personlege forteljingar @no-nn
definition: Individuals or groups with a focus on emotional facets
definition: Nyheter om individer eller grupper av människor där fokus ligger på känslomässiga saker. @se
definition: Einzelpersonen oder Gruppen mit Blick auf emotionale Aspekte @de
definition: Indivíduos ou grupos, com foco em facetas emocionais. @pt-pt
definition: Personer eller grupper med fokus på følelsesmæssige facetter. @dk
definition: 关注情感的个人或团体 @zh-hans
change note: 2021-05-05: Retired. Use more specific terms instead.
in scheme: Media Topic
created: 2009-10-22T02:00:00+00:00
retired: 2021-05-05T12:00:00+00:00
modified: 2021-02-18T12:00:00+00:00
broader: human interest

human mishap
type: Concept
preferred label: Missgeschick @de
preferred label: Mänsklig olycka @se
preferred label: Desgracia humana @es
preferred label: خطأ بشري @ar
preferred label: Mésaventures @fr
preferred label: desaires @pt-pt
preferred label: menneskeligt uheld @dk
preferred label: 人类事故 @zh-hans
preferred label: tabber og uhell @no-nb
preferred label: tabbar og uhell @no-nn
definition: Ungeschicktes Verhalten von Menschen @de
definition: Silly or stupid human errors
definition: Dumma mänskliga misstag. @se
definition: Erros humanos idiotas ou estúpidos. @pt-pt
definition: Dum, menneskelig fejl. @dk
definition: 愚蠢的人为事故 @zh-hans
in scheme: Media Topic
created: 2009-10-22T02:00:00+00:00
modified: 2021-05-12T12:00:00+00:00
broader: human interest

high society
type: Concept
preferred label: Society @de
preferred label: Gente @es
preferred label: مجتمع مخملي @ar
preferred label: Mondanités @fr
preferred label: Societeten @se
preferred label: alta sociedade @pt-pt
preferred label: overklasse @dk
preferred label: 社会名流 @zh-hans
preferred label: sosieteten @no-nb
definition: Nyheter om och beskrivningar av den högsta samhällsklassen, framför allt dess sällskapsliv. @se
definition: Life and behaviour of the rich and socialites
definition: Leben und Verhalten bekannter Leute @de
definition: Vida e comportamento de pessoas conhecidas. @pt-pt
definition: Nyheder om, og beskrivelser af, den højeste klasse i samfundet, især dets sociale liv. @dk
definition: 著名人物的生活和行为 @zh-hans
in scheme: Media Topic
created: 2009-10-22T02:00:00+00:00
modified: 2021-05-05T12:00:00+00:00
broader: human interest
narrower: royalty

celebrity
type: Concept
preferred label: Kändisar @se
preferred label: Prominenz @de
preferred label: مشاهير @ar
preferred label: Célébrités @fr
preferred label: Celebridades @es
preferred label: celebridades @pt-pt
preferred label: berømthed @dk
preferred label: 名人 @zh-hans
preferred label: kjendis @no-nb
definition: Life and behaviour of famous people
definition: Nyheter om och beskrivningar av kända människor. @se
definition: Leben und Verhalten berühmter Leute @de
definition: Vida e comportamento de pessoas famosas. @pt-pt
definition: Nyheder og beskrivelser af berømte mennesker. @dk
definition: 名人的生活和行为 @zh-hans
definition: Life and behavior of famous people
in scheme: Media Topic
created: 2009-10-22T02:00:00+00:00
modified: 2021-05-05T12:00:00+00:00
broader: human interest

anniversary
type: Concept
preferred label: Jubileum @se
preferred label: efeméride @pt-pt
preferred label: jubilæum @dk
preferred label: 周年纪念日 @zh-hans
preferred label: jubileum @no-nb
preferred label: Jahrestag @de
preferred label: Anniversaire @fr
preferred label: Aniversario @es
preferred label: ذكرى @ar
definition: The celebration or commemoration of a significant amount of years since an event or a notable person's birth or death
definition: Årsdag av en persons födelse, eller åminnelse av en händelse vid något intervall, typ 50 år sedan eller 75 år sedan @se
definition: Data de aniversário especial de um evento ou celebração de uma quantidade significativa de anos desde o nascimento de uma pessoa notável. @pt-pt
definition: En fejring af, at der er gået et bestemt antal år siden en bestemt begivenhed fandt sted. Kan både være en rund fødselsdag, en særlig bryllupsdag eller en længere ansættelse. @dk
definition: 纪念活动或庆祝名人出生若干年的特别纪念日 @zh-hans
definition: Ein besonderer Jahrestag eines Ereignisses oder die Feier einer bedeutenden Anzahl von Jahren seit der Geburt einer bemerkenswerten Person @de
in scheme: Media Topic
created: 2019-06-26T12:00:00+00:00
modified: 2021-07-12T12:00:00+00:00
broader: human interest

birthday
type: Concept
preferred label: Födelsedag @se
preferred label: aniversário @pt-pt
preferred label: fødselsdag @dk
preferred label: 生日 @zh-hans
preferred label: Geburtstag @de
preferred label: Anniversaire (jour de naissance) @fr
preferred label: Cumpleaños @es
preferred label: عيد ميلاد @ar
definition: A celebration on the anniversary of a person's birth.
definition: Årsdag av en persons födelse. @se
definition: Celebração realizada na data anual do nascimento de uma pessoa. @pt-pt
definition: Årsdagen for, hvornår en person blev født. @dk
definition: 庆祝一个人每年生日的活动 @zh-hans
definition: Eine Feier am jährlichen Geburtsdatum einer Person. @de
in scheme: Media Topic
created: 2019-06-26T12:00:00+00:00
modified: 2021-07-12T12:00:00+00:00
broader: human interest

labour
type: Concept
preferred label: Arbeit, Soziales @de
preferred label: Social @fr
preferred label: Arbete @se
preferred label: عمل @ar
preferred label: Mano de obra @es
preferred label: trabalho @pt-pt
preferred label: arbejde @dk
preferred label: 劳动 @zh-hans
preferred label: arbeidsliv @no-nb
preferred label: labor
definition: Sociala aspekter, organisationer, regler och förhållanden kring mänskliga ansträngningar för att generera inkomst, eller förse med service, samt ekonomisk ersättning till arbetslösa. Fackliga frågor, arbetslagstiftning, pensioner, arbetslöshet mm. @se
definition: Soziale Aspekte, Organisationen, Regeln und Bedingungen bezogen auf die bezahlte Arbeit von menschlicher Leistung, für eine Generation des Wohlstands oder Belohnung für Dienstleistungen und die wirtschaftliche Unterstützung bei Arbeitslosigkeit @de
definition: Social aspects, organisations, rules and conditions affecting the employment of human effort for the generation of wealth or provision of services and the economic support of the unemployed.
definition: Aspetos sociais, organizações, regras e condições que afetam o emprego e a produção de riqueza ou o fornecimento de serviços. Apoio económico aos desempregados. @pt-pt
definition: Aspectos sociais, organizações, regras e condições que afetam o emprego e a geração de riqueza ou o fornecimento de serviços. Apoio econômico aos desempregados. @pt-br
definition: Sociale aspekter, organisationer, regler og betingelser på arbejdsmarkedet. @dk
definition: 影响创造财富或提供服务的人力使用的社会因素、组织、规则和条件，以及提供失业者的经济支持 @zh-hans
definition: Social aspects, organizations, rules and conditions affecting the employment of human effort for the generation of wealth or provision of services and the economic support of the unemployed.
in scheme: Media Topic
created: 2009-10-22T02:00:00+00:00
modified: 2021-02-18T12:00:00+00:00
narrower: employment
narrower: employment legislation
narrower: labour market
narrower: labour relations
narrower: retirement
narrower: unemployment
narrower: unions

employment
type: Concept
preferred label: توظيف @ar
preferred label: Empleo @es
preferred label: Anställning @se
preferred label: Beschäftigung @de
preferred label: Emploi @fr
preferred label: emprego @pt-pt
preferred label: ansættelse @dk
preferred label: 就业 @zh-hans
preferred label: ansettelse @no-nb
preferred label: tilsetjing @no-nn
definition: The state of having work, usually paid, for a company, organisation, or individual
definition: En avtalad rättighet för någon att mot betalning utföra vissa arbetsuppgifter för arbetsgivare under kortare eller vanligen under längre tid. @se
definition: Arbeit für eine Organisation, in der Selbstständigkeit oder auch ehrenamtlich @de
definition: Trabalho para uma organização, para um indivíduo ou por conta própria, incluindo trabalho voluntário. @pt-pt
definition: Arbejder for en organisation, et individ eller er selvstændig, herunder frivilligt arbejde. @dk
definition: 为机构、个人或自雇工作，包括义务工作 @zh-hans
definition: The state of having work, usually paid, for a company, organization, or individual
in scheme: Media Topic
created: 2009-10-22T02:00:00+00:00
modified: 2021-02-18T12:00:00+00:00
broader: labour
narrower: commuting
narrower: apprenticeship
narrower: child labour
narrower: employee
narrower: employer
narrower: employment training
narrower: occupations
narrower: wages and benefits
narrower: self-employment
narrower: parental leave
narrower: volunteering

employment legislation
type: Concept
preferred label: قانون التوظيف @ar
preferred label: Législation du travail @fr
preferred label: Arbetsrätt @se
preferred label: Legislación laboral @es
preferred label: Arbeitsrecht @de
preferred label: legislação laboral @pt-pt
preferred label: legislação trabalhista @pt-br
preferred label: ansættelseslovgivning @dk
preferred label: 就业法案 @zh-hans
preferred label: arbeidsrett @no-nb
definition: Rättsregler som berör förhållandet mellan arbetstagare och arbetsgivare. @se
definition: Laws governing employment
definition: Gesetze, die Beschäftigung und Arbeit regeln. @de
definition: Leis que regem o trabalho. @pt-pt
definition: Juridiske regler, der påvirker forholdet mellem ansatte og arbejdsgivere. @dk
definition: 就业法 @zh-hans
in scheme: Media Topic
created: 2009-10-22T02:00:00+00:00
modified: 2021-02-18T12:00:00+00:00
broader: labour
narrower: workplace health and safety
broad match: http://cv.iptc.org/newscodes/subjectcode/09005000

labour market
type: Concept
preferred label: Arbetsmarknad @se
preferred label: Arbeitsmarkt @de
preferred label: Mercado de trabajo @es
preferred label: Marché du travail @fr
preferred label: سوق العمل @ar
preferred label: mercado de trabalho @pt-pt
preferred label: arbejdsmarked @dk
preferred label: 劳动力市场 @zh-hans
preferred label: arbeidsmarked @no-nb
preferred label: labor market
preferred label: arbeidsmarknader @no-nn
definition: Arbeitende und arbeitssuchende Bevölkerung. @de
definition: Den marknad där arbetsgivarna efterfrågar arbetskraft mot betalning, och där individerna utbjuder arbetskraft mot erhållande av lön. @se
definition: The supply and demand of labour in an economy
definition: Parte da população que está a trabalhar ou que está à procura de trabalho. @pt-pt
definition: Parte da população que está trabalhando ou que está procurando trabalho. @pt-br
definition: Marked, hvor arbejdsgivere kræver arbejdskraft mod betaling, og hvor enkeltpersoner tilbyder arbejdskraft til betaling af lønninger. @dk
definition: 又称就业市场，一群正在工作或正在找工作的人 @zh-hans
definition: The supply and demand of labor in an economy
in scheme: Media Topic
created: 2009-10-22T02:00:00+00:00
modified: 2021-02-18T12:00:00+00:00
broader: labour
narrower: gig economy

labour relations
type: Concept
preferred label: Relaciones laborales @es
preferred label: Anställningsförhållanden @se
preferred label: Relations du travail @fr
preferred label: Arbeitsbeziehung @de
preferred label: علاقات عمل @ar
preferred label: relações laborais @pt-pt
preferred label: relações trabalhistas @pt-br
preferred label: overenskomst @dk
preferred label: 劳动关系 @zh-hans
preferred label: partene i arbeidslivet @no-nb
preferred label: labor relations
preferred label: partane i arbeidslivet @no-nn
definition: Förhandlingar mellan arbetsgivare och arbetstagare. @se
definition: The relationship between workers and employers
definition: Das Geben und Nehmen zwischen Unternehmensführung und Beschäftigten @de
definition: Intercâmbio entre administração e empregados. @pt-pt
definition: Forhandlinger mellem arbejdsgivere og arbejdstagere. @dk
definition: 管理层和员工之间的相互让步 @zh-hans
in scheme: Media Topic
created: 2009-10-22T02:00:00+00:00
modified: 2021-02-18T12:00:00+00:00
broader: labour
narrower: collective agreements
narrower: labour dispute
broad match: http://cv.iptc.org/newscodes/subjectcode/09012000

retirement
type: Concept
preferred label: تقاعد @ar
preferred label: Jubilación @es
preferred label: Retraite @fr
preferred label: Ruhestand @de
preferred label: Pensionstiden @se
preferred label: reforma @pt-pt
preferred label: aposentadoria @pt-br
preferred label: pensionering @dk
preferred label: 退休 @zh-hans
preferred label: pensjonisttilværelse @no-nb
preferred label: pensjonisttilvære @no-nn
definition: Åren efter arbetslivet. @se
definition: The years after work
definition: Die Jahre nach der Berufstätigkeit. @de
definition: Os anos após o período ativo de trabalho. @pt-pt
definition: Årene efter arbejdslivet. @dk
definition: 工作后的那些年 @zh-hans
in scheme: Media Topic
created: 2009-10-22T02:00:00+00:00
modified: 2021-02-18T12:00:00+00:00
broader: labour
narrower: pension

unemployment
type: Concept
preferred label: Arbetslöshet @se
preferred label: Arbeitslosigkeit @de
preferred label: بطالة @ar
preferred label: Chômage @fr
preferred label: Desempleo @es
preferred label: desemprego @pt-pt
preferred label: arbejdsløshed @dk
preferred label: 失业 @zh-hans
preferred label: arbeidsledighet @no-nb
preferred label: arbeidsløyse @no-nn
definition: Das Fehlen von bezahlter Arbeit. @de
definition: The state of being available to work but not having a job
definition: Förhållande som råder när personer kan och vill arbeta och är aktivt arbetssökande men inte finner arbete. @se
definition: Facto de não ter trabalho, sendo capaz de trabalhar. @pt-pt
definition: Fato de não ter trabalho, sendo capaz de trabalhar. @pt-br
definition: Når personer der kan arbejde og aktivt søger arbejde, men ikke kan finde arbejde. @dk
definition: 能够工作但没有工作 @zh-hans
in scheme: Media Topic
created: 2009-10-22T02:00:00+00:00
modified: 2021-02-18T12:00:00+00:00
broader: labour
narrower: job layoffs
narrower: unemployment benefits

unions
type: Concept
preferred label: Gewerkschaft @de
preferred label: نقابات @ar
preferred label: Syndicats @fr
preferred label: Fackföreningar @se
preferred label: Sindicatos @es
preferred label: sindicatos @pt-pt
preferred label: fagforening @dk
preferred label: 工会 @zh-hans
preferred label: fagforeining @no-nn
definition: Sammanslutning av löntagare i syfte att tillvarata deras intressen och därmed utgöra motpart till arbetsgivare, på lokal eller riksomfattande nivå @se
definition: Etablierte Gruppen, um die Arbeiterschaft zu vertreten. @de
definition: Groups established to represent bodies of workers in order to obtain better workplace conditions through collective bargaining
definition: Grupos estabelecidos para representar classes de trabalhadores. @pt-pt
definition: Sammenslutning af arbejdere med henblik på at beskytte deres interesser og udgøre en modpart til arbejdsgivere på lokalt eller nationalt niveau. @dk
definition: 为代表工人团体而成立的组织 @zh-hans
in scheme: Media Topic
created: 2009-10-22T02:00:00+00:00
modified: 2021-02-18T12:00:00+00:00
broader: labour

lifestyle and leisure
type: Concept
preferred label: Estilo de vida y tiempo libre @es
preferred label: Fritid och livsstil @se
preferred label: Freizeit, Modernes Leben @de
preferred label: حياة يومية وترفيه @ar
preferred label: Vie quotidienne et loisirs @fr
preferred label: estilo de vida e lazer @pt-pt
preferred label: livsstil og fritid @dk
preferred label: 生活方式和休闲 @zh-hans
definition: Aktivitäten zum Vergnügen, zur Entspannung und Erholung, außerhalb von bezahlter Arbeit, inklusive Essen und Reisen @de
definition: Aktiviteter ägnade att ge njutning, avslappning, rekreation utanför betald arbetstid, inklusive mat och resor. Spel, tips och lotterier, gastronomi, hobbyer, semester, turism. @se
definition: Activities undertaken for pleasure, relaxation or recreation outside paid employment, including eating and travel.
definition: Atividades realizadas por prazer, para relaxamento ou divertimento, fora do emprego, incluindo comer e viajar. @pt-pt
definition: Aktiviteter, der udføres til glæde, afslapning eller rekreation uden for lønnet beskæftigelse, herunder spisning og rejse. @dk
definition: 从事有偿工作以外的娱乐、放松或娱乐活动 @zh-hans
in scheme: Media Topic
created: 2009-10-22T02:00:00+00:00
modified: 2021-05-05T12:00:00+00:00
narrower: leisure
narrower: lifestyle
narrower: wellness

leisure
type: Concept
preferred label: Freizeit @de
preferred label: Fritid @se
preferred label: Loisirs @fr
preferred label: Ocio @es
preferred label: ترفيه @ar
preferred label: lazer @pt-pt
preferred label: fritid @dk
preferred label: 休闲 @zh-hans
definition: Aktiviteter som utförs under en persons fritid och utan organiserade tävlingsinslag. @se
definition: Activities carried out in ones' spare time and not in a competitive way.
definition: Aktivitäten, die jemand in seiner freien Zeit ausübt. @de
definition: Atividades desenvolvidas no tempo livre e de forma não competitiva. @pt-pt
definition: Aktiviteter, der udføres i en persons fritid. @dk
definition: 在业余时间以非竞争方式进行的活动 @zh-hans
in scheme: Media Topic
created: 2009-10-22T02:00:00+00:00
modified: 2021-02-18T12:00:00+00:00
broader: lifestyle and leisure
narrower: club and association
narrower: game
narrower: gaming and lottery
narrower: hobby
narrower: holiday
narrower: leisure venue
narrower: outdoor recreational activities
narrower: travel and tourism
broad match: http://cv.iptc.org/newscodes/subjectcode/10010000

lifestyle
type: Concept
preferred label: Livsstil @se
preferred label: Lebensstil @de
preferred label: اسلوب حياة @ar
preferred label: Mode de vie @fr
preferred label: Estilo de vida @es
preferred label: estilo de vida @pt-pt
preferred label: livsstil @dk
preferred label: 生活方式 @zh-hans
definition: The way in which a person lives, including their style and possessions
definition: Yttre sätt att leva sitt liv. @se
definition: Lebensform und Kultur der eigenen Heimat @de
definition: Modo de vida de uma pessoa, incluindo o seu estilo e posses. @pt-pt
definition: Modo de vida de uma pessoa, incluindo seu estilo e posses. @pt-br
definition: Bevidst valgt måde, at indrette sit liv på som signalerer en bestemt social identitet. @dk
definition: 一个人的生活方式，包括他们的风格和财产 @zh-hans
in scheme: Media Topic
created: 2009-10-22T02:00:00+00:00
modified: 2021-02-18T12:00:00+00:00
broader: lifestyle and leisure
narrower: organic food
narrower: house and home
narrower: trend
narrower: party
narrower: vegetarianism and veganism
broad match: http://cv.iptc.org/newscodes/subjectcode/10000000

wellness
type: Concept
preferred label: velvære @no-nb
preferred label: Friskvård @se
preferred label: Bienestar @es
preferred label: Bien-être @fr
preferred label: رفاه @ar
preferred label: Wellness @de
definition: The active pursuit of good mental and physical health
definition: Att aktivt arbeta för att förbättra bra mental och fysisk hälsa. @se
definition: Das aktive Streben nach guter geistiger und körperlicher Gesundheit @de
in scheme: Media Topic
created: 2021-12-17T12:00:00+00:00
modified: 2021-12-21T12:00:00+00:00
broader: lifestyle and leisure
narrower: exercise and fitness
narrower: mental wellbeing

politics and government
type: Concept
preferred label: Política @es
preferred label: Politik och statsskick @se
preferred label: سياسة @ar
preferred label: Politik @de
preferred label: Politique @fr
preferred label: política @pt-pt
preferred label: politik @dk
preferred label: 政治 @zh-hans
preferred label: politikk @no-nb
definition: Politiskt arbete och maktutövning på alla nivåer, samt relationer mellan stater och regeringar. @se
definition: Local, regional, national and international exercise of power, the day-to-day running of government, and the relationships between governing bodies and states.
definition: Lokale, regionale, nationale und internationale Übungen der Stärke oder zur Erlangung von Stärke, und die Beziehung zwischen regierenden Einheiten und Staaten @de
definition: Exercício do poder local, regional, nacional e internacional ou luta pelo poder e relações entre governos e estados. @pt-pt
definition: Lokal, regional, national og international magtudøvelse såvel som forholdet mellem stater og regeringer. Forsvar, diplomati, valg, hjælpearbejde, flygtninge, regering, parlament, partier, offentligt budget, nationale og internationale aftaler. @dk
definition: 地方、区域、国家和国际权力的行使，或权力斗争，以及领导机构与国家之间的关系 @zh-hans
in scheme: Media Topic
created: 2009-10-22T02:00:00+00:00
modified: 2025-03-31T12:00:00+00:00
narrower: election
narrower: government
narrower: government policy
narrower: international relations
narrower: non-governmental organisation (NGO)
narrower: political crisis
narrower: political prisoners and dissenters
narrower: political process

election
type: Concept
preferred label: Elecciones @es
preferred label: Élections @fr
preferred label: انتخابات @ar
preferred label: Wahl @de
preferred label: Val @se
preferred label: eleições @pt-pt
preferred label: valg @dk
preferred label: 选举 @zh-hans
preferred label: val @no-nn
definition: Valet av politiska företrädare genom avgivandet av röster av befolkningen @se
definition: The selection of government representatives by the casting of votes by the populace
definition: Die Auswahl der Repräsentanten durch das Abgeben von Stimmen @de
definition: Seleção de representantes por votação. @pt-pt
definition: Valg af repræsentanter ved afstemning. @dk
definition: 通过投票选出代表 @zh-hans
in scheme: Media Topic
created: 2009-10-22T02:00:00+00:00
modified: 2024-09-26T12:00:00+00:00
broader: politics and government
narrower: citizens' initiative and recall
narrower: voting system
narrower: intergovernmental elections
narrower: local elections
narrower: national elections
narrower: political campaigns
narrower: campaign finance
narrower: political candidates
narrower: primary elections
narrower: referendum
narrower: regional elections
narrower: voting
narrower: church elections
narrower: political debates
narrower: by-election
narrower: recall election
narrower: coalition building

government
type: Concept
preferred label: Regierung @de
preferred label: Regering och riksdag @se
preferred label: Gobierno @es
preferred label: حكومة @ar
preferred label: Gouvernement @fr
preferred label: governo @pt-pt
preferred label: regering og Folketing @dk
preferred label: 政府 @zh-hans
preferred label: styresmakter @no-nb
preferred label: styresmakt @no-nn
definition: The systems, institutions and people who run a political entity
definition: Das regulierende System eines Landes @de
definition: Systemet för att styra ett land. @se
definition: Sistema que administra um país. @pt-pt
definition: Systemet for styring af et land. @dk
definition: 统治国家的组织 @zh-hans
in scheme: Media Topic
created: 2009-10-22T02:00:00+00:00
modified: 2025-03-31T12:00:00+00:00
broader: politics and government
narrower: civil and public service
narrower: government employee
narrower: public officials
narrower: constitution (law)
narrower: national security
narrower: executive (government)
narrower: government budget
narrower: government department
narrower: head of state
narrower: impeachment
narrower: local authority
narrower: minister or secretary (government)
narrower: national government
narrower: legislative body
narrower: regional authority
narrower: lobbying
narrower: political parties and movements
narrower: political development
narrower: political system
narrower: regulatory authority
narrower: political party convention
narrower: political committee
narrower: head of government
narrower: public inquiry
narrower: political leadership
narrower: political party
narrower: political movement and association

government policy
type: Concept
preferred label: Regeringsförklaring @se
preferred label: سياسة حكومة @ar
preferred label: Regierungspolitik @de
preferred label: Política del gobierno @es
preferred label: Politique du gouvernement @fr
preferred label: política governamental @pt-pt
preferred label: regeringspolitik @dk
preferred label: 政府政策 @zh-hans
preferred label: regjeringsplattform @no-nb
definition: Den plan och inriktning som en regering har för att påverka och styra beslut och åtgärder mot ett önskat resultat. @se
definition: An overall plan or course of action set out by a government intended to influence and guide decisions
definition: Ein umfassender Plan oder Kurs der Regierung, um Entscheidungen und Aktionen zu einem gewünschten Ergebnis zu bringen und zu steuern @de
definition: Plano global ou plano de ação estabelecido por um governo para influenciar e orientar decisões e ações em direção a um resultado desejado. @pt-pt
definition: En overordnet plan eller handlingsforløb, der er fastlagt af en regering, som har til formål at påvirke og lede beslutninger og handlinger mod et ønsket resultat. @dk
definition: 政府制定的总体计划或行动方针，旨在影响和指导决策和行动以达到预期的结果 @zh-hans
in scheme: Media Topic
created: 2009-10-22T02:00:00+00:00
modified: 2025-03-31T12:00:00+00:00
broader: politics and government
narrower: economic policy
narrower: environmental policy
narrower: healthcare policy
narrower: safety of citizens
narrower: taxation policy
narrower: interior policy
narrower: data protection policy
narrower: housing and urban planning policy
narrower: policy towards indigenous people
narrower: pension and welfare policy
narrower: personal data collection policy
narrower: personal weapon control policy
narrower: planning inquiries
narrower: immigration policy
narrower: nuclear policy
narrower: regulation of industry
narrower: cultural policy
narrower: integration policy
narrower: sports policies
narrower: regional development policy
narrower: infrastructure policy
narrower: local government policy
narrower: education policy
narrower: zoning policy
broad match: http://cv.iptc.org/newscodes/subjectcode/11006000

international relations
type: Concept
preferred label: Relaciones internacionales @es
preferred label: Internationella relationer @se
preferred label: Relations internationales @fr
preferred label: معاهدات ومنظمات دولية @ar
preferred label: Internationale Beziehung @de
preferred label: relações internacionais @pt-pt
preferred label: international forbindelse @dk
preferred label: 国际关系 @zh-hans
preferred label: internasjonal politikk @no-nb
definition: Nicht gewalttätige Beziehungen zwischen zwei Staaten in Form von Verhandlungen, Verträgen und persönliche Treffen @de
definition: Relations between nations through negotiation, treaty, or diplomacy
definition: Staters utrikespolitik och ömsesidiga relationer, t ex förhandlingar, avtal och diplomati. @se
definition: Relações não violentas entre nações através de negociações, tratados ou reuniões pessoais. @pt-pt
definition: Ikke-voldelige forhold mellem nationer gennem forhandling, traktat, diplomati eller personlige møder. @dk
definition: 国家间通过谈判、条约或私人会议建立的非暴力关系 @zh-hans
in scheme: Media Topic
created: 2009-10-22T02:00:00+00:00
modified: 2025-03-31T12:00:00+00:00
broader: politics and government
narrower: diplomacy
narrower: economic sanction
narrower: foreign aid
narrower: international organisation
narrower: refugees and internally displaced people
narrower: border dispute

non-governmental organisation (NGO)
type: Concept
preferred label: Icke-statlig organisation (NGO) @se
preferred label: Regierungsunabhängige Organisation @de
preferred label: Organisation non gouvernementale @fr
preferred label: Organización no gubernamental @es
preferred label: منظمة غير حكومية @ar
preferred label: organização não governamental @pt-pt
preferred label: NGO @dk
preferred label: 非政府组织 @zh-hans
preferred label: ikke-statlig organisasjon (NGO) @no-nb
preferred label: ikkje-statleg organisasjon (NGO) @no-nn
definition: Groups officially outside of government that lobby, demonstrate or campaign on a wide range of issues such as economics, the environment and healthcare
definition: Gruppen, offiziell außerhalb der Regierung stehend, die in einem größeren Themenspektrum Einfluss ausüben, demonstrieren, agieren wie Ökonomie, Umwelt, Gesundheit etc. @de
definition: Organisation eller grupp som fristående från staten och myndigheter utför arbete och agerar i allmänhetens intresse. @se
definition: Grupos não pertencentes ao governo que pressionam, protestam ou fazem campanha sobre vários assuntos como economia, meio ambiente, cuidados de saúde, etc. @pt-pt
definition: Grupos não pertencentes ao governo que pressionam, protestam ou fazem campanha sobre vários assuntos como economia, meio ambiente, cuidados de saúde etc. @pt-br
definition: Udpegning af alle ikke-statslige organisationer, såsom forskellige individuelle organisationer, aktionsgrupper, meningsgrupper, frivillige organisationer eller fagforeninger. @dk
definition: 政府以外的团体，就经济、环境、卫生保健等广泛问题进行游说、示威或运动 @zh-hans
in scheme: Media Topic
created: 2009-10-22T02:00:00+00:00
modified: 2025-03-31T12:00:00+00:00
broader: politics and government

political crisis
type: Concept
preferred label: Crise politique @fr
preferred label: Politiska kriser @se
preferred label: Krise @de
preferred label: ازمة سياسية @ar
preferred label: Crisis política @es
preferred label: crise política @pt-pt
preferred label: politisk krise @dk
preferred label: 政治危机 @zh-hans
definition: Konflikte aller Art, die sich zu einer Stufe entwickeln können, abhängig von Ereignissen, bei denen Regierungen gestürzt werden können, Kriege erklärt werden können, Börsenmärkte zusammenbrechen können, oder auch nicht. @de
definition: Konflikter som når nivåer där regeringar kan avsättas. @se
definition: Conflict that rises to a level where, depending on events, governments can fall etc
definition: Conflito que atinge um nível em que, dependendo dos acontecimentos, os governos podem cair. @pt-pt
definition: Konflikter, som når niveauer, hvor regeringer kan afsættes. @dk
definition: 根据事件的不同上升到一定程度的冲突，如政府可能会垮台等 @zh-hans
change note: Retired. Use more specific terms instead.
in scheme: Media Topic
created: 2009-10-22T02:00:00+00:00
retired: 2025-03-31T12:00:00+00:00
modified: 2025-03-31T12:00:00+00:00
broader: politics and government
broad match: http://cv.iptc.org/newscodes/subjectcode/16011000

political prisoners and dissenters
type: Concept
preferred label: Disidencia política @es
preferred label: Dissidence @fr
preferred label: Politische Unruhen @de
preferred label: انشقاق سياسي @ar
preferred label: Politiska fångar och dissidenter @se
preferred label: dissidência política @pt-pt
preferred label: politisk uoverensstemmelse @dk
preferred label: 政治分歧 @zh-hans
preferred label: politisk dissens @no-nb
definition: Individuals who put themselves at risk by expressing their political views and the imprisonment of individuals who speak out against a political authority
definition: Missverständnis zwischen politischen Gruppen, in der Regel organisiert, die manchmal in Verhaftungen münden. @de
definition: Personer med åsikter som avviker från de av staten förhärskande samt de som fängslats utifrån att de uttryckt oppositionella åsikter. @se
definition: Desacordo entre grupos políticos, geralmente organizado, por vezes resultando na prisão dos dissidentes. @pt-pt
definition: Personer med udtalelser, der afviger fra det gældende eller officielt gældende. @dk
definition: 政治团体之间的分歧，通常是有组织的，有时会导致持不同政见者被监禁 @zh-hans
in scheme: Media Topic
created: 2009-10-22T02:00:00+00:00
modified: 2025-03-31T12:00:00+00:00
broader: politics and government

political process
type: Concept
preferred label: Politik (allgemein) @de
preferred label: Política @es
preferred label: Participation politique @fr
preferred label: Politiska processer @se
preferred label: عملية سياسية @ar
preferred label: processo político @pt-pt
preferred label: politisk proces @dk
preferred label: 政治进程 @zh-hans
preferred label: politisk prosess @no-nb
definition: The art or science of participating in the affairs of government, a state of political party
definition: Die Kunst oder Wissenschaft an Regierungsangelegenheiten teilzuhaben, der Zustand einer politischen Partei. @de
definition: Deltagande i driften av en regering, en stat eller ett politiskt parti. @se
definition: Arte ou ciência de participar nos assuntos de um governo, de um estado ou de um partido político. @pt-pt
definition: Deltagelse i driften af en regering, stat eller politisk parti. @dk
definition: 参与政府事务的艺术或科学，政党的状态 @zh-hans
change note: Retired. Use government (medtop:20000593) or other more specific terms instead.
in scheme: Media Topic
created: 2009-10-22T02:00:00+00:00
retired: 2025-03-31T12:00:00+00:00
modified: 2025-03-31T12:00:00+00:00
broader: politics and government

religion
type: Concept
preferred label: ديانة ومعتقدات @ar
preferred label: Religion et croyance @fr
preferred label: Religion, Weltanschauung @de
preferred label: Religion @se
preferred label: Religión y culto @es
preferred label: religião e crença @pt-pt
preferred label: religion og tro @dk
preferred label: 宗教和信仰 @zh-hans
preferred label: religion og livssyn @no-nb
definition: Allt som rör den mänskliga existensen i förhållande till teologi, filosofi, etik och andlighet. Sekter, tro, frimurare, kyrkliga och religiösa organisationer. @se
definition: Belief systems, institutions and people who provide moral guidance to followers
definition: Alle Aspekte des menschlichen Lebens, die Religion, Philosophie, Ethik und Spiritualität beinhalten. @de
definition: Todos os aspetos da existência humana que envolvem teologia, filosofia, ética e espiritualidade. @pt-pt
definition: Todos os aspectos da existência humana que envolvem teologia, filosofia, ética e espiritualidade. @pt-br
definition: Alle aspekter af menneskelig eksistens, der involverer teologi, filosofi, etik og spiritualitet. @dk
definition: 人类存在的所有方面，包括神学、哲学、伦理和灵性 @zh-hans
in scheme: Media Topic
created: 2009-10-22T02:00:00+00:00
modified: 2021-12-21T12:00:00+00:00
narrower: belief systems
narrower: interreligious dialogue
narrower: religious conflict
narrower: religious event
narrower: religious festival and holiday
narrower: religious ritual
narrower: religious facility
narrower: relations between religion and government
narrower: religious leader
narrower: religious text

belief systems
type: Concept
preferred label: ايمان @ar
preferred label: Croyances @fr
preferred label: Religiös tro @se
preferred label: Creencias @es
preferred label: Glaube @de
preferred label: crenças religiosas @pt-pt
preferred label: religiøs overbevisning @dk
preferred label: 宗教信仰 @zh-hans
preferred label: trosretning @no-nb
preferred label: trusretning @no-nn
definition: Tro är ofta ett grundelement i det religiösa livet som innebär att föreställningar om det transcendentala erkänns som sanna, dels tillit till en eller flera gudar. @se
definition: Anerkannte Glaubensinhalte der einzelnen Religionen @de
definition: A set of beliefs prescribed by an institution or text often focusing on the worship of a higher power and the outlining of moral guidelines
definition: Crenças estabelecidas da religião de um indivíduo. @pt-pt
definition: Religiøst bestemt livsholdning og fortolkning af livet. @dk
definition: 个人宗教的既定信仰 @zh-hans
in scheme: Media Topic
created: 2009-10-22T02:00:00+00:00
modified: 2021-12-21T12:00:00+00:00
broader: religion
narrower: Budismo
narrower: Christianity
narrower: Confucianism
narrower: cult
narrower: Freemasonry
narrower: Hinduism
narrower: Islam
narrower: Jainism
narrower: Judaism
narrower: nature religion
narrower: Zoroastrianism
narrower: Scientologi
narrower: Schintoismus
narrower: Sikhism
narrower: Taoism
narrower: Unificationism
narrower: atheism and agnosticism

interreligious dialogue
type: Concept
preferred label: Interreligiöser Dialog @de
preferred label: Interreligiös dialog @se
preferred label: حوار ديانات @ar
preferred label: Diálogo interreligioso @es
preferred label: Dialogue interreligieux @fr
preferred label: diálogo inter-religioso @pt-pt
preferred label: interreligiøs dialog @dk
preferred label: 各宗教间对话 @zh-hans
preferred label: religionsdialog @no-nb
preferred label: interreligious dialog
definition: Alla former av kommunikation mellan olika religioner. @se
definition: Jede Form des Austausches zwischen Religionen @de
definition: Any form of communication between religions
definition: Qualquer forma de comunicação entre religiões. @pt-pt
definition: Toda forma de comunicação entre religiões. @pt-br
definition: Alle former for kommunikation mellem forskellige religioner. @dk
definition: 宗教间的任何形式的交流 @zh-hans
change note: Retired in December 2021. Use religion (medtop:12000000) instead.
in scheme: Media Topic
created: 2009-10-22T02:00:00+00:00
retired: 2021-12-17T12:00:00+00:00
modified: 2021-02-18T12:00:00+00:00
broader: religion

religious conflict
type: Concept
preferred label: Conflicto religioso @es
preferred label: Religionskonfliktl @de
preferred label: Conflit religieux @fr
preferred label: Religiösa konflikter @se
preferred label: نزاع ديني @ar
preferred label: conflito religioso @pt-pt
preferred label: religiøs konflikt @dk
preferred label: 宗教冲突 @zh-hans
definition: Conflicts involving religious differences
definition: Konflikte, die religiöse Unterschiede miteinbeziehen @de
definition: Konflikter som blandar in religiösa meningsskiljaktigheter. @se
definition: Conflitos envolvendo diferenças religiosas. @pt-pt
definition: Konflikter, der involverer religiøse forskelle. @dk
definition: 涉及宗教分歧的冲突 @zh-hans
in scheme: Media Topic
created: 2009-10-22T02:00:00+00:00
modified: 2021-02-18T12:00:00+00:00
broader: religion

religious event
type: Concept
preferred label: مناسبة دينية @ar
preferred label: Religiöses Ereignis @de
preferred label: Evento religioso @es
preferred label: Événement religieux @fr
preferred label: Religiösa händelser @se
preferred label: evento religioso @pt-pt
preferred label: religiøs begivenhed @dk
preferred label: 宗教活动 @zh-hans
preferred label: religiøst arrangement @no-nb
preferred label: religiøse arrangement @no-nn
definition: News regarding a religious event but not a festival or holiday
definition: Händelser som berör en religion, men inte religiösa högtider. @se
definition: Religiöse Ereignisse, aber keine Feste oder Feiertage. @de
definition: Notícias relativas a acontecimentos religiosos mas não a feriados ou festas religiosas. @pt-pt
definition: Begivenheder, der påvirker en religion, men ikke religiøse fester. @dk
definition: 有关宗教活动的新闻，但不包括节日或假日 @zh-hans
change note: Retired in December 2021. Use religion (medtop:12000000) instead.
in scheme: Media Topic
created: 2009-10-22T02:00:00+00:00
retired: 2021-12-17T12:00:00+00:00
modified: 2021-07-12T12:00:00+00:00
broader: religion

religious festival and holiday
type: Concept
preferred label: Religionsfest oder Feiertag @de
preferred label: Festivales o festivades religiosas @es
preferred label: Fête religieuse @fr
preferred label: Religiösa högtider @se
preferred label: اعياد ومهرجانات دينية @ar
preferred label: festa ou feriado religioso @pt-pt
preferred label: religiøs helligdag og fest @dk
preferred label: 宗教节日 @zh-hans
preferred label: høytid @no-nb
preferred label: høgtid @no-nn
definition: Helig eller högtidlighållen dag inom en religion, som ibland också är en allmän helgdag. @se
definition: Holy day or period of observance in a religion which is sometimes a public holiday
definition: Feiertag oder religiöser Anlass, der manchmal auch ein öffentlicher Feiertag ist. @de
definition: Dia santo ou dia de prática religiosa que por vezes também é um feriado público. @pt-pt
definition: Hellig eller højtidelig dag inden for en religion, som undertiden også er en helligdag. @dk
definition: 宗教中的神圣日或纪念日，有时也是公共假日 @zh-hans
in scheme: Media Topic
created: 2009-10-22T02:00:00+00:00
modified: 2021-12-17T12:00:00+00:00
broader: religion
narrower: Christmas
narrower: Easter
narrower: Pentecost
narrower: Ramadan
narrower: Yom Kippur
narrower: All Saints Day
narrower: Walpurgis night
narrower: Eid al-Adha
narrower: Hanukkah

religious ritual
type: Concept
preferred label: Religiösa ritualer @se
preferred label: Religionsritual @de
preferred label: شعائر دينية @ar
preferred label: Rites religieux @fr
preferred label: Rituales religiosos @es
preferred label: ritual @pt-pt
preferred label: religiøst ritual @dk
preferred label: 宗教仪式 @zh-hans
preferred label: riter og ritualer @no-nb
preferred label: ritar og ritual @no-nn
definition: Etablierte religiöse Rituale, wie Messen, Taufen, Priestertreffen. @de
definition: Etablerade religösa riter, såsom mässa, dop och bönemöten. @se
definition: Established religious rituals such as mass, baptism, prayer meetings and bar and bat mitzvah
definition: Rituais religiosos estabelecidos, como missa, batismo, oração em grupo. @pt-pt
definition: Etablerede religiøse ritualer, såsom messe, dåb og bønnemøder. @dk
definition: 传统的宗教仪式，如弥撒、洗礼、祈祷会 @zh-hans
in scheme: Media Topic
created: 2009-10-22T02:00:00+00:00
modified: 2021-12-17T12:00:00+00:00
broader: religion
narrower: baptism
narrower: bar and bat mitzvah
narrower: canonisation

religious facility
type: Concept
preferred label: منشآت دينية @ar
preferred label: Religiöse Bauwerke @de
preferred label: Religiösa byggnader @se
preferred label: Lugares de culto @es
preferred label: Établissement religieux @fr
preferred label: instalações religiosas @pt-pt
preferred label: religiøs facilitet @dk
preferred label: 宗教设施 @zh-hans
preferred label: gudshus @no-nb
preferred label: religious facilities
definition: Jede Einrichtung, wo eine Gruppe ihre religiösen Rituale zelebrieren kann, egal ob es eine Moschee, eine Kirche, ein Haus oder ein Zelt ist @de
definition: Any facility where a group carries out its religious rites
definition: En anläggning där en grupp kan utföra religiösa riter, t ex en moské, en kyrka, ett hus eller ett tält. @se
definition: Quaisquer instalações onde um grupo possa realizar ritos religiosos, quer seja uma mesquita, uma igreja, uma casa ou uma tenda. @pt-pt
definition: Enhver facilitet, hvor en gruppe kan udføre sine religiøse ritualer, hvad enten det er en moske, en kirke, et hus eller et telt. @dk
definition: 一个团体可以进行其宗教仪式的任何设施，无论是清真寺、教堂、房子还是帐篷 @zh-hans
in scheme: Media Topic
created: 2009-10-22T02:00:00+00:00
modified: 2021-12-17T12:00:00+00:00
broader: religion
narrower: church
narrower: mosque
narrower: synagogue
narrower: temple
broad match: http://cv.iptc.org/newscodes/subjectcode/12000000

relations between religion and government
type: Concept
preferred label: مؤسسات دينية وعلاقات دولة @ar
preferred label: Relaciones entre las instituciones religiosas y el Estado @es
preferred label: Relations entre les institutions religieuses et l'Etat @fr
preferred label: Beziehung Religion und Staat @de
preferred label: Relation mellan stat och religiösa institutioner @se
preferred label: instituições religiosas e relações com o estado @pt-pt
preferred label: stat og religion @dk
preferred label: 宗教机构和国家的关系 @zh-hans
preferred label: livssynspolitikk @no-nb
definition: Den lagliga och sociala fördelningen mellan religiösa institutioner och statsangelägenheter. @se
definition: Die rechtliche und soziale Trennung von Kirche und Staat @de
definition: Matters arising from the relationship between religions and a government, including the question of whether churches should pay taxes, the push to keep religion out of publicly funded institutions and the freedom, or lack of to wear religious symbols in a school setting
definition: Separação legal e social entre instituições religiosas e assuntos de estado. @pt-pt
definition: Den juridiske og sociale fordeling mellem religiøse institutioner og statsanliggender. @dk
definition: 宗教机构和国家事务之间的法律和社会分工 @zh-hans
in scheme: Media Topic
created: 2009-10-22T02:00:00+00:00
modified: 2024-07-01T12:00:00+00:00
broader: religion

religious leader
type: Concept
preferred label: Chefs religieux @fr
preferred label: Religiösa ledare @se
preferred label: Líder religioso @es
preferred label: Religiöses Oberhaupt @de
preferred label: زعيم ديني @ar
preferred label: líder religioso @pt-pt
preferred label: religiøs leder @dk
preferred label: 宗教领袖 @zh-hans
preferred label: religiøs leiar @no-nn
definition: Person oder Personen, die eine rituelle oder führende Rolle in ihrer jeweiligen Religion oder Kirche haben. @de
definition: Person or persons who have a ritual, juridical or otherwise leading role in their respective church or religion
definition: Personer som har en rituell, juridisk eller annan ledande roll i sin kyrka eller religion. @se
definition: Pessoa ou pessoas que têm um papel de liderança ritual, jurídica ou outra na sua igreja ou religião. @pt-pt
definition: Pessoa ou pessoas que têm um papel de liderança ritual, jurídica ou outra em sua igreja ou religião. @pt-br
definition: Person eller personer, der har en rituel, juridisk eller på anden måde førende rolle i deres respektive kirke eller religion. @dk
definition: 在其各自的教会或宗教中具有仪式、法律或其他主导作用的人 @zh-hans
in scheme: Media Topic
created: 2009-10-22T02:00:00+00:00
modified: 2021-02-18T12:00:00+00:00
broader: religion
narrower: pope

religious text
type: Concept
preferred label: Textes religieux @fr
preferred label: نص ديني @ar
preferred label: Textos religiosos @es
preferred label: Religiöse Schriften @de
preferred label: Religiösa texter @se
preferred label: textos religiosos @pt-pt
preferred label: religiøs tekst @dk
preferred label: 宗教文本 @zh-hans
preferred label: hellig skrift @no-nb
preferred label: heilage skrifter @no-nn
definition: Texter som anses heliga eller viktiga för en kyrka eller religion. @se
definition: Texts regarded as holy or important by a religion
definition: Schriften die heilig oder wichtig für eine Kirche oder Religion sind. @de
definition: Escrituras sagradas ou importantes para uma igreja ou religião. @pt-pt
definition: Skrifterne er hellige eller vigtige for en kirke eller religion. @dk
definition: 对教堂或宗教来说神圣或重要的经文 @zh-hans
in scheme: Media Topic
created: 2009-10-22T02:00:00+00:00
modified: 2021-12-17T12:00:00+00:00
broader: religion
narrower: Bible
narrower: Qur'an
narrower: Thora

science and technology
type: Concept
preferred label: Teknik och vetenskap @se
preferred label: علوم وتكنولوجيا @ar
preferred label: Wissenschaft, Technik, Forschung @de
preferred label: Ciencia y tecnología @es
preferred label: Science et technologie @fr
preferred label: ciência e tecnologia @pt-pt
preferred label: videnskab og teknologi @dk
preferred label: 科学技术 @zh-hans
preferred label: vitenskap og teknologi @no-nb
preferred label: vitskap og teknologi @no-nn
definition: Alle Aspekte des menschlichen Verständnisses sowie der methodischen Erforschung der Natur-, Form- und Sozialwissenschaften, wie Astronomie, Linguistik oder Ökonomie @de
definition: All aspects pertaining to human understanding of, as well as methodical study and research of natural, formal and social sciences, such as astronomy, linguistics or economics
definition: Allt som rör den mänskliga förståelsen av naturen och den fysiska världen, utveckling och användning av denna kunskap. Vetenskaplig praktik, ingenjörskonst, human- och naturvetenskap, filosofi, research, vetenskapliga undersökningar, rymdfart. @se
definition: Tous les domaines relatifs à la compréhension humaine, ainsi qu'à l'étude méthodique et à la recherche des sciences naturelles, formelles et sociales, telles que l'astronomie, la linguistique ou l'économie @fr
definition: Todos los campos relacionados con la comprensión humana, así como el estudio metódico y la investigación de las ciencias naturales, formales y sociales, como la astronomía, la lingüística o la economía @es
definition: Todos os aspetos relacionados com a interpretação humana da natureza e do mundo físico e com o desenvolvimento e aplicação desse conhecimento. @pt-pt
definition: Alle aspekter, der vedrører menneskelig forståelse af, såvel som metodologisk undersøgelse og forskning i natur-, formel- og samfundsvidenskab, såsom astronomi, sprogvidenskab eller økonomi. @dk
definition: 与人类对自然科学、形式科学和社会科学(如天文学、语言学或经济学)的理解、系统研究有关的所有方面 @zh-hans
in scheme: Media Topic
created: 2009-10-22T02:00:00+00:00
modified: 2021-02-18T12:00:00+00:00
narrower: biomedical science
narrower: mathematics
narrower: natural science
narrower: scientific research
narrower: scientific institution
narrower: social sciences
narrower: scientific standards
narrower: technology and engineering

biomedical science
type: Concept
preferred label: Biomedicin @se
preferred label: Sciences biomédicales @fr
preferred label: Ciencias biomédicas @es
preferred label: Biomedizin @de
preferred label: علم الطب الحيوي @ar
preferred label: ciência biomédica @pt-pt
preferred label: biomedicinsk videnskab @dk
preferred label: 生物医学科学 @zh-hans
preferred label: biomedisin @no-nb
definition: Die Anwendung der biologisch basierten Wissenschaft auf medizinische Gebiete wie Forschung, Gesundheitsmonitoring oder medizinische Behandlung @de
definition: The application of biology-based science to medical fields such as research, health monitoring or medical treatment
definition: Applicerandet av biologibaserad forskning på medicinska områden, såsom forskning, kontroll av hälsotillstånd eller medicinsk behandling. @se
definition: Application de la science basée sur la biologie à des domaines médicaux tels que la recherche, les contrôles de santé ou le traitement médical @fr
definition: Aplicación de la ciencia basada en la biología a campos médicos como la investigación, los controles de salud o el tratamiento médico @es
definition: Aplicação da ciência baseada na biologia em áreas médicas, como investigação, monitoramento de saúde ou tratamento médico. @pt-pt
definition: Anvendelse af biologibaseret forskning inden for medicinske områder, såsom forskning, kontrol af sundhedsmæssige tilstande eller medicinsk behandling. @dk
definition: 以生物学为基础的科学在医学领域的应用，如研究、健康监测或医疗 @zh-hans
in scheme: Media Topic
created: 2009-10-22T02:00:00+00:00
modified: 2021-02-18T12:00:00+00:00
broader: science and technology
narrower: biotechnology
broad match: http://cv.iptc.org/newscodes/subjectcode/13019000

mathematics
type: Concept
preferred label: Mathématiques @fr
preferred label: Matemática @es
preferred label: Mathematik @de
preferred label: رياضيات @ar
preferred label: Matematik @se
preferred label: matemática @pt-pt
preferred label: matematik @dk
preferred label: 数学 @zh-hans
preferred label: matematikk @no-nb
definition: Das Studium von Struktur, Raum, Veränderung und Zahl in abstrakter Form, oft unter Verwendung symbolischer Logik und Sprache, einschließlich Themen wie Geometrie, Algebra oder Trigonometrie @de
definition: The study of structure, space, change and number in abstract, often using symbolic logic and language, and including subjects such as geometry, algebra or trigonometry
definition: Vetenskapen om struktur, volym, förändring och abstrakta tal, ofta genom användning av symbolisk logik och språk och inkluderande ämnen såsom trigonometri, geometri och algebra. @se
definition: Etude concrète ou abstraite des nombres, des formes, des structures, de l'espace, basée sur des raisonnements logiques, utilisant souvent un langage symbolique, et incluant des sujets tels que la géométrie, l'algèbre ou la trigonométrie @fr
definition: Estudio concreto o abstracto de números, formas, estructuras, espacio, basado en razonamientos lógicos, a menudo utilizando un lenguaje simbólico, e incluyendo temas como la geometría, el álgebra o la trigonometría @es
definition: Estudo da estrutura, espaço, mudança e número em abstrato, muitas vezes usando lógica e linguagem simbólicas, incluindo disciplinas como a geometria, a álgebra ou a trigonometria. @pt-pt
definition: Undersøgelse af struktur, rum, ændring og antal i abstrakt, ofte ved hjælp af symbolisk logik og sprog, og inkluderer emner som geometri, algebra eller trigonometri. @dk
definition: 对抽象的结构、空间、变化和数字的研究，通常使用符号逻辑和语言，包括几何学、代数或三角学 @zh-hans
in scheme: Media Topic
created: 2009-10-22T02:00:00+00:00
modified: 2021-02-18T12:00:00+00:00
broader: science and technology

natural science
type: Concept
preferred label: Sciences naturelles @fr
preferred label: علوم طبيعية @ar
preferred label: Naturwissenschaft @de
preferred label: Naturvetenskap @se
preferred label: Ciencias naturales @es
preferred label: ciências naturais @pt-pt
preferred label: naturvidenskab @dk
preferred label: 自然科学 @zh-hans
preferred label: naturvitenskap @no-nb
preferred label: naturvitskap @no-nn
definition: Die Wissenschaften, die sich mit Materie, Energie und der physikalischen Welt beschäftigen, einschließlich Physik, Biologie, Chemie und Astronomie @de
definition: The sciences that deal with matter, energy and the physical world, including physics, biology, chemistry and astronomy
definition: Den sammanfattande benämningen på de vetenskaper som studerar naturen, dess delar eller verkningar, t ex fysik, kemi, biologi och astronomi. @se
definition: Sciences traitant de la matière, de l'énergie et du monde physique, et comprenant la physique, la biologie, la chimie et l'astronomie @fr
definition: Ciencias que tienen por objeto la materia, la energía y el mundo físico, incluyendo la física, la biología, la química y la astronomía @es
definition: Ciências que lidam com a matéria, a energia e o mundo físico, incluindo a física, a biologia, a química e a astronomia. @pt-pt
definition: De videnskaber, der beskæftiger sig med stof, energi og den fysiske verden, herunder fysik, biologi, kemi og astronomi. @dk
definition: 研究物质、能量和物理世界的科学，包括物理学、生物学、化学和天文学 @zh-hans
in scheme: Media Topic
created: 2009-10-22T02:00:00+00:00
modified: 2021-02-18T12:00:00+00:00
broader: science and technology
narrower: astronomy
narrower: biology
narrower: chemistry
narrower: cosmology
narrower: geology
narrower: horticulture
narrower: marine science
narrower: meteorology
narrower: physics

scientific research
type: Concept
preferred label: Investigación científica @es
preferred label: ابحاث @ar
preferred label: Forschung @de
preferred label: Vetenskaplig forskning @se
preferred label: Recherche scientifique @fr
preferred label: investigação científica @pt-pt
preferred label: videnskabelig undersøgelse @dk
preferred label: 科学研究 @zh-hans
preferred label: forskning @no-nb
preferred label: forsking @no-nn
definition: The scientific and methodical investigation of events, procedures and interactions to explain why they occur, or to find solutions for problems
definition: Methodische Untersuchungen von Ereignissen, Prozeduren etc. um zu erklären, wie sie entstehen oder um Lösungen zu finden für Probleme. @de
definition: Process som genom systematiskt arbete kan frambringa nya kunskaper och ökat vetande. @se
definition: Investigation scientifique et méthodique des événements, des procédures et des interactions pour expliquer pourquoi elles se produisent ou pour trouver des solutions aux problèmes @fr
definition: La investigación científica y metódica de eventos, procedimientos e interacciones para explicar por qué ocurren o para encontrar soluciones a problemas @es
definition: Investigação metódica de eventos, procedimentos, etc., para explicar a sua causa ou para solucionar problemas. @pt-pt
definition: Investigação metódica de eventos, procedimentos etc., para explicar sua causa ou para solucionar problemas. @pt-br
definition: Proces, der gennem systematisk arbejde kan producere ny viden og øget viden. @dk
definition: 对事物的发生、变化规律和相互作用进行科学和严谨的研究，以解释其缘由或找到问题的解决方法 @zh-hans
in scheme: Media Topic
created: 2009-10-22T02:00:00+00:00
modified: 2021-02-18T12:00:00+00:00
broader: science and technology
narrower: scientific innovation
narrower: medical research
narrower: scientific exploration
narrower: scientific publication

scientific institution
type: Concept
preferred label: Forskningsinstitutioner @se
preferred label: Institution scientifique @fr
preferred label: مؤسسات علمية @ar
preferred label: Institución científica @es
preferred label: Wissenschaftliche Institutionen @de
preferred label: instituições científicas @pt-pt
preferred label: videnskabelig institution @dk
preferred label: 科研机构 @zh-hans
preferred label: forskningsinstitusjon @no-nb
definition: Institutioner som genomför eller styr vetenskapligt arbete. @se
definition: Institution that carries out or governs scientific work, such as the National Academy of Arts and Sciences
definition: Institution, die wissenschaftliche Arbeiten durchführt oder regelt, wie die Nationale Akademie der Künste und Wissenschaften @de
definition: Institution qui exécute ou gère des travaux scientifiques, tels que l'Académie des arts et des sciences @fr
definition: Institución que lleva a cabo o administra el trabajo científico, como las academias de ciencias @es
definition: Instituições que realizam ou gerem trabalho científico. @pt-pt
definition: Institutioner, der udfører eller forvalter videnskabeligt arbejde. @dk
definition: 开展或管理科学工作的机构，如国家艺术和科学学院 @zh-hans
in scheme: Media Topic
created: 2009-10-22T02:00:00+00:00
modified: 2021-02-18T12:00:00+00:00
broader: science and technology

social sciences
type: Concept
preferred label: علوم اجتماعية @ar
preferred label: Samhällsvetenskap @se
preferred label: Sciences sociales @fr
preferred label: Ciencias sociales @es
preferred label: Sozialwissenschaften @de
preferred label: ciências sociais @pt-pt
preferred label: samfundsvidenskab @dk
preferred label: 社会科学 @zh-hans
preferred label: samfunnsvitenskap @no-nb
preferred label: samfunnsvitskap @no-nn
definition: Vetenskap som studerar samhället ur olika synvinklar. @se
definition: The study of human society in such aspects as linguistics, anthropology, economics or sociology
definition: Das Studium der menschlichen Gesellschaft in den Bereichen Linguistik, Anthropologie, Ökonomie und Soziologie @de
definition: Etude de la société humaine dans des domaines tels que la linguistique, l'anthropologie, l'économie ou la sociologie @fr
definition: El estudio de la sociedad humana en aspectos como la lingüística, la antropología, la economía o la sociología @es
definition: Estudo da sociedade humana em aspetos como a linguística, a antropologia, a economia ou a sociologia. @pt-pt
definition: Estudo da sociedade humana em aspectos como a linguística, a antropologia, a economia ou a sociologia. @pt-br
definition: Videnskaben af det menneskelige samfund i aspekter som sprogvidenskab, antropologi, økonomi eller sociologi. @dk
definition: 从语言学、人类学、经济学或社会学等方面研究人类社会的学科 @zh-hans
in scheme: Media Topic
created: 2009-10-22T02:00:00+00:00
modified: 2021-02-18T12:00:00+00:00
broader: science and technology
narrower: anthropology
narrower: archaeology
narrower: economics
narrower: geography
narrower: history
narrower: information science
narrower: study of law
narrower: linguistics
narrower: philosophy
narrower: political science
narrower: psychology
narrower: sociology

scientific standards
type: Concept
preferred label: معايير @ar
preferred label: Standards @fr
preferred label: Normas @es
preferred label: Vetenskaplig standard @se
preferred label: normas científicas @pt-pt
preferred label: videnskabelig standard @dk
preferred label: 科学标准 @zh-hans
preferred label: vitenskapelige standarder @no-nb
preferred label: internasjonale standardar @no-nn
definition: Nationella eller internationella regler som styr vetenskapliga och tekniska studier och utveckling, såsom kalibreringsstandarder för vetenskapliga instrument. @se
definition: National oder international etablierte Regeln für wissenschaftliche und technologische Studien und Entwicklungen, wie z.B. Kalibrierstandards für wissenschaftliche Werkzeuge oder Geräte @de
definition: Nationally or internationally established rules governing scientific and technological study and development, such as calibration standards for scientific tools or equipment
definition: Règles établies au niveau national ou international régissant les études et le développement scientifiques et technologiques, telles que les normes d'étalonnage pour les outils ou les équipements scientifiques @fr
definition: Normas establecidas nacional o internacionalmente que rigen el estudio y el desarrollo científico y tecnológico, como las normas de calibración para herramientas o equipos científicos @es
definition: Regras, nacionais ou internacionais, que regulam o estudo e desenvolvimento científico e tecnológico, tais como padrões de calibração de ferramentas científicas ou equipamento. @pt-pt
definition: Nationale eller internationale regler for videnskabelige og tekniske undersøgelser og udvikling, såsom kalibreringsstandarder for videnskabelige instrumenter. @dk
definition: 国家或国际上制定的管理科学和技术研究与开发的规则，如科学工具或设备的校准标准 @zh-hans
in scheme: Media Topic
created: 2009-10-22T02:00:00+00:00
modified: 2021-02-18T12:00:00+00:00
broader: science and technology

technology and engineering
type: Concept
preferred label: Technologie et ingénierie @fr
preferred label: Tecnología e ingeniería @es
preferred label: Teknik och ingenjörskonst @se
preferred label: Technologie und Technik @de
preferred label: تكنولوجيا وهندسة @ar
preferred label: tecnologia e engenharia @pt-pt
preferred label: teknologi og teknik @dk
preferred label: 技术和工程 @zh-hans
preferred label: ingeniørvitenskap @no-nb
preferred label: ingeniørvitskap @no-nn
definition: Studium und Praxis industrieller oder angewandter Wissenschaften wie Physik, Hydrodynamik oder Thermodynamik @de
definition: Studiet och bruket av industriella eller tillämpade vetenskaper såsom teknisk fysik, hydrodynamik och termodynamik. @se
definition: The study and practice of industrial or applied sciences such as physics, hydrodynamics or thermodynamics
definition: Etude et pratique des sciences industrielles ou appliquées telles que la physique, l'hydrodynamique ou la thermodynamique @fr
definition: El estudio y la práctica de las ciencias industriales o aplicadas, como la física, la hidrodinámica o la termodinámica @es
definition: Estudo e prática de ciências industriais ou aplicadas, como a física, a hidrodinâmica ou a termodinâmica. @pt-pt
definition: Undersøgelse og anvendelse af industrielle eller anvendte videnskaber såsom teknisk fysik, hydrodynamik og termodynamik. @dk
definition: 工业或应用科学的研究和实践，如物理学、流体力学或热力学 @zh-hans
in scheme: Media Topic
created: 2009-10-22T02:00:00+00:00
modified: 2021-02-18T12:00:00+00:00
broader: science and technology
narrower: mechanical engineering
narrower: aerospace engineering
narrower: agricultural technology
narrower: civil engineering
narrower: electronic engineering
narrower: identification technology
narrower: information technology and computer science
narrower: materials science
narrower: micro science
broad match: http://cv.iptc.org/newscodes/subjectcode/13000000

society
type: Concept
preferred label: Gesellschaft, Bevölkerung @de
preferred label: Sociedad @es
preferred label: Société @fr
preferred label: Samhälle @se
preferred label: قضايا اجتماعية @ar
preferred label: sociedade @pt-pt
preferred label: samfund @dk
preferred label: 社会 @zh-hans
preferred label: samfunn @no-nb
definition: The concerns, issues, affairs and institutions relevant to human social interactions, problems and welfare, such as poverty, human rights and family planning
definition: Aspekte des menschlichen Lebens, die die zwischenmenschlichen Beziehungen beeinflussen @de
definition: Mänskligt uppträdande som rör eller påverkar den allmänna livskvaliteten. Missbruk, filantropi, demografi, handikappfrågor, eutanasi, familj, socialförsäkringar, hemlöshet, minoriteter, fattigdom, socialbidrag, pornografi, prostitution, rasism. @se
definition: Questões que afetam os indivíduos nas suas vidas diárias, como habitação, comida, educação, relações pessoais. @pt-pt
definition: Questões que afetam os indivíduos em suas vidas diárias, como habitação, comida, educação, relações pessoais. @pt-br
definition: Aspekter af menneskers liv, der påvirker dets forhold. @dk
definition: 影响人际关系的人类生活的各个方面 @zh-hans
in scheme: Media Topic
created: 2009-10-22T02:00:00+00:00
modified: 2021-02-18T12:00:00+00:00
narrower: fundamental rights
narrower: communities
narrower: demographics
narrower: immigration
narrower: emigration
narrower: discrimination
narrower: family
narrower: demographic group
narrower: social condition
narrower: social problem
narrower: values
narrower: welfare
narrower: diversity, equity and inclusion

fundamental rights
type: Concept
preferred label: Derechos fundamentales @es
preferred label: Grundrechte @de
preferred label: Droits fondamentaux @fr
preferred label: حقوق اساسية @ar
preferred label: Grundläggande rättigheter @se
preferred label: direitos fundamentais @pt-pt
preferred label: grundlæggende rettighed @dk
preferred label: 基本权利 @zh-hans
preferred label: basisrettigheter @no-nb
preferred label: basisrettar @no-nn
definition: The political, social, cultural and economic rights to which all people are entitled, usually upheld by law
definition: De politiska, sociala, kulturella och ekonomiska rättigheter som alla människor har rätt till, vanligtvis upprätthållna i lag @se
definition: Die politischen, soziale und ökonomischen Rechte, die für alle Menschen gelten, meist in Gesetzen festgelegt @de
definition: Direitos políticos, sociais e económicos aos quais todas as criaturas têm direito, geralmente confirmados por lei. @pt-pt
definition: Direitos políticos, sociais e econômicos aos quais todas as criaturas têm direito, geralmente confirmados por lei. @pt-br
definition: Politiske, sociale og økonomiske rettigheder, som alle har ret til i henhold til loven. @dk
definition: 所有人都有权享有的政治、社会和经济权利，通常由法律维护 @zh-hans
in scheme: Media Topic
created: 2009-10-22T02:00:00+00:00
modified: 2024-09-26T12:00:00+00:00
broader: society
narrower: civil rights
narrower: censorship and freedom of speech
narrower: freedom of religion
narrower: freedom of the press
narrower: human rights
narrower: privacy
narrower: women's rights
broad match: http://cv.iptc.org/newscodes/subjectcode/02007000

communities
type: Concept
preferred label: Gesellschaft @de
preferred label: مجتمعات @ar
preferred label: Communauté @fr
preferred label: Gemenskaper @se
preferred label: Comunidades @es
preferred label: comunidades @pt-pt
preferred label: fællesskab @dk
preferred label: 社区 @zh-hans
preferred label: fellesskap @no-nb
definition: Eine Gruppe von Einzelpersonen, die aktiv gemeinsame Werte oder Interessen teilen @de
definition: A group of individuals actively sharing a common value or interest
definition: En grupp personer som delar ett gemensamt intresse eller gemensamma värderingar. @se
definition: Grupo de indivíduos que partilha de forma ativa um valor ou interesse comum. @pt-pt
definition: En gruppe individer, der aktivt deler en fælles værdi eller interesse. @dk
definition: 积极分享共同价值或兴趣的一群人 @zh-hans
in scheme: Media Topic
created: 2009-10-22T02:00:00+00:00
modified: 2021-02-18T12:00:00+00:00
broader: society
narrower: social networking
narrower: fraternal and community group
broad match: http://cv.iptc.org/newscodes/subjectcode/14024000

demographics
type: Concept
preferred label: Demografi @se
preferred label: Bevölkerungsentwicklung @de
preferred label: Démographie @fr
preferred label: علم سكان @ar
preferred label: Demografía @es
preferred label: demografia @pt-pt
preferred label: demografi @dk
preferred label: 人口统计 @zh-hans
definition: The study of human populations and their characteristics, for example statistics or trends around aging populations in a particular geographic region
definition: Das Studium der Menschen, und hier ihr Leben und ihre Beziehungen @de
definition: Vetenskapen om mänskliga befolkningars struktur och utveckling, särskilt kvantitativt. @se
definition: Estudo dos povos, do lugar onde habitam e do modo como interagem. @pt-pt
definition: Undersøgelsen af mennesker, og hvor de bor, og hvordan de interagerer. @dk
definition: 研究人们和他们生活的地方、如何相互沟通 @zh-hans
in scheme: Media Topic
created: 2009-10-22T02:00:00+00:00
modified: 2021-02-18T12:00:00+00:00
broader: society
narrower: population and census

immigration
type: Concept
preferred label: Immigration @fr
preferred label: هجرة @ar
preferred label: Einwanderung @de
preferred label: Inmigración @es
preferred label: imigração @pt-pt
preferred label: indvandring @dk
preferred label: 移居 @zh-hans
preferred label: innvandring @no-nb
definition: Personers rörelse från ett land till ett annat. @se
definition: The movement of individuals or groups of people from one country to another
definition: Bewegung von Individuen von einem Land in ein anderes @de
definition: Movimentação de indivíduos de um país para outro. @pt-pt
definition: Movimentação de indivíduos de um país a outro. @pt-br
definition: Bevægelse af enkeltpersoner fra det ene land til det andet. @dk
definition: 个人从一个国家到另一个国家的流动 @zh-hans
in scheme: Media Topic
created: 2009-10-22T02:00:00+00:00
modified: 2021-02-18T12:00:00+00:00
broader: society
narrower: illegal immigration

emigration
type: Concept
preferred label: Emigranter @se
preferred label: Emigrantes @es
preferred label: Émigrés @fr
preferred label: Auswanderer @de
preferred label: مغتربون @ar
preferred label: emigrantes @pt-pt
preferred label: emigrant @dk
preferred label: 移民 @zh-hans
preferred label: utvandring @no-nb
definition: Leaving one's country of residence to settle permanently elsewhere
definition: Personer som lämnar sitt ursprungsland, dessa personers relation till ursprungslandet och andra personer som har lämnat ursprungslandet. @se
definition: Menschen, die ihr Heimatland verlassen, alle Beziehung zu ihrem Heimatland abbrechen und deren Verbindungen mit anderen Emigranten @de
definition: Pessoas que deixam o seu país de origem; a sua relação com o seu país de origem e associação com outros emigrantes. @pt-pt
definition: Pessoas que deixam seu país de origem; sua relação com seu país de origem e associação com outros emigrantes. @pt-br
definition: Mennesker, der forlader deres oprindelsesland, deres forhold til deres oprindelsesland og deres tilknytning til andre emigranter. @dk
definition: 离开原籍国的人、他们与原籍国的关系以及他们与其他移民的联系 @zh-hans
in scheme: Media Topic
created: 2009-10-22T02:00:00+00:00
modified: 2021-07-12T12:00:00+00:00
broader: society

discrimination
type: Concept
preferred label: Discriminación @es
preferred label: Discrimination @fr
preferred label: Diskriminierung @de
preferred label: تمييز @ar
preferred label: Diskriminering @se
preferred label: discriminação @pt-pt
preferred label: forskelsbehandling @dk
preferred label: 歧视 @zh-hans
preferred label: diskriminering @no-nb
definition: Unfair treatment of, or policies or practices against, individuals or groups of people on the basis of real or perceived membership in a group, such as race, sexual orientation, political or religious beliefs, age or height
definition: Verweigerung einer Dienstleistung für eine Person oder Personengruppe aufgrund der Rasse, Hautfarbe, sexuellen Identität, Religionszugehörigkeit, politischen Ansichten etc. @de
definition: Särbehandling av individer eller grupper, vilken innebär ett avsteg från principen att lika fall ska behandlas lika, på grund av etnicitet, hudfärg, sexuell läggning, religion och så vidare.. @se
definition: Negação de serviços a uma ou mais pessoas por questões de raça, cor, identidade sexual, religião, crenças políticas, etc. @pt-pt
definition: Negação de serviços a uma ou mais pessoas por questões de raça, cor, identidade sexual, religião, crenças políticas etc. @pt-br
definition: Skadelige holdninger en eller flere mennesker på grund af race, farve, seksuel identitet, religion eller politisk tro. @dk
definition: 因种族、肤色、性别认同、宗教、政治信仰等原因拒绝向一人或多人提供服务 @zh-hans
in scheme: Media Topic
created: 2009-10-22T02:00:00+00:00
modified: 2021-02-18T12:00:00+00:00
broader: society
narrower: ageism
narrower: racism
narrower: religious discrimination
narrower: sexism

family
type: Concept
preferred label: Famille @fr
preferred label: اسرة @ar
preferred label: Familjefrågor @se
preferred label: Familia @es
preferred label: Familie @de
preferred label: família @pt-pt
preferred label: familie @dk
preferred label: 家庭 @zh-hans
definition: En grupp individer med relation via släktskap eller juridiska bindningar, exempelvis vigsel. @se
definition: A group of people related genetically or by a legal bond, or who consider themselves part of a familial unit regardless of genetic or legal status
definition: Eine Personengruppe, die durch Blut oder Heirat miteinander verwandt ist @de
definition: Grupo de indivíduos relacionados por laços de sangue e casamento. @pt-pt
definition: En gruppe af personer, der er forbundet via blod eller via ægteskab. @dk
definition: 有血缘或婚姻关系的一群人 @zh-hans
in scheme: Media Topic
created: 2009-10-22T02:00:00+00:00
modified: 2021-02-18T12:00:00+00:00
broader: society
narrower: adoption
narrower: Dating and Relationships
narrower: divorce
narrower: family planning
narrower: marriage
narrower: parenting
narrower: pregnancy and childbirth

demographic group
type: Concept
preferred label: Mänskligheten @se
preferred label: رجال ونساء @ar
preferred label: L'humanité @fr
preferred label: Humanidad @es
preferred label: Bevölkerung @de
preferred label: humanidade @pt-pt
preferred label: befolkningsgrupper @dk
preferred label: 人类 @zh-hans
preferred label: menneskeheten @no-nb
preferred label: menneskeslekta @no-nn
definition: A subset of society with shared traits
definition: Individuen als Ganzes, manchmal in verschiedene Klassen eingeteilt, wie Einheimische, Menschen einer Schicht etc. @de
definition: Sammanfattningen av alla människor genom alla tider eller vid en viss tidpunkt. @se
definition: Indivíduos como um todo, por vezes divididos em classes, como povos indígenas, pessoas de classe, etc. @pt-pt
definition: Indivíduos como um todo, por vezes divididos em classes, como povos indígenas, pessoas de classe etc. @pt-br
definition: Sammenfatning af alle mennesker gennem alle tidspunkter eller på et givet tidspunkt. @dk
definition: 被划分为不同的阶层的作为一个整体个人，例如土著人民、阶级人民等 @zh-hans
in scheme: Media Topic
created: 2009-10-22T02:00:00+00:00
modified: 2025-06-30T12:00:00+00:00
broader: society
narrower: adults
narrower: children
narrower: disabilities
narrower: LGBTQ
narrower: gender
narrower: infants
narrower: national or ethnic minority
narrower: nuclear radiation victims
narrower: senior citizens
narrower: teenagers
narrower: indigenous people
narrower: women
narrower: men

social condition
type: Concept
preferred label: Social situation @se
preferred label: Condiciones sociales @es
preferred label: وضع اجتماعي @ar
preferred label: Soziale Bedingung @de
preferred label: Condition sociale @fr
preferred label: condição social @pt-pt
preferred label: sociale forhold @dk
preferred label: 社会环境 @zh-hans
preferred label: sosial status @no-nb
definition: The circumstances or state of affairs affecting a person's life, welfare and relations with others in a society
definition: Probleme, die eine Reihe von Individuen in ihrem täglichen Leben betreffen, wie Unterkunft, Nahrung, Erziehung, persönliche Beziehungen @de
definition: Det tillstånd folk lever i gällande bostad, vattentillgång, möjlighet till utbildning med mera. @se
definition: Condições em que as pessoas vivem no que diz respeito a habitação, abastecimento de água, disponibilidade de educação. @pt-pt
definition: Forhold, under hvilke mennesker lever, med hensyn til bolig, vandforsyning, tilgængelighed af uddannelse. @dk
definition: 人们在住房、供水、受教育机会等方面的生活条件 @zh-hans
definition: Sosiale og økonomiske omstende som påverkar ein persons liv, velferd og relasjon til andre. @no-nn
definition: Sosiale og økonomiske omstendigheter som påvirker en persons liv, velferd og forhold til andre. @no-nb
in scheme: Media Topic
created: 2009-10-22T02:00:00+00:00
modified: 2021-05-05T12:00:00+00:00
broader: society
narrower: homelessness
narrower: poverty

social problem
type: Concept
preferred label: Soziales Problem @de
preferred label: Sociala problem @se
preferred label: مشكلة اجتماعية @ar
preferred label: Problemas sociales @es
preferred label: Problèmes sociaux @fr
preferred label: problemas sociais @pt-pt
preferred label: socialt problem @dk
preferred label: 社会问题 @zh-hans
preferred label: sosiale problemer @no-nb
preferred label: sosiale problem @no-nn
definition: Brister i en befolknings levnadsförhållanden som gäller så många människor att staten eller enskilda organisationer anses böra ingripa. @se
definition: Issues related to human rights, human welfare and other areas of societal concern
definition: Menschliche Lebensbedingungen @de
definition: Problemas que afetam a vida dos indivíduos. @pt-pt
definition: Mangler i levevilkårene for en befolkning, der berører så mange mennesker, at staten eller individuelle organisationer må gribe ind. @dk
definition: 影响个人生活的问题 @zh-hans
in scheme: Media Topic
created: 2009-10-22T02:00:00+00:00
modified: 2021-02-18T12:00:00+00:00
broader: society
narrower: abusive behaviour
narrower: addiction
narrower: juvenile delinquency
narrower: prostitution
narrower: slavery
narrower: sexual misconduct
narrower: bullying
broad match: http://cv.iptc.org/newscodes/subjectcode/14025002

values
type: Concept
preferred label: Wertvorstellung @de
preferred label: Sociala värderingar @se
preferred label: Valores @es
preferred label: Valeurs @fr
preferred label: قيم @ar
preferred label: valores @pt-pt
preferred label: værdier @dk
preferred label: 社会准则 @zh-hans
preferred label: verdigrunnlag @no-nb
definition: Persönliche Stufen sozialen Verhaltens @de
definition: A person's or group's principles or standards of behaviour, which guide their way of living and choices made
definition: Allmänt delade, men många gånger underförstådda, regler och förväntningar på beteende som gäller inom en mindre social gemenskap eller i samhället i stort. @se
definition: Níveis de conduta e sua aceitação pela comunidade. @pt-pt
definition: Niveauer af adfærd og dets accept af samfundet. @dk
definition: 行为水平及其社区接受程度。 @zh-hans
definition: A person's or group's principles or standards of behavior, which guide their way of living and choices made
in scheme: Media Topic
created: 2009-10-22T02:00:00+00:00
modified: 2021-02-18T12:00:00+00:00
broader: society
narrower: corrupt practices
narrower: death and dying
narrower: ethics
narrower: pornography
narrower: sexual behaviour

welfare
type: Concept
preferred label: Socialhjälp @se
preferred label: Asistencia social @es
preferred label: رفاهية @ar
preferred label: Sozialfürsorge @de
preferred label: Protection sociale @fr
preferred label: assistência social @pt-pt
preferred label: socialhjælp @dk
preferred label: 福利 @zh-hans
preferred label: sosialhjelp @no-nb
definition: Help for those in need of food, housing, health and other services
definition: Grundsätzliche Unterstützung von Menschen, die Nahrungsmittel, Unterkunft, Gesundheit und andere Dienstleistungen benötigen @de
definition: Hjälp till personer i behov av mat, bostad, sjukvård och andra tjänster. @se
definition: Ajuda para quem precisa de comida, habitação, saúde e outros serviços. @pt-pt
definition: Hjælp til dem, der har behov for mad, bolig, sundhed og andre tjenester. @dk
definition: 帮助那些需要食物、住房、保健和其他服务的人 @zh-hans
in scheme: Media Topic
created: 2009-10-22T02:00:00+00:00
modified: 2021-02-18T12:00:00+00:00
broader: society
narrower: charity
narrower: long-term care
narrower: social services
narrower: elderly care
narrower: public housing
narrower: child care

diversity, equity and inclusion
type: Concept
preferred label: inkludering og mangfold @no-nb
preferred label: inkludering og mangfald @no-nn
preferred label: Diversität, Gerechtigkeit und Integration @de
definition: Efforts that seeks to promote the fair treatment and full participation of groups of people who have historically been underrepresented or subject to discrimination on the basis of identity or disability
definition: Bemühungen zur Förderung fairer Behandlung und voller Beteiligung von Personengruppen, die in der Vergangenheit unterrepräsentiert oder aufgrund ihrer Identität oder Behinderung diskriminiert wurden @de
in scheme: Media Topic
created: 2023-03-31T12:00:00+00:00
modified: 2023-03-31T12:00:00+00:00
broader: society

sport
type: Concept
preferred label: Sport @fr
preferred label: Deporte @es
preferred label: رياضة @ar
preferred label: desporto @pt-pt
preferred label: esporte @pt-br
preferred label: 体育 @zh-hans
definition: Competitive activity or skill that involves physical and/or mental effort and organisations and bodies involved in these activities
definition: Im Wettkampf ausgeübte Betätigung mit körperlichen und/oder mentalen Leistungen. Organisationen und Körperschaften sind die Träger dieser Aktivitäten @de
definition: Generellt om idrott och andra fysiska aktiveter samt de organisationer och myndigheter som är inblandade i detta. @se
definition: Exercício competitivo envolvendo esforço físico. Organizações e corpos envolvidos nessas atividades. @pt-pt
definition: Konkurrencedygtig aktivitet eller færdighed, der involverer fysisk og/eller mental indsats og organisationer og organer, der er involveret i disse aktiviteter. @dk
definition: 需要体力和/或智力努力的竞争性活动或技能，以及参与这些活动的组织和机构 @zh-hans
definition: Competitive activity or skill that involves physical and/or mental effort and organizations and bodies involved in these activities
definition: Konkurranseprega aktivitet eller ferdigheit som inneber fysisk og/eller psykisk prestasjon, og organisasjonar som er knytte til desse aktivitetane. @no-nn
definition: Konkurransepreget aktivitet eller ferdighet som innebærer fysisk og/eller psykisk anstrengelse, og organisasjoner forbundet med disse aktivitetene. @no-nb
change note: Changes: 2018-04-19 definition changed to make it fit better for chess and eSports.
in scheme: Media Topic
created: 2009-10-22T02:00:00+00:00
modified: 2021-02-18T12:00:00+00:00
narrower: competition discipline
narrower: disciplinary action in sport
narrower: drug use in sport
narrower: sport event
narrower: sport industry
narrower: sport organisation
narrower: sport venue
narrower: sports transaction
narrower: sport achievement
narrower: sports coaching
narrower: sports management and ownership
narrower: sports officiating

competition discipline
type: Concept
preferred label: Deportes de competición @es
preferred label: Disziplin @de
preferred label: رياضة تنافسية @ar
preferred label: Discipline @fr
preferred label: Tävlingsidrott @se
preferred label: disciplina de competição @pt-pt
preferred label: sportsgren @dk
preferred label: 竞争规则 @zh-hans
preferred label: idrettsgren @no-nb
definition: Different types of sport which can be executed in competitions
definition: De sporter där det sker tävlingar. @se
definition: Verschiedene Arten von Sport, die in Wettkämpfen ausgetragen werden können @de
definition: Diferentes tipos de desportos que podem ser executados em competições. @pt-pt
definition: Diferentes tipos de esportes que podem ser executados em competições. @pt-br
definition: Forskellige sportsgrene, der kan udføres i konkurrencer. @dk
definition: 可在比赛中进行的不同类型的运动 @zh-hans
in scheme: Media Topic
created: 2009-10-22T02:00:00+00:00
modified: 2021-02-18T12:00:00+00:00
broader: sport
narrower: American football
narrower: archery
narrower: athletics
narrower: Australian rules football
narrower: badminton
narrower: bandy
narrower: baseball
narrower: basketball
narrower: biathlon
narrower: billiards
narrower: bobsleigh
narrower: boules
narrower: boxing
narrower: bullfighting
narrower: Canadian football
narrower: canoeing
narrower: casting (fishing)
narrower: mountain climbing
narrower: sport climbing
narrower: cricket
narrower: croquet
narrower: curling
narrower: cycling
narrower: competitive dancing
narrower: darts
narrower: diving
narrower: underwater sports
narrower: dog racing
narrower: duathlon
narrower: equestrian
narrower: fencing
narrower: field hockey
narrower: figure skating
narrower: fist ball
narrower: floorball
narrower: flying disc
narrower: Gaelic football
narrower: golf
narrower: gymnastics
narrower: handball (team)
narrower: hornuss
narrower: horse racing
narrower: hurling
narrower: ice hockey
narrower: inline skating
narrower: Jai Alai (Pelota)
narrower: kabaddi
narrower: kayaking
narrower: lacrosse
narrower: luge
narrower: marathon
narrower: modern pentathlon
narrower: motorboat racing
narrower: motor car racing
narrower: motorcycling
narrower: netball
narrower: orienteering
narrower: parachuting

disciplinary action in sport
type: Concept
preferred label: Mesures disciplinaires dans le sport @fr
preferred label: Disziplinarmaßnahmen im Sport @de
preferred label: Acción disciplinaria en el deporte @es
preferred label: رياضة @ar
preferred label: Idrottslig bestraffning @se
preferred label: medidas disciplinares no desporto @pt-pt
preferred label: medidas disciplinares no esporte @pt-br
preferred label: disciplinær handling i sport @dk
preferred label: 运动纪律处分 @zh-hans
preferred label: straffereaksjoner i idretten @no-nb
preferred label: straffereaksjonar i idretten @no-nn
definition: Actions, including fines and suspensions levied by sports organisations and teams
definition: Aktionen, einschließlich Geldstrafen und Suspensionen erhoben von Sportorganisationen und Teams @de
definition: Åtgärder, t ex böter och avstängning, som påförs av idrottsorganisationer eller idrottslag. @se
definition: Ações, incluindo multas e suspensões, atribuídas por equipas e organizações desportivas. @pt-pt
definition: Ações, incluindo multas e suspensões, atribuídas por equipes e organizações esportivas. @pt-br
definition: Foranstaltninger, såsom bøder og suspensioner, idømt af sportsorganisationer eller sportshold. @dk
definition: 体育组织或团体实施的纪律处分，包括罚款，停赛 @zh-hans
definition: Actions, including fines and suspensions levied by sports organizations and teams
in scheme: Media Topic
created: 2009-10-22T02:00:00+00:00
modified: 2021-02-18T12:00:00+00:00
broader: sport

drug use in sport
type: Concept
preferred label: Idrottsmedicin @se
preferred label: Médicaments autorisés dans le sport @fr
preferred label: استخدام منشطات @ar
preferred label: Doping (allgemein) @de
preferred label: Dopaje y medicamentos en el deporte @es
preferred label: dopagem (geral) @pt-pt
preferred label: stofbrug i sport @dk
preferred label: 使用违禁药物 @zh-hans
preferred label: doping @no-nb
definition: Användning av läkemedel inom idrotten. @se
definition: Drug use associated with sport activities, including doping, abuse, testing and permitted medical uses
definition: Medikamente werden genommen um die Wettbewerbsfähigkeit im Sport zu ermöglichen @de
definition: Utilização de substâncias proibidas para aumentar a competitividade no desporto. @pt-pt
definition: Utilização de substâncias proibidas para aumentar a competitividade no esporte. @pt-br
definition: Brug af stoffer i sport. @dk
definition: 在体育运动中使用药品保证竞争能力 @zh-hans
in scheme: Media Topic
created: 2009-10-22T02:00:00+00:00
modified: 2022-09-23T12:00:00+00:00
broader: sport
narrower: drug abuse in sport
narrower: drug testing in sport
narrower: medical drug use in sport
broad match: http://cv.iptc.org/newscodes/subjectcode/15000000

sport event
type: Concept
preferred label: Évènement sportif @fr
preferred label: Sportereignis @de
preferred label: حدث رياضي @ar
preferred label: Eventos deportivos @es
preferred label: Idrottshändelse @se
preferred label: evento desportivo @pt-pt
preferred label: eventos esportivos @pt-br
preferred label: sportsbegivenhed @dk
preferred label: 体育赛事 @zh-hans
preferred label: idrettskonkurranse @no-nb
definition: Sportliche Veranstaltung, bei der ein oder mehrere sportliche Wettkämpfe stattfinden @de
definition: An event featuring one or more sport competitions
definition: En tillställning med en eller flera sporttävlingar. @se
definition: Evento com uma ou mais competições desportivas. @pt-pt
definition: Evento com uma ou mais competições esportivas. @pt-br
definition: Et arrangement med en eller flere sportskonkurrencer. @dk
definition: 以一项或多项体育比赛为特色的活动 @zh-hans
in scheme: Media Topic
created: 2009-10-22T02:00:00+00:00
modified: 2021-07-12T12:00:00+00:00
broader: sport
narrower: continental championship
narrower: continental cup
narrower: continental games
narrower: international championship
narrower: international cup
narrower: international games
narrower: national championship
narrower: national cup
narrower: national games
narrower: regional championship
narrower: regional cup
narrower: regional games
narrower: world championship
narrower: world cup
narrower: world games
narrower: Olympic Games
narrower: Paralympic Games
narrower: regular competition
narrower: playoff championship
narrower: final game

sport industry
type: Concept
preferred label: Industria del deporte @es
preferred label: Sportindustri @se
preferred label: صناعة الرياضة @ar
preferred label: Industrie du sport @fr
preferred label: Sportindustrie @de
preferred label: indústria do desporto @pt-pt
preferred label: indústria do esporte @pt-br
preferred label: sportindustri @dk
preferred label: 体育产业 @zh-hans
preferred label: sportsindustri @no-nb
definition: Kommerzielle Aspekte im Sport @de
definition: Kommersiella händelser relaterade till sport. @se
definition: Commercial issues related to sport
definition: Questões comerciais relacionadas com o desporto. @pt-pt
definition: Questões comerciais relacionadas ao esporte. @pt-br
definition: Sport som forretning. @dk
definition: 体育相关的商业事务 @zh-hans
in scheme: Media Topic
created: 2009-10-22T02:00:00+00:00
modified: 2021-02-18T12:00:00+00:00
broader: sport
broad match: http://cv.iptc.org/newscodes/subjectcode/15000000

sport organisation
type: Concept
preferred label: Sportorganisation @de
preferred label: Organización deportiva @es
preferred label: Organisation sportive @fr
preferred label: Idrottsorganisationer @se
preferred label: منظمة رياضية @ar
preferred label: organizações desportivas @pt-pt
preferred label: organizações esportivas @pt-br
preferred label: sports -og idrætsorganisation @dk
preferred label: 体育组织 @zh-hans
preferred label: Idrettsorganisasjoner @no-nb
preferred label: sport organization
definition: Organisationen und Sportverbände @de
definition: Ett samlande namn på institutioner och organisationer som ägnar sig åt idrott, såsom lokala idrottsföreningar, idrottsförbund och idrottsfederationer. @se
definition: Organisations or associations that govern sports
definition: Organizações responsáveis por um evento desportivo. @pt-pt
definition: Organizações responsáveis por um evento esportivo. @pt-br
definition: Organisationer eller foreninger, der beskæftiger sig med sport. @dk
definition: 体育组织或协会 @zh-hans
definition: Organizations or associations that govern sports
in scheme: Media Topic
created: 2009-10-22T02:00:00+00:00
modified: 2023-10-02T12:00:00+00:00
broader: sport

sport venue
type: Concept
preferred label: Infraestructuras deportivas @es
preferred label: Site sportif @fr
preferred label: منشأة رياضية @ar
preferred label: Sportstätte @de
preferred label: Idrottsarenor @se
preferred label: instalação desportiva @pt-pt
preferred label: instalação esportiva @pt-br
preferred label: sportsarena @dk
preferred label: 体育场馆 @zh-hans
preferred label: idrettsanlegg @no-nb
definition: Kommerzielle Einrichtungen für Sportereignisse @de
definition: Kommersiell fastighet för idrottsevenemang. @se
definition: Gymnasiums, stadiums, arenas or facilities where sports events take place
definition: Construção (edifício, estrutura ou recinto) devidamente preparada para receber eventos desportivos. @pt-pt
definition: Construção (edifício, estrutura ou recinto) devidamente preparada para receber eventos esportivos. @pt-br
definition: Kommerciel facilitet til sportsbegivenhed. @dk
definition: 进行体育活动的体育馆、体育场、竞技场或其他场地设施 @zh-hans
definition: Commercial facility for sporting event
in scheme: Media Topic
created: 2009-10-22T02:00:00+00:00
modified: 2021-03-31T12:00:00+00:00
broader: sport
broad match: http://cv.iptc.org/newscodes/subjectcode/15000000

sports transaction
type: Concept
preferred label: Transfermarknad @se
preferred label: Transfer @de
preferred label: transferência @pt-pt
preferred label: transfermarked @dk
preferred label: 运动员转会 @zh-hans
preferred label: overgang @no-nb
preferred label: Transfert (sport) @fr
preferred label: Transferencia (deporte) @es
preferred label: انتقال (رياضة) @ar
definition: Marknaden där spelare byter från ett lag till ett annat. @se
definition: The transfer of an athlete from one team to another, the hiring or drafting of an athlete onto a team or the change in professional status of a player on a team
definition: Wechsel eine Teammitglieds von einem Team zu einem anderen @de
definition: Mudança de um membro de uma equipa para outra. @pt-pt
definition: Mudança de um membro de uma equipe para outra. @pt-br
definition: Markedet, hvor spillerne skifter fra et hold til et andet. @dk
definition: 队员改变归属运动队 @zh-hans
in scheme: Media Topic
created: 2012-10-04T12:00:00+00:00
modified: 2021-07-12T12:00:00+00:00
broader: sport

sport achievement
type: Concept
preferred label: idrettsprestasjon @no-nb
preferred label: Sportsliga framgång @se
preferred label: sportspræstation @dk
preferred label: conquistas desportivas @pt-pt
preferred label: conquistas esportivas @pt-br
preferred label: 体育成就 @zh-hans
preferred label: sportliche Leistung @de
preferred label: Exploit sportif @fr
preferred label: Logro deportivo @es
preferred label: انجاز رياضي @ar
definition: Records or honours earned by athletes for their performance
definition: Records or honors earned by athletes for their performance
definition: Notering av en idrottares framgångar under karriären @se
definition: Rekord eller milepæl, som en atlet eller et hold har nået. @dk
definition: Recordes ou honras ganhos por atletas pelo seu desempenho. @pt-pt
definition: Recordes ou honras ganhos por atletas por seu desempenho. @pt-br
definition: 运动员因运动成绩而获得的记录或荣誉 @zh-hans
definition: Rekorde oder Ehrungen von Sportlern für ihre Leistungen @de
in scheme: Media Topic
created: 2021-02-18T12:00:00+00:00
modified: 2021-07-12T12:00:00+00:00
broader: sport
narrower: sports record
narrower: sports medal and trophy
narrower: sports honour

sports coaching
type: Concept
preferred label: trenere og lagledere @no-nb
preferred label: Tränare @se
preferred label: idrettstrenarar @no-nn
preferred label: Entrenamiento deportivo @es
preferred label: Entraînement sportif @fr
preferred label: تدريب رياضي @ar
preferred label: Trainerteam @de
definition: The staff responsible for the training and on-field management of a sports team
definition: Personer som är anlitade för att leda idrottares träning och tävling. @se
definition: Das Personal, das für das Training und das Management einer Sportmannschaft auf dem Spielfeld verantwortlich ist @de
in scheme: Media Topic
created: 2021-05-05T12:00:00+00:00
modified: 2021-12-21T12:00:00+00:00
broader: sport

sports management and ownership
type: Concept
preferred label: klubbledelse og -eiere @no-nb
preferred label: Administratörer @se
preferred label: lagleiing og eigarar @no-nn
preferred label: Administración y propiedad (deporte) @es
preferred label: Dirigeants sportifs @fr
preferred label: مسؤولون رياضيون @ar
preferred label: Vereinsführung @de
definition: The executive leadership and owners of a sports team
definition: Personer som äger och/eller leder lag och idrottare på en mer övergripande nivå än tränare. @se
definition: Die Führungsspitze und die Eigentümer eines Sportvereins @de
in scheme: Media Topic
created: 2021-05-05T12:00:00+00:00
modified: 2021-12-21T12:00:00+00:00
broader: sport

sports officiating
type: Concept
preferred label: dommere @no-nb
preferred label: Domare (Tävling) @se
preferred label: dommarar @no-nn
preferred label: Arbitraje deportivo @es
preferred label: Arbitrage sportif @fr
preferred label: تحكيم رياضي @ar
preferred label: Schiedsrichter @de
definition: Referees, umpires and other staff who enforce the rules of a sport from on the field of play
definition: Personer som på olika sätt ser till att tävlingar sker enligt den sportens regler. @se
definition: Schiedsrichter, Kampfrichter und anderes Personal, das die Regeln einer Sportart auf dem Spielfeld durchsetzt @de
in scheme: Media Topic
created: 2021-05-05T12:00:00+00:00
modified: 2024-03-28T12:00:00+00:00
broader: sport

conflict, war and peace
type: Concept
preferred label: Krise, Krieg, Konflikte @de
preferred label: Conflicto, guerra y paz @es
preferred label: Krig, konflikter och oroligheter @se
preferred label: نزاعات، حرب وسلام @ar
preferred label: Conflit, guerre et paix @fr
preferred label: conflito, guerra e paz @pt-pt
preferred label: konflikt, krig og fred @dk
preferred label: 冲突、战争与和平 @zh-hans
definition: Actos de protesta o de violencia cuyos motivos pueden ser sociales o políticos, actividades militares, conflictos geopolíticos, esfuerzos de resolución de conflictos @es
definition: Acts of socially or politically motivated protest or violence, military activities, geopolitical conflicts, as well as resolution efforts
definition: Sozial oder politisch motivierte Aktivitäten sowhl in Form von Protesten, Gewalttätigkeiten, Militäraktionen und geopolitischen Konflikten, als auch Aktivitäten zur Lösung dessen @de
definition: Actes de violence dont les motifs peuvent être sociaux ou politiques, activités militaires, conflits géopolitiques, efforts de résolution de conflit @fr
definition: Socialt eller politiskt motiverade protester och/eller våldshandlingar. Terrorism, väpnade konflikter, social oro, statskupper, Gerillaaktiviteter, massakrer, upplopp, våldsamma demonstrationer, krig. @se
definition: Atos de protesto ou de violência, cujos motivos podem ser sociais ou políticos, atividades militares, conflitos geopolíticos, esforços de resolução de conflitos. @pt-pt
definition: Socialt eller politisk motiverede protester og/eller voldshandlinger. Terrorisme, væbnede konflikter, social uro, statskup, guerillaaktiviteter, massakrer, optøjer, voldelige demonstrationer og krig, såvel som fredsinitiativer. @dk
definition: 具有社会或政治动机的示威或暴力行为、军事活动、地缘政治冲突以及试图解决问题的努力 @zh-hans
in scheme: Media Topic
created: 2009-10-22T02:00:00+00:00
modified: 2021-02-18T12:00:00+00:00
narrower: act of terror
narrower: armed conflict
narrower: civil unrest
narrower: coup d'etat
narrower: massacre
narrower: peace process
narrower: post-war reconstruction
narrower: cyber warfare
narrower: war victims
broad match: http://cv.iptc.org/newscodes/subjectcode/16000000

act of terror
type: Concept
preferred label: Terroranschlag @de
preferred label: Acte de terrorisme @fr
preferred label: Atentado @es
preferred label: Terrorhandling @se
preferred label: عمل ارهابي @ar
preferred label: terrorismo @pt-pt
preferred label: terrorhandling @dk
preferred label: 恐怖活动 @zh-hans
preferred label: terrorangrep @no-nb
definition: Acto de violencia que puede causar víctimas, con el propósito de generar miedo y ansiedad en una población @es
definition: Act of violence, often resulting in casualties, designed to raise fear and anxiety in a population
definition: Meist tödliche Gewalttat, um Angst und Schrecken in der Bevölkerung auszulösen @de
definition: Acte de violence, entraînant souvent des victimes, destiné à susciter la peur et l'anxiété dans une population @fr
definition: Organiserade våldshandlingar som väcker skräck och fasa, ofta utförda i politiskt syfte och av mindre grupper. @se
definition: Ato de violência, por vezes mortal, para fazer crescer o medo e a ansiedade de uma população. @pt-pt
definition: Organiserede voldshandlinger, der fremkalder frygt og rædsel i befolkningen, ofte udført til politiske formål og af mindre grupper. @dk
definition: 暴力行为，通常造成人员伤亡，旨在引起人群的恐惧和焦虑 @zh-hans
in scheme: Media Topic
created: 2009-10-22T02:00:00+00:00
modified: 2021-02-18T12:00:00+00:00
broader: conflict, war and peace
narrower: act of bioterrorism
narrower: terrorist bombings

armed conflict
type: Concept
preferred label: Conflit armé @fr
preferred label: Bewaffneter Konflikt @de
preferred label: Militära konflikter @se
preferred label: Conflictos armados @es
preferred label: نزاع مسلح @ar
preferred label: conflito armado @pt-pt
preferred label: væbnet konflikt @dk
preferred label: 武装冲突 @zh-hans
preferred label: væpnet konflikt @no-nb
preferred label: væpna konflikt @no-nn
definition: Conflictos entre grupos opuestos que involucran el uso de armas, pero no necesariamente guerras declaradas @es
definition: Dispyter mellan väpnade trupper, inte nödvändigtvis formella krig. @se
definition: Disputes between opposing groups involving the use of weapons, but not necessarily formally declared wars
definition: Conflits entre groupes opposés impliquant l'utilisation d'armes, pas nécessairement des guerres déclarées @fr
definition: Auseinandersetzungen zwischen gegensätzlichen Gruppen, unter Einsatz von Waffen @de
definition: Disputas entre grupos opostos, envolvendo o uso de armas, mas não sendo guerra declarada. @pt-pt
definition: Tvister mellem væbnede tropper, ikke nødvendigvis formelle krige. @dk
definition: 敌对团体之间的争端涉及使用武器，但不一定是正式宣战 @zh-hans
in scheme: Media Topic
created: 2009-10-22T02:00:00+00:00
modified: 2021-02-18T12:00:00+00:00
broader: conflict, war and peace
narrower: guerrilla activity
narrower: international military intervention
narrower: military occupation
narrower: war

civil unrest
type: Concept
preferred label: اضطرابات اهلية @ar
preferred label: Troubles civils @fr
preferred label: Unruhen @de
preferred label: Disturbios @es
preferred label: Oroligheter @se
preferred label: agitação civil @pt-pt
preferred label: civil urolighed @dk
preferred label: 内乱 @zh-hans
preferred label: demonstrasjoner og opptøyer @no-nb
preferred label: demonstrasjonar og opptøyar @no-nn
definition: Missnöje bland befolkningen som yttrar sig som strejker, massmöten, demonstrationer eller sabotage. @se
definition: Reuniones, huelgas, manifestaciones, disturbios u otras perturbaciones organizadas por una población para protestar por las políticas o acciones de un gobierno u otra organización @es
definition: Kundgebungen, Streiks, Demonstrationen, Ausschreitungen oder ein anderer Aufruhr in der Bevölkerung, meist aus Protest gegen die Regierung oder gegen die Politik oder gegen Aktionen einer anderen Organisation @de
definition: Rallies, strikes, demonstrations, riots or other disturbances by a population, often in protest to a government or other organization's policies or actions
definition: Rassemblements, grèves, manifestations, émeutes ou autres perturbations menées par une population, souvent pour protester contre les politiques ou les actions d'un gouvernement ou d'une autre organisation @fr
definition: Insatisfação entre a população manifestada por comícios, greves, manifestações ou sabotagens. @pt-pt
definition: Insatisfação entre a população geral, conforme comprovado por comícios, greves, manifestações ou sabotagens. @pt-br
definition: Uro blandt befolkningen, der kommer til udtryk ved strejker, oprør, demonstrationer eller sabotage. @dk
definition: 群众集会、罢工、示威、骚乱或其他动乱，通常是为了抗议政府或其他组织的政策或行动 @zh-hans
in scheme: Media Topic
created: 2009-10-22T02:00:00+00:00
modified: 2021-02-18T12:00:00+00:00
broader: conflict, war and peace
narrower: protests and demonstrations
narrower: rebellion
narrower: revolution
narrower: riot

coup d'etat
type: Concept
preferred label: انقلاب @ar
preferred label: Golpe de estado @es
preferred label: Staatsstreich @de
preferred label: Coup d'Etat @fr
preferred label: Statskupp @se
preferred label: golpe de estado @pt-pt
preferred label: statskup @dk
preferred label: 政变 @zh-hans
preferred label: statskupp @no-nb
definition: The overthrow of an established government by an organised military or political group
definition: Derrocamiento de un gobierno por un grupo militar o político organizado @es
definition: Plötsligt och (vanligen) med våld genomfört maktskifte i en stat, vanligtvis av (del av) krigsmakten och utan folkets deltagande. @se
definition: Renversement d'un gouvernement par un groupe militaire ou politique organisé @fr
definition: Der Sturz einer bestehenden Regierung durch eine organisierte militärische oder politische Gruppe @de
definition: Derrube de um governo, feito por um grupo organizado, geralmente militar ou político. @pt-pt
definition: Derrube de um governo estabelecido, feito por um grupo organizado, geralmente militar ou político. @pt-br
definition: Omstyrtning af en etableret regering af en organiseret militær eller politisk gruppe. @dk
definition: 有组织的军事或政治团体推翻现有政权 @zh-hans
definition: The overthrow of an established government by an organized military or political group
in scheme: Media Topic
created: 2009-10-22T02:00:00+00:00
modified: 2021-02-18T12:00:00+00:00
broader: conflict, war and peace

massacre
type: Concept
preferred label: Massaker @se
preferred label: مجزرة @ar
preferred label: Massacre @fr
preferred label: Matanza @es
preferred label: massakre @dk
preferred label: 大屠杀 @zh-hans
definition: Samtidigt dödande av många människor, ofta civila, under krigstid. @se
definition: Masacre de personas, generalmente civiles, durante las hostilidades de una guerra @es
definition: Der Massenmord an einer Gruppe von Menschen, meist Zivilisten, während einer kriegerischen Auseinandersetzung. @de
definition: The mass killing of people, usually civilians, during wartime hostilities
definition: Massacre de personnes, généralement des civils, pendant les hostilités en temps de guerre @fr
definition: Morte de um grande grupo de pessoas num curto período de tempo. @pt-pt
definition: Morte de um grande grupo de pessoas em um curto período de tempo. @pt-br
definition: Massedrab på mennesker, ofte civile, under krig eller konflikt @dk
definition: 战争期间对人民，通常是平民的大规模杀戮 @zh-hans
in scheme: Media Topic
created: 2009-10-22T02:00:00+00:00
modified: 2021-02-18T12:00:00+00:00
broader: conflict, war and peace

peace process
type: Concept
preferred label: عملية سلام @ar
preferred label: Processus de paix @fr
preferred label: Proceso de paz @es
preferred label: Fredsprocess @se
preferred label: Friedensprozess @de
preferred label: processo de paz @pt-pt
preferred label: fredsproces @dk
preferred label: 和平进程 @zh-hans
preferred label: fredsprosess @no-nb
definition: Organized actions to end a war or conflict, usually involving peace negotiations and agreements
definition: Actions organisées pour mettre fin à une guerre ou à un conflit, impliquant généralement des négociations de paix et des accords @fr
definition: Åtgärder för att göra slut på ett krig eller en konflikt, ofta genom fredssamtal eller -avtal. @se
definition: Organisierte Aktivitäten um einen Konflikt oder Krieg zu beenden, üblicherweise unter Einsatz von Friedensverhandlungen und Friedensvereinbarungen @de
definition: Acciones organizadas para poner fin a una guerra o conflicto, generalmente con negociaciones y acuerdos de paz @es
definition: Ações organizadas para pôr fim a uma guerra ou conflito, que envolvem geralmente negociações de paz e acordos. @pt-pt
definition: Foranstaltninger til afslutning af en krig eller konflikt, ofte gennem fredsforhandlinger eller -aftaler. @dk
definition: 有组织的结束战争或冲突的行动，通常包括和平谈判和协议 @zh-hans
in scheme: Media Topic
created: 2009-10-22T02:00:00+00:00
modified: 2021-02-18T12:00:00+00:00
broader: conflict, war and peace
narrower: peacekeeping force
narrower: peace envoy
narrower: peace plan
narrower: peace talks
narrower: disarmament
broad match: http://cv.iptc.org/newscodes/subjectcode/11002003

post-war reconstruction
type: Concept
preferred label: Återuppbyggnad @se
preferred label: Wiederaufbau @de
preferred label: Reconstruction @fr
preferred label: اعمار ما بعد الحرب @ar
preferred label: Reconstrucción @es
preferred label: reconstrução pós-guerra @pt-pt
preferred label: genopbygning efter krig @dk
preferred label: 战后重建 @zh-hans
preferred label: gjenreisning @no-nb
preferred label: atterreising @no-nn
definition: Acciones para reconstruir una sociedad, economía o sistema político en una zona afectada por la guerra @es
definition: Actions pour reconstruire une société, une économie ou un système politique dans une zone touchée par la guerre @fr
definition: Åtgärder för att återskapa samhället, ekonomin och det politiska systemet i ett krigshärjat område. @se
definition: Aktivitäten zur Wiederherstellung der Gesellschaft, Wirtschaft oder des politischen Systems in einem Gebiet nach einem Krieg @de
definition: Actions to rebuild a society, economy or political system in an area affected by war
definition: Ações para reconstruir uma sociedade, economia ou sistema político numa área afetada pela guerra. @pt-pt
definition: Foranstaltninger til at genoprette samfundet, økonomien og det politiske system i et krigshærget område. @dk
definition: 重建受战争影响地区的社会、经济或政治制度的行动 @zh-hans
in scheme: Media Topic
created: 2009-10-22T02:00:00+00:00
modified: 2021-02-18T12:00:00+00:00
broader: conflict, war and peace
narrower: ordnance clearance
broad match: http://cv.iptc.org/newscodes/subjectcode/11002000

cyber warfare
type: Concept
preferred label: cyberkrigføring @no-nn
preferred label: Cyberkrigföring @se
preferred label: Cyberkrieg @de
definition: Cyber attacks, or suspected attacks, involving a government entity as either the sponsor or the target, or preventive measures against these types of actions
definition: Angrepp, eller misstänkta angrepp mot ett lands it-infrastruktur och försvar mot sådana angrepp. @se
definition: Cyberangriffe oder mutmaßliche Angriffe, an denen eine staatliche Einrichtung entweder als Sponsor oder als Ziel beteiligt ist. Auch Präventivmaßnahmen gegen diese Art von Aktionen. @de
in scheme: Media Topic
created: 2022-09-23T12:00:00+00:00
modified: 2022-09-23T12:00:00+00:00
broader: conflict, war and peace

war victims
type: Concept
preferred label: Krigsoffer @se
preferred label: krigsoffer @no-nb
preferred label: Kriegsopfer @de
definition: Individuals who are injured or killed in a war or armed conflict, including civilians
definition: Personer, både civila och militära, som skadats eller dödats i samband med krig eller militära konflikter. @se
definition: Personen, die in einem Krieg oder bewaffneten Konflikt verletzt oder getötet werden, einschließlich Zivilisten @de
in scheme: Media Topic
created: 2024-03-28T12:00:00+00:00
modified: 2024-03-28T12:00:00+00:00
broader: conflict, war and peace
narrower: missing in action
narrower: prisoners of war

weather
type: Concept
preferred label: Wetter @de
preferred label: Météo @fr
preferred label: طقس @ar
preferred label: Väder @se
preferred label: Meteorología @es
preferred label: meteorologia @pt-pt
preferred label: vejr @dk
preferred label: 天气 @zh-hans
preferred label: vær @no-nb
preferred label: vêr @no-nn
definition: Studien, Vorhersagen und Berichte meteorologischer Phänomene @de
definition: Etude, observation et prévision des phénomènes météorologiques @fr
definition: Meteorologiska studier, rapporteringar och förutsägelser. Väderrapporter, globala förändringar i vädret, statistik, varningar @se
definition: Estudio, observación y pronóstico de fenómenos meteorológicos @es
definition: The study, prediction and reporting of meteorological phenomena
definition: Estudo, relatório e previsão de fenómenos meteorológicos. @pt-pt
definition: Estudo, relatório e previsão de fenômenos meteorológicos. @pt-br
definition: Undersøgelse, forudsigelse og rapportering af meteorologiske fænomener. @dk
definition: 对气象现象研究预测和报道 @zh-hans
in scheme: Media Topic
created: 2009-10-22T02:00:00+00:00
modified: 2021-02-18T12:00:00+00:00
narrower: weather forecast
narrower: weather phenomena
narrower: weather statistic
narrower: weather warning

weather forecast
type: Concept
preferred label: Prévisions météorologiques @fr
preferred label: توقعات الطقس @ar
preferred label: Pronóstico del tiempo @es
preferred label: Väderprognos @se
preferred label: Vorhersage @de
preferred label: previsão meteorológica @pt-pt
preferred label: vejrudsigt @dk
preferred label: 天气预报 @zh-hans
preferred label: værmelding @no-nb
preferred label: vêrmelding @no-nn
definition: Förutsägelse om vädret baserad på vetenskaplig grund. @se
definition: Prévision ou rapport météorologique à long ou à court terme pour une région donnée @fr
definition: Vorhersage und Berichte über den Verlauf des Wetters sowohl für einen kürzeren als auch längeren, zukünftigen Zeitraum @de
definition: The long- or short-term meteorological prediction and reporting of the upcoming weather for a given region
definition: Pronóstico o informe meteorológico a largo o corto plazo para una región determinada @es
definition: Previsão do tempo meteorológico a curto e a longo prazo. @pt-pt
definition: Den langsigtede eller kortvarige meteorologiske forudsigelse og rapportering af det kommende vejr for en given region. @dk
definition: 对远期或近期特定区域气象情况的预报 @zh-hans
in scheme: Media Topic
created: 2009-10-22T02:00:00+00:00
modified: 2021-02-18T12:00:00+00:00
broader: weather

weather phenomena
type: Concept
preferred label: Wetterphänomene @de
preferred label: Fenómenos meteorológicos @es
preferred label: Phénomène météorologique @fr
preferred label: Väderfenomen @se
preferred label: ظاهرة احوال جوية @ar
preferred label: fenómenos climáticos @pt-pt
preferred label: fenômenos climáticos @pt-br
preferred label: vejrfænomen @dk
preferred label: 天气现象 @zh-hans
preferred label: værfenomen @no-nb
preferred label: vêrfenomen @no-nn
definition: Phénomène météorologique à court ou à long terme digne d'être étudié, signalé ou rapporté tel que le changement climatique, les tempêtes, les vagues de chaleur ou les tornades @fr
definition: Kurz- oder langfristige Beobachtungen von Wetterphänomenen die untersucht, berichtet oder auf die öffentlich hingewiesen werden soll, wie etwa Klimaänderungen, Unwetter, Hitzewellen oder Wirbelstürme @de
definition: Short- or long-term meteorological phenomena worthy of study, reporting or public advisory such as climate change, storms, heat waves or tornadoes
definition: Fenómeno meteorológico a corto o largo plazo suficientemente importante para ser estudiado o reportado, como el cambio climático, las tormentas, las olas de calor o los tornados @es
definition: Speciella meteorologiska väderförhållanden, som är värda att studera, rapportera eller varna för. @se
definition: Fenómenos meteorológicos de curta ou longa duração, dignos de estudo, relatórios ou assessoria pública, como alterações climáticas, tempestades, ondas de calor ou tornados. @pt-pt
definition: Fenômenos meteorológicos de curta ou longa duração, dignos de estudo, relatórios ou assessoria pública, como mudanças climáticas, tempestades, ondas de calor ou tornados. @pt-br
definition: Kort- eller langvarige meteorologiske fænomener, der er værd at undersøge, rapportere eller offentlig rådgivning, såsom klimaændringer, storme, hedebølge eller tornadoer. @dk
definition: 值得研究、报道或者提醒大众的短期或长期的气象情况，例如气候变化、暴风雨，热浪或龙卷风。 @zh-hans
in scheme: Media Topic
created: 2009-10-22T02:00:00+00:00
modified: 2021-05-05T12:00:00+00:00
broader: weather
broad match: http://cv.iptc.org/newscodes/subjectcode/17003001

weather statistic
type: Concept
preferred label: احصاءات احوال جوية @ar
preferred label: Statistiques météorologiques @fr
preferred label: Estadísticas meteorológicas @es
preferred label: Wetterstatistik @de
preferred label: Väderstatistik @se
preferred label: estatísticas climáticas @pt-pt
preferred label: vejrstatistik @dk
preferred label: 气象数据 @zh-hans
preferred label: værstatistikk @no-nb
preferred label: vêrstatistikk @no-nn
definition: Données numériques telles que la température, le taux d'humidité, la pression atmosphérique, le niveau de crue ou la variation des marées @fr
definition: Numerical facts about the weather such as temperature, barometric pressure, river levels, humidity or high and low tides
definition: Numeriska fakta om vädret, såsom temperatur, hög- och lågtryck, luftfuktighet och liknande. @se
definition: Numerische Daten über das Wetter, wie etwa Temperatur, Luftdruck, Luftfeuchtigkeit, Wasserstände, auch von Flut und Ebbe. @de
definition: Datos numéricos como temperatura, humedad, presión atmosférica, nivel de inundación o variación de la marea @es
definition: Factos numéricos sobre o tempo, como temperatura, pressão atmosférica, níveis dos rios, humidade, marés altas e marés baixas, etc. @pt-pt
definition: Fatos numéricos sobre o tempo, como temperatura, pressão atmosférica, níveis dos rios, umidade, marés altas e marés baixas etc. @pt-br
definition: Numeriske fakta om vejret som temperatur, barometrisk tryk, flodniveauer, fugtighed eller høj og lavvande. @dk
definition: 有关天气的数值事实，例如温度、气压、河流水位、湿度或涨潮或退潮 @zh-hans
in scheme: Media Topic
created: 2009-10-22T02:00:00+00:00
modified: 2021-02-18T12:00:00+00:00
broader: weather

weather warning
type: Concept
preferred label: Unwetterwarnung @de
preferred label: Alertes météorologiques @fr
preferred label: Alertas meteorológicas @es
preferred label: Vädervarning @se
preferred label: تحذير احوال جوية @ar
preferred label: alerta meteorológico @pt-pt
preferred label: vejrvarsel @dk
preferred label: 天气预警 @zh-hans
preferred label: farevarsel om vær @no-nb
preferred label: farevarsel om vêr @no-nn
definition: Alerts issued to the public about severe or notable weather in their area
definition: Larm när vädret väntas innebära risker för allmänheten och störningar i samhällsfunktioner. @se
definition: Alerta a las personas advirtiéndoles sobre condiciones climáticas peligrosas en su área @es
definition: Warnungen an die Bevölkerung eines bestimmten Gebietes vor heranziehendem Unwetter @de
definition: Alertes aux populations les avertissant de conditions météorologiques dangeureuses dans leur région @fr
definition: Alertas gerais à população sobre a aproximação de mau tempo. @pt-pt
definition: Underretninger udsendt til offentligheden om hårdt eller bemærkelsesværdigt vejr i deres område. @dk
definition: 向公众发出有关该地区恶劣或显著天气的警报 @zh-hans
in scheme: Media Topic
created: 2009-10-22T02:00:00+00:00
modified: 2021-02-18T12:00:00+00:00
broader: weather

animation
type: Concept
preferred label: Animation @se
preferred label: Animación @es
preferred label: تحريك @ar
preferred label: Dessin animé @fr
preferred label: animação @pt-pt
preferred label: 动画 @zh-hans
preferred label: animasjon @no-nb
definition: Rörlig bild skapad av en serie teckningar, lerfigurer etc med små förändringar från en bild till nästa. @se
definition: Erzählung in Form von Computergrafik, als Langfilm oder Kurzfilm @de
definition: Stories told through animated drawings in either full-length or short format
definition: Histoires racontées à travers des dessins animés en format long ou court @fr
definition: Historias contadas a través de dibujos animados en formato largo o corto @es
definition: Técnica que permite dar a desenhos ou bonecos a ilusão de movimento; artistas envolvidos e comercialização de produtos com personagens dos filmes daí resultantes. @pt-pt
definition: Animação, incluindo longas e curtas-metragens, artistas e comercialização de produtos com personagens de animação. @pt-br
definition: Historier fortalt gennem animerede tegninger eller computergrafik. @dk
definition: 长短篇的动画故事 @zh-hans
in scheme: Media Topic
created: 2009-10-22T02:00:00+00:00
modified: 2021-03-15T12:00:00+00:00
broader: arts and entertainment

cartoon
type: Concept
preferred label: كرتون @ar
preferred label: Caricaturas @es
preferred label: Bande dessinée @fr
preferred label: Serieteckningar @se
preferred label: Comic @de
preferred label: tegneserie @dk
preferred label: 卡通 @zh-hans
preferred label: teikneserie @no-nn
definition: Bilder framställda på andra sätt än med kamera. Enstaka bilder eller serier av bilder, ofta i form av satir eller komik. @se
definition: Dessins (dessins de presse, caricatures, bandes dessinées) utilisant souvent l'humour ou la satire @fr
definition: Zeichnungen, wie Karikaturen und Comics, die oft Humor und Satire ausdrücken. @de
definition: Drawings, such as editorial cartoons and comic strips, often using humour or satire
definition: Dibujos, como caricaturas políticas o tiras cómicas, a menudo usando humor o sátira @es
definition: Banda desenhada, geralmente de caráter humorístico. @pt-pt
definition: Imagens como caricaturas editoriais e tiras de quadrinhos. @pt-br
definition: Tegninger, både som underholding og redaktionelle tegninger, der kan bruge humor eller satire. @dk
definition: 漫画，经常使用幽默或讽刺的绘画形式，如社论漫画和连环漫画 @zh-hans
definition: Drawings, such as editorial cartoons and comic strips, often using humor or satire
in scheme: Media Topic
created: 2009-10-22T02:00:00+00:00
modified: 2021-02-18T12:00:00+00:00
broader: arts and entertainment

cinema
type: Concept
preferred label: Film @de
preferred label: Cinéma @fr
preferred label: Cine @es
preferred label: سينما @ar
preferred label: film @dk
preferred label: 电影 @zh-hans
preferred label: movies
definition: Erzählungen oder Berichte in Form eines Films, zum Beispiel Kurz- oder Langformen von Dokumentationen oder Spielfilmen @de
definition: Historias contadas a través de películas de ficción o documentales, largometrages o cortometrages @es
definition: Histoires racontées à travers des films fictionnels ou documentaires, en format long ou court @fr
definition: Stories told through motion pictures, such as full-length or short format documentary or fictional features
definition: Rörliga bilder med en handling som uttrycker en känsla eller överför ett budskap. @se
definition: Histórias relativas ao cinema como arte e entretenimento. @pt-pt
definition: Historier fortalt gennem film, herunder fiktion og dokumentar. @dk
definition: 通过银幕面向人们讲述故事，包括长篇的、短篇的，纪实的或虚构的 @zh-hans
in scheme: Media Topic
created: 2009-10-22T02:00:00+00:00
modified: 2021-02-18T12:00:00+00:00
broader: arts and entertainment

dance
type: Concept
preferred label: Tanz @de
preferred label: رقص @ar
preferred label: Dans @se
preferred label: Danza @es
preferred label: Danse @fr
preferred label: dança @pt-pt
preferred label: dans @dk
preferred label: 舞蹈 @zh-hans
definition: A form of performing art consisting of purposefully selected sequences of human movement
definition: Eine Form der darstellenden Kunst, die aus gezielt ausgewählten Abfolgen von menschlicher Bewegung besteht @de
definition: Personer som rör sig och uttrycker en känsla eller överför ett budskap. @se
definition: Forma de arte escénico que consiste en coordinar movimientos secuenciales del cuerpo @es
definition: Forme d'art qui consiste à effectuer une série de mouvements ordonnés du corps @fr
definition: Expressão de emoções ou mensagens através do movimento do corpo. @pt-pt
definition: Mennesker, der bevæger sig i rytmisk og udtrykker en følelse, eller formidler et budskab @dk
definition: 一种表演艺术形式，由有目的地选择的人类动作序列组成 @zh-hans
in scheme: Media Topic
created: 2009-10-22T02:00:00+00:00
modified: 2021-02-18T12:00:00+00:00
broader: arts and entertainment
narrower: ballet
narrower: modern dance
narrower: traditional dance

fashion
type: Concept
preferred label: Moda @es
preferred label: Mode @de
preferred label: موضة @ar
preferred label: moda @pt-pt
preferred label: mode @dk
preferred label: 时尚 @zh-hans
preferred label: mote @no-nb
definition: Estilos y tendencias en prendas de vestir, calzado, accesorios, incluido el diseño, la presentación y el uso de estos estilos y tendencias @es
definition: Styles and trends in clothing, footwear, accessories, including the design, presentation and wearing of these styles and trends
definition: Stile und Trends von Kleidung, Fußbekleidung, Modezubehör, inklusive deren Entwürfe, Präsentation und Nutzung @de
definition: Styles et tendances dans les vêtements, les chaussures, les accessoires, y compris la conception, la présentation et le port de ces styles et tendances @fr
definition: Design av kläder och tillbehör för att uttrycka en känsla eller överföra ett budskap. @se
definition: Criação e uso de roupa, de calçado e de acessórios. @pt-pt
definition: Stil og trends inden for tøj, fodtøj, tilbehør, herunder design og præsentation. @dk
definition: 服装、鞋类、配饰的风格和趋势，包括这些风格和趋势的设计、展示和穿着 @zh-hans
in scheme: Media Topic
created: 2009-10-22T02:00:00+00:00
modified: 2021-02-18T12:00:00+00:00
broader: arts and entertainment
narrower: jewellery
narrower: cosmetics
narrower: hairstyles

literature
type: Concept
preferred label: Littérature @fr
preferred label: Literatur @de
preferred label: Litteratur @se
preferred label: ادب @ar
preferred label: Literatura @es
preferred label: literatura @pt-pt
preferred label: litteratur @dk
preferred label: 文学 @zh-hans
definition: Uttryck av känslor eller överförande av budskap via skriftspråk. @se
definition: Das Erzählen einer Geschichte in Schriftform @de
definition: El relato de una historia a través del lenguaje escrito @es
definition: The telling of a story through written language
definition: Le récit d'une histoire à travers le langage écrit @fr
definition: Uso de panfletos, livros ou outros materiais impressos para transmitir ideias, histórias ou mensagens ao público. @pt-pt
definition: Fortællingen om en historie gennem skriftsprog. @dk
definition: 用书面语言讲述故事 @zh-hans
in scheme: Media Topic
created: 2009-10-22T02:00:00+00:00
modified: 2021-02-18T12:00:00+00:00
broader: arts and entertainment
narrower: drama (literature)
narrower: fiction
narrower: non-fiction
narrower: poetry

music
type: Concept
preferred label: Musique @fr
preferred label: Música @es
preferred label: Musik @de
preferred label: موسيقى @ar
preferred label: música @pt-pt
preferred label: musik @dk
preferred label: 音乐 @zh-hans
preferred label: musikk @no-nb
definition: Eine Form der darstellenden Kunst, die Instrumente oder Stimmen verwendet um unterschiedliche Klänge, Töne und Harmonien hörbar zu machen @de
definition: A form of performing art using instruments or voice to create different sounds, tones and harmonies
definition: Una forma de arte utilizando instrumentos o la voz para crear diferentes sonidos, tonos y armonías @es
definition: Art du spectacle utilisant des instruments ou la voix pour créer différents sons, tons et harmonies @fr
definition: Uttryck av känslor eller överförande av budskap genom att använda röst och/eller instrument med olika ljud, toner och harmonier. @se
definition: Forma de expressão artística que usa instrumentos ou voz, usando diferentes sons, tons e harmonias. @pt-pt
definition: Udtrykke følelser eller formidle budskaber ved hjælp af sang og/eller instrumenter med forskellige lyde, toner og harmonier. @dk
definition: 用乐器或嗓音创造出不同的声音、音调与和声的一种表演艺术形式 @zh-hans
in scheme: Media Topic
created: 2009-10-22T02:00:00+00:00
modified: 2021-02-18T12:00:00+00:00
broader: arts and entertainment
narrower: musical instrument
narrower: musical performance
narrower: musical genre

theatre
type: Concept
preferred label: Theater @de
preferred label: مسرح @ar
preferred label: Teatro @es
preferred label: Théâtre @fr
preferred label: Teater @se
preferred label: teatro @pt-pt
preferred label: teater @dk
preferred label: 戏剧 @zh-hans
preferred label: theater
definition: Uttryck av känslor eller överförande av budskap via en historia som framförs genom dialog, musik, och/eller fysiska uttryck. @se
definition: A form of performing art where live performers portray a narrative to an audience through dialogue and action
definition: Ein Form der darstellenden Kunst bei der Künstler eine Erzählung vor dem Publikum durch Dialog und Aktivitäten vermitteln @de
definition: Forma de arte escénico donde los artistas interpretan una obra frente a un público a través de un diálogo y acción @es
definition: Art du spectacle où des comédiens interprètent une pièce sur scène devant un public à travers le dialogue et l'action @fr
definition: Representação de uma história ou ideia através de diálogos, música e expressão física, em espaço ou edifício concebido para o efeito. @pt-pt
definition: En kunstform, der udtrykker følelser og budskaber gennem en historie, der formidles på scenen via dialog og handlinger foran et publikum. @dk
definition: 一种表演艺术形式，通过舞台上的对白和动作向观众讲故事 @zh-hans
definition: A form of performing art where live performers portray a narrative to an audience through dialog and action
in scheme: Media Topic
created: 2009-10-22T02:00:00+00:00
modified: 2021-02-18T12:00:00+00:00
broader: arts and entertainment
narrower: opera
narrower: music theatre
narrower: musical
narrower: operetta
narrower: drama (theatre)
narrower: stand-up comedy
narrower: cabaret

visual arts
type: Concept
preferred label: فنون بصرية @ar
preferred label: Artes visuales @es
preferred label: Visuella konstformer @se
preferred label: Arts visuels @fr
preferred label: Bildende Kunst @de
preferred label: artes visuais @pt-pt
preferred label: visuel kunst @dk
preferred label: 视觉艺术 @zh-hans
preferred label: bildekunst @no-nb
preferred label: biletkunst @no-nn
definition: Olika former av verk som i första hand appelerar till det visuella, såsom keramik, teckningar, skulpturer, foto och video. @se
definition: Forma de arte que atrae principalmente a los sentidos visuales, como la cerámica, el dibujo, la pintura, la escultura, el grabado, el diseño, la artesanía, la fotografía, el video, el cine y la arquitectura @es
definition: Kunstform, die vorrangig die visuellen Sinne anspricht, wie zum Beispiel Keramik, Zeichnungen, Malerei, Bildhauerei, Kunstdrucke, Fotografie, Video, Filme und Architektur @de
definition: Arts qui engagent principalement les sens visuels, tels que la céramique, le dessin, la peinture, la sculpture, la gravure, le design, l'artisanat, la photographie, la vidéo, le cinéma et l'architecture @fr
definition: A form of art which appeals primarily to the visual senses, such as ceramics, drawing, painting, sculpture, printmaking, design, crafts, photography, video, filmmaking, and architecture.
definition: Forma de arte que apela sobretudo ao sentido visual, como a cerâmica, desenho, pintura, escultura, impressão, design, artesanato, fotografia, vídeo, cinema e arquitetura. @pt-pt
definition: Forskellige former for værker, der primært appellerer til det visuelle, såsom keramik, tegninger, skulpturer, fotos, video og arkitektur. @dk
definition: 一种主要诉诸视觉感官的艺术形式，如陶瓷、素描、绘画、雕塑、版画、设计、工艺品、摄影、录像、电影作品和建筑 @zh-hans
in scheme: Media Topic
created: 2009-10-22T02:00:00+00:00
modified: 2021-02-18T12:00:00+00:00
broader: arts and entertainment
narrower: architecture
narrower: design (visual arts)
narrower: drawing
narrower: painting
narrower: photography
narrower: sculpture
narrower: textile arts
narrower: woodworking
narrower: forging
broad match: http://cv.iptc.org/newscodes/subjectcode/01000000

series
type: Concept
preferred label: Série @fr
preferred label: Serie @de
preferred label: série @pt-pt
preferred label: serie @dk
preferred label: 连续剧 @zh-hans
preferred label: tv-serier @no-nb
preferred label: مسلسل @ar
preferred label: tv-seriar @no-nn
definition: A connected set of fictional or non-fictional program episodes that run under the same title.
definition: Une série est une œuvre, fictionnelle ou non, constituée d'épisodes réunis sous le même titre. @fr
definition: Una serie es un conjunto de emisiones periódicas de ficción o documentales agrupadas bajo un título común. @es
definition: Eine Abfolge mehrerer Episoden von fiktiven oder dokumentarischen Inhalten die unter demselben Titel präsentiert werden @de
definition: Ett sammanhållet set av program som sänds under samma titel, ibland över flera säsonger. @se
definition: Conjunto ligado de episódios de programas fictícios ou não, exibidos sob o mesmo título. @pt-pt
definition: Et sammenhængende sæt programmer, der udsendes under samme titel, undertiden over flere sæsoner. @dk
definition: 在同一剧名下展开且情节相关联的系列故事，可以是虚构或非虚构的 @zh-hans
in scheme: Media Topic
created: 2017-11-16T12:00:00+00:00
modified: 2021-07-12T12:00:00+00:00
broader: arts and entertainment

festival
type: Concept
preferred label: Festivaler @se
preferred label: Festival @de
preferred label: 艺术节 @zh-hans
preferred label: مهرجان @ar
definition: Cojunto de representaciones dedicadas a un arte, como festivales de danza, música, teatro, poesía o de humoristas @es
definition: Veranstaltungen bei der künstlerische Werke präsentiert werden, wie Tanz-, Musik-, Theater- oder Literaturfestivals. Sie finden meist regelmäßig statt. @de
definition: Events showcasing artistic endeavours, often regularly occurring, such as dance, music, theatre, poetry or comedy festivals
definition: Événement organisé autour d'un secteur artistique comme la danse, la musique, le théâtre, la poésie ou l'humour @fr
definition: Tillställningar där flera framträdanden inom en eller flera konstformer samlas på samma ställe. Tillställningarna är ofta återkommande på samma plats år efter år. @se
definition: Eventos que exibem atividades artísticas e que ocorrem com regularidade, como festivais de dança, música, teatro, poesia ou comédia. @pt-pt
definition: Begivenheder, der viser kunstneriske bestræbelser, ofte regelmæssigt forekommende, såsom dans, musik, teater, poesi eller komik. @dk
definition: 展示艺术成就的活动，通常定期举行，例如舞蹈、音乐、戏剧、诗歌或喜剧节 @zh-hans
definition: Events showcasing artistic endeavors, often regularly occurring, such as dance, music, theater, poetry or comedy festivals
in scheme: Media Topic
created: 2018-04-09T12:00:00+00:00
modified: 2021-07-12T12:00:00+00:00
broader: arts and entertainment
narrower: film festival

film festival
type: Concept
preferred label: Filmfestival @de
preferred label: مهرجان افلام @ar
preferred label: Festival de cine @es
preferred label: Filmfestivaler @se
preferred label: Festival de cinéma @fr
preferred label: festivais de cinema @pt-pt
preferred label: filmfestival @dk
preferred label: 电影节 @zh-hans
definition: Toutes les formes de festivals de cinéma nationaux et internationaux @fr
definition: Nationella eller internationella samlingar där filmer visas, priser delas ut och branschfolk träffas. @se
definition: Todas las formas de festivales de cine nacionales e internacionales @es
definition: All forms of national and international film festivals
definition: Alle Arten von nationalen und internationalen Filmfestivals @de
definition: Todas as formas de festivais de cinema nacionais e internacionais. @pt-pt
definition: Nationale eller internationale samlinger, hvor film vises, priser uddeles, og branchefolk mødes. @dk
definition: 各种形式的国家级或国际级电影节 @zh-hans
change note: Changes: 2018-04-09 other Broader Term
in scheme: Media Topic
created: 2009-10-22T02:00:00+00:00
modified: 2021-02-18T12:00:00+00:00
broader: festival

ballet
type: Concept
preferred label: Ballett @de
preferred label: باليه @ar
preferred label: Ballet @es
preferred label: Danse classique @fr
preferred label: Balett @se
preferred label: 芭蕾舞 @zh-hans
preferred label: ballett @no-nb
definition: Klassisk dansstil med steg, positioner och gester. @se
definition: A classical dance form based on formal gestures, steps and postures
definition: Eine klassische Tanzform auf der Grundlage vorgegebener Bewegungen, Schrittfolgen und Körperhaltungen @de
definition: Uma forma de dança clássica, baseada em gestos, passos e posturas formais. @pt-pt
definition: Klassisk dansestil med trin, positioner og bevægelser. @dk
definition: 一种基于特定动作程式、舞步和姿势的古典舞蹈形式 @zh-hans
in scheme: Media Topic
created: 2009-10-22T02:00:00+00:00
modified: 2021-02-18T12:00:00+00:00
broader: dance
broad match: http://cv.iptc.org/newscodes/subjectcode/01006000

modern dance
type: Concept
preferred label: Danza moderna @es
preferred label: رقص حديث @ar
preferred label: Danse moderne @fr
preferred label: Modern dans @se
preferred label: Modern Dance @de
preferred label: dança moderna @pt-pt
preferred label: moderne dans @dk
preferred label: 现代舞 @zh-hans
definition: Ein theatralischer Tanzstil, mehr geprägt von freiem Ausdruck als von vorgegebenen Bewegungen @de
definition: A theatrical dance style based on free-style expression rather than formal gestures
definition: Teatralisk dansstil som inte är begränsad till klassiska uttryck. @se
definition: Estilo de dança teatral, baseado na expressão livre em vez de gestos formais. @pt-pt
definition: Teatralsk dansestil, der ikke er begrænset til klassiske udtryk. @dk
definition: 一种基于自由表达而非特定动作程式的舞蹈形式 @zh-hans
in scheme: Media Topic
created: 2009-10-22T02:00:00+00:00
modified: 2021-02-18T12:00:00+00:00
broader: dance
broad match: http://cv.iptc.org/newscodes/subjectcode/01006000

traditional dance
type: Concept
preferred label: Danza tradicional @es
preferred label: Danse folklorique @fr
preferred label: Standardtanz @de
preferred label: Traditionell dans @se
preferred label: رقص تقليدي @ar
preferred label: dança tradicional @pt-pt
preferred label: traditionel dans @dk
preferred label: 传统舞蹈 @zh-hans
preferred label: folkedans @no-nb
definition: Style de danse qui reflète la vie et la culture d'un groupe spécifique de personnes ou d'une région, comme la danse folklorique et cérémonielle @fr
definition: Ein Tanzstild der das Leben und die Kultur einer bestimmten Gruppe von Menschen wiederspiegelt, so etwa der Volkstanz und Festtänze @de
definition: Dance style that reflects the life and culture of a specific group of people or region, such as folk and ceremonial dance
definition: En dansstil som oftast förekommer som en social aktivitet, ibland kopplad till lokala kulturella traditioner. @se
definition: Estilo de baile que refleja la vida y la cultura de un grupo específico de personas o región, como el baile folclórico y ceremonial @es
definition: Estilo de dança que reflete a vida e a cultura de um grupo específico ou região, como o folclore ou a dança cerimonial. @pt-pt
definition: Dans, der ofte forekommer som en social aktivitet, undertiden knyttet til lokale kulturelle traditioner. @dk
definition: 反映特定人群或地区的生活和文化的舞蹈形式，如民间舞蹈和仪式舞蹈 @zh-hans
in scheme: Media Topic
created: 2009-10-22T02:00:00+00:00
modified: 2021-02-18T12:00:00+00:00
broader: dance
broad match: http://cv.iptc.org/newscodes/subjectcode/01006000

jewellery
type: Concept
preferred label: Joyas @es
preferred label: Accessoarer och smycken @se
preferred label: Bijoux @fr
preferred label: مجوهرات @ar
preferred label: Schmuck @de
preferred label: joias @pt-pt
preferred label: smykke @dk
preferred label: 珠宝首饰 @zh-hans
preferred label: smykker @no-nb
preferred label: jewelry
definition: Dekorative Objekte, die als Ausdruck von Persönlichkeit und zur Verschönerung getragen werden, zum Beispiel Ringe, Halsketten oder Ohrringe @de
definition: Artículos decorativos usados para la expresión personal y el adorno, como anillos, collares o pendientes @es
definition: Accessoarer till kläder, såsom ringar, halsband och örhängen. @se
definition: Objets décoratifs et parures corporelles, tels que bagues, colliers, boucles d'oreilles @fr
definition: Decorative items worn for personal expression and adornment, such as rings, necklaces, earrings
definition: Objetos decorativos usados para expressão pessoal e adorno, como anéis, colares, brincos. @pt-pt
definition: Tilbehør til tøj, såsom ringe, halskæder og øreringe. @dk
definition: 用于个人表达和装饰的物品，如戒指、项链、耳环 @zh-hans
in scheme: Media Topic
created: 2009-10-22T02:00:00+00:00
modified: 2021-02-18T12:00:00+00:00
broader: fashion

cosmetics
type: Concept
preferred label: kosmetik @dk
preferred label: cosmética @pt-br
preferred label: kosmetikk @no-nb
preferred label: Kosmetika @se
preferred label: 化妆品 @zh-hans
preferred label: Kosmetik @de
preferred label: Produits cosmétiques @fr
preferred label: Cosméticos @es
preferred label: مستحضرات تجميل @ar
definition: Udviklingen inden for produkter, som påføres dele kroppen for at forandre eller forstærke deres udtryk. Kan være læbestift, neglelak eller mascara. @dk
definition: Products applied to the body to enhance appearance, such as lipstick, eyeliner, foundation and nail polish, and the trends surrounding the application of these products
definition: Produtos aplicados no corpo para melhorar a aparência, como batom, delineador, base e esmalte, bem como as tendências em torno da aplicação desses produtos. @pt-br
definition: Produtos aplicados no corpo para melhorar a aparência, como batom, delineador, base e verniz, bem como as tendências em torno da aplicação desses produtos. @pt-pt
definition: Produkter som används på kroppen för att förbättra utseendet som exempelvis läppstick och mascara. @se
definition: 用于改善身体外观的产品，如口红、眼线笔、粉底和指甲油，以及这些产品的应用趋势 @zh-hans
definition: Produkte, die zur Verbesserung des Aussehens auf den Körper aufgetragen werden, wie Lippenstift, Eyeliner, Grundierung und Nagellack, sowie die Trends bei der Anwendung dieser Produkte @de
in scheme: Media Topic
created: 2019-07-30T12:00:00+00:00
modified: 2021-07-12T12:00:00+00:00
broader: fashion

hairstyles
type: Concept
preferred label: frisurer @dk
preferred label: frisyrer @no-nb
preferred label: penteados @pt-br
preferred label: Frisyrer @se
preferred label: 发型 @zh-hans
preferred label: Friseur @de
preferred label: Coiffure @fr
preferred label: Peinado @es
preferred label: تزيين الشعر @ar
preferred label: frisyrar @no-nn
definition: Trends, der omhandler, hvordan man klipper og sætter sit hår. @dk
definition: Trends surrounding the cutting and styling of hair
definition: Tendências relativas a cortes de cabelo e penteados. @pt-br
definition: Trender kring att klippa, färga och styla hår. @se
definition: 发型设计的流行趋势 @zh-hans
definition: Trends rund um das Schneiden und Styling von Haaren. @de
in scheme: Media Topic
created: 2019-07-30T12:00:00+00:00
modified: 2021-07-12T12:00:00+00:00
broader: fashion

drama (literature)
type: Concept
preferred label: Œuvre théâtrale @fr
preferred label: دراما @ar
preferred label: Drama @se
preferred label: Arte dramático @es
preferred label: Drama (Literatur) @de
preferred label: drama (literatura) @pt-pt
preferred label: drama (litteratur) @dk
preferred label: 戏剧（文学） @zh-hans
preferred label: dramatikk @no-nb
definition: Work written to be performed on the stage
definition: Ein Werk, das geschrieben wurde um auf einer Bühne aufgeführt zu werden. @de
definition: Skrivna berättelser som är avsedda att framföras av skådespelare. @se
definition: Œuvre écrite destinée à être jouée sur scène @fr
definition: Obra escrita para ser representada en un escenario @es
definition: Obra escrita para ser representada. @pt-pt
definition: Skrevne historier, der er beregnet til at blive fremført af skuespillere. @dk
definition: 为在舞台上表演而写的剧本 @zh-hans
in scheme: Media Topic
created: 2009-10-22T02:00:00+00:00
modified: 2021-02-18T12:00:00+00:00
broader: literature
broad match: http://cv.iptc.org/newscodes/subjectcode/01010000

fiction
type: Concept
preferred label: Skönlitteratur @se
preferred label: Ficción @es
preferred label: Fiktion @de
preferred label: خيال @ar
preferred label: Fiction @fr
preferred label: ficção @pt-pt
preferred label: fiktion @dk
preferred label: 小说 @zh-hans
preferred label: skjønnlitteratur @no-nb
definition: Schriftliche Werke, die nicht auf Fakten beruhen, sondern aus der Vorstellungskraft des Autors entstehen @de
definition: Œuvre écrite fondée sur des faits imaginaires et non sur des faits réels @fr
definition: Skrivna berättelser som inte bygger på fakta utan på författarens fantasi. @se
definition: Obra escrita que no está basada en hechos, sino que es una creación de la imaginación del autor @es
definition: Written works that are not based on fact, but are the creation of the author's imagination
definition: Histórias estruturadas que geralmente não se baseiam em factos e que são criação da imaginação dos autores. @pt-pt
definition: Histórias estruturadas que geralmente não se baseiam em fatos e que são criação da imaginação dos autores. @pt-br
definition: Skrevne historier, der ikke er baseret på fakta, men på forfatterens fantasi. @dk
definition: 不基于事实而是基于创作者想象力的文字作品 @zh-hans
in scheme: Media Topic
created: 2009-10-22T02:00:00+00:00
modified: 2021-02-18T12:00:00+00:00
broader: literature

non-fiction
type: Concept
preferred label: Literatura no novelesca @es
preferred label: Non-Fiktion @de
preferred label: Récit @fr
preferred label: واقعي @ar
preferred label: Facklitteratur @se
preferred label: não ficção @pt-pt
preferred label: non-fiktion @dk
preferred label: 纪实文学 @zh-hans
preferred label: sakprosa @no-nb
definition: Skrivna texter som baseras på fakta. @se
definition: Written works that are based on fact
definition: Schriftliche Werke, die auf Fakten beruhen @de
definition: Obra escrita basada en hechos @es
definition: Œuvre écrite basée sur des faits réels @fr
definition: Obra escrita baseada em factos. @pt-pt
definition: Obra escrita baseada em fatos. @pt-br
definition: Tekster baseret på fakta. @dk
definition: 基于事实的文字作品 @zh-hans
in scheme: Media Topic
created: 2009-10-22T02:00:00+00:00
modified: 2021-02-18T12:00:00+00:00
broader: literature
broad match: http://cv.iptc.org/newscodes/subjectcode/01010000

poetry
type: Concept
preferred label: شعر @ar
preferred label: Poesía @es
preferred label: Poésie @fr
preferred label: Poesie @de
preferred label: Poesi @se
preferred label: poesia @pt-pt
preferred label: poesi @dk
preferred label: 诗歌 @zh-hans
preferred label: lyrikk @no-nb
definition: Written works that use the aesthetic and rhythmic qualities of language to express a message or emotion
definition: Œuvre écrite utilisant les qualités esthétiques et rythmiques du langage pour exprimer un message ou une émotion @fr
definition: Schriftliche Werke, die auf die Ästhetik und die Rythmik von Sprache bauen um eine Botschaft oder Gefühle auszudrücken @de
definition: Obra escrita que utiliza las calidades estéticas y rítmicas del lenguaje para expresar un mensaje o una emoción @es
definition: Skrivna texter som förutom innehåll även förmedlar en känsla via formatet, som kan följa ett visst versmått eller vara fritt. @se
definition: Obras escritas que usam as qualidades estéticas e rítmicas da língua para expressar emoções ou uma mensagem. @pt-pt
definition: Skriftlige værker, der bruger sprogets æstetiske og rytmiske egenskaber til at udtrykke et budskab eller en følelse. @dk
definition: 通过语言美感和韵律表达情感的文字作品 @zh-hans
definition: Written works that use the esthetic and rhythmic qualities of language to express a message or emotion
in scheme: Media Topic
created: 2009-10-22T02:00:00+00:00
modified: 2021-02-18T12:00:00+00:00
broader: literature

musical instrument
type: Concept
preferred label: Musikinstrument @se
preferred label: Instrument de musique @fr
preferred label: آلة موسيقية @ar
preferred label: Instrumento de música @es
preferred label: instrumento musical @pt-pt
preferred label: musikinstrument @dk
preferred label: 乐器 @zh-hans
preferred label: musikkinstrument @no-nb
definition: Objets utilisés pour jouer de la musique @fr
definition: Objekt som används för att skapa ljud i ett konstnärligt syfte. @se
definition: Objekte, mit denen Musik erzeugt werden kann @de
definition: Objects used to play music on
definition: Objetos usados para tocar música. @pt-pt
definition: Objekter, der bruges til at skabe lyd til et kunstnerisk formål. @dk
definition: 用来演奏音乐的器具 @zh-hans
in scheme: Media Topic
created: 2009-10-22T02:00:00+00:00
modified: 2021-02-18T12:00:00+00:00
broader: music
broad match: http://cv.iptc.org/newscodes/subjectcode/01011000

musical performance
type: Concept
preferred label: حفل موسيقي @ar
preferred label: Concierto @es
preferred label: Concert @fr
preferred label: Musikaufführung @de
preferred label: Musikframträdande @se
preferred label: concerto @pt-pt
preferred label: musikalsk optræden @dk
preferred label: 音乐表演 @zh-hans
preferred label: konsert @no-nb
definition: Framföra sång och/eller musik inför publik. @se
definition: Représentation musicale exécutée par des musiciens (instrumentistes ou chanteurs) devant un public @fr
definition: Musiker die vor einem Publikum spielen um dieses zu unterhalten @de
definition: Actuación musical en la que músicos o cantantes actúan ante un público con fines de entretenimiento @es
definition: Musicians performing for an audience for the purpose of entertainment
definition: Atuação musical em que os músicos ou cantores atuam perante um público para entretenimento. @pt-pt
definition: Musiker, der fremfører sang og/eller musik for publikum. @dk
definition: 以娱乐为目的的音乐演奏表演 @zh-hans
in scheme: Media Topic
created: 2009-10-22T02:00:00+00:00
modified: 2021-02-18T12:00:00+00:00
broader: music
broad match: http://cv.iptc.org/newscodes/subjectcode/01011000

musical genre
type: Concept
preferred label: نوع موسيقي @ar
preferred label: Genre musical @fr
preferred label: Musikgenre @de
preferred label: Estilo musical @es
preferred label: género musical @pt-pt
preferred label: gênero musical @pt-br
preferred label: musikgenre @dk
preferred label: 音乐类型 @zh-hans
preferred label: musikksjanger @no-nb
definition: Eine unterscheidbare Gattung von Musik @de
definition: Un género musical distinguible al que pertenece un tipo particular de música @es
definition: Catégorie rassemblant des musiques ayant des caractéristiques communes @fr
definition: En vedertagen genre inom musik. @se
definition: A distinguishable type of music
definition: Um tipo de música distinguível. @pt-pt
definition: En karakteristisk type af musik. @dk
definition: 音乐作品呈现出的独特可辨的风格类型 @zh-hans
in scheme: Media Topic
created: 2009-10-22T02:00:00+00:00
modified: 2021-02-18T12:00:00+00:00
broader: music
narrower: classical music
narrower: country music
narrower: folk music
narrower: jazz music
narrower: popular music
narrower: rock and roll music
narrower: hip hop
narrower: r&b
narrower: heavy metal
narrower: dance band music
narrower: electronic dance music
narrower: children's music
broad match: http://cv.iptc.org/newscodes/subjectcode/01011000

classical music
type: Concept
preferred label: Klassik @de
preferred label: Classique @fr
preferred label: Klassisk musik @se
preferred label: موسيقى كلاسيكية @ar
preferred label: Música clásica @es
preferred label: música clássica @pt-pt
preferred label: klassisk musik @dk
preferred label: 古典音乐 @zh-hans
preferred label: klassisk musikk @no-nb
definition: Eine Gattung von Musik, die auf Traditionen westlicher Musik basiert und sowohl religiöse als auch weltliche Musik umfasst, zum Beispiel Symphonien, Konzerte oder Sonaten @de
definition: A genre of music rooted in the traditions of Western music, including both religious and secular music, such as symphony, concerto and sonata.
definition: Género musical arraigado en las tradiciones de la música occidental, que incluye música religiosa y secular, como la sinfonía, el concierto y la sonata @es
definition: Genre musical de tradition occidentale, comprenant la musique religieuse et profane, comme la symphonie, le concerto et la sonate @fr
definition: Musik som följer klassiska metoder och uttryck när det gäller harmonier och rytmer. @se
definition: Música que segue estruturas clássicas de ritmo e harmonia. @pt-pt
definition: Musik, der følger klassiske metoder og udtryk med hensyn til harmonier og rytmer. @dk
definition: 一种植根于西方音乐传统的音乐类型，包括宗教和世俗音乐，如交响乐、协奏曲和奏鸣曲 @zh-hans
in scheme: Media Topic
created: 2009-10-22T02:00:00+00:00
modified: 2021-02-18T12:00:00+00:00
broader: musical genre

country music
type: Concept
preferred label: Música country @es
preferred label: موسيقى الكانتري @ar
preferred label: Country @se
preferred label: música country @pt-pt
preferred label: countrymusik @dk
preferred label: 乡村音乐 @zh-hans
preferred label: countrymusikk @no-nb
definition: Eine Gattung von Musik, die aus den südlichen USA stammt, meisten in Form von Balladen oder Tanzmusik unter Verwendung von Instrumenten wie Banjos, Geigen und Gitarren. @de
definition: En musikstil med rötter i södra USA, ofta bestående av ballader eller dansmelodier och spelade på stränginstrument. @se
definition: Genre musical originaire du sud des États-Unis, souvent composé de ballades ou d'airs de danse et comportant des instruments à cordes tels que des banjos, des violons et des guitares @fr
definition: Género de música que se originó en el sur de los Estados Unidos, a menudo compuesto por baladas o melodías de baile y con instrumentos de cuerda como banjos, violines y guitarras @es
definition: A genre of music that originated in the southern United States, often consisting of ballads or dance tunes and featuring string instruments such as banjos, fiddles and guitars
definition: Género de música com origem no Sul dos Estados Unidos, que consiste frequentemente em baladas ou músicas dançáveis e que usa instrumentos de corda, como os banjos ou as guitarras. @pt-pt
definition: Gênero de música com origem no Sul dos Estados Unidos, que consiste frequentemente em baladas ou músicas dançáveis e que usa instrumentos de corda, como os banjos ou as guitarras. @pt-br
definition: En genre af musik, der stammer fra det sydlige USA, ofte bestående af ballader eller dansemelodier og med strengeinstrumenter som banjoer, violiner og guitarer. @dk
definition: 一种起源于美国南部的音乐类型，通常由民谣或舞曲组成，以弦乐为主，比如五弦琴、小提琴和吉他 @zh-hans
in scheme: Media Topic
created: 2009-10-22T02:00:00+00:00
modified: 2021-02-18T12:00:00+00:00
broader: musical genre

folk music
type: Concept
preferred label: Música folclórica @es
preferred label: Folk @fr
preferred label: موسيقى فولكلورية @ar
preferred label: Folkmusik @se
preferred label: música folk @pt-pt
preferred label: folkemusik @dk
preferred label: 民俗音乐 @zh-hans
preferred label: folkemusikk @no-nb
definition: Eine Gattung von Musik, die sich aus überlieferten populären Kulturformen entwickelt hat, meist auf dem Erzählen von Geschichten basierend @de
definition: Genre musical issu des cultures populaires traditionnelles, souvent basé sur des récits @fr
definition: A genre of music that developed from traditional popular cultures, often based on story telling
definition: Musik som härstammar från äldre folkliga traditioner och som ofta berättar en historia. @se
definition: Música que se desarrolló a partir de culturas populares tradicionales, a menudo basada en la narración de historias @es
definition: Música que se desenvolveu a partir de culturas populares. @pt-pt
definition: Musik, der stammer fra ældre folketraditioner, og som ofte fortæller en historie. @dk
definition: 从传统流行文化发展而来的一种音乐类型，通常以叙事为基础 @zh-hans
in scheme: Media Topic
created: 2009-10-22T02:00:00+00:00
modified: 2021-02-18T12:00:00+00:00
broader: musical genre

jazz music
type: Concept
preferred label: موسيقى الجاز @ar
preferred label: Jazz @se
preferred label: Música jazz @es
preferred label: música jazz @pt-pt
preferred label: jazzmusik @dk
preferred label: 爵士音乐 @zh-hans
preferred label: jazz @no-nb
definition: Género de música con raíces en el blues y el ragtime que se originó en las comunidades afroamericanas de Nueva Orleans en los Estados Unidos a fines del siglo XIX y principios del siglo XX @es
definition: Genre musical issu du blues et du ragtime qui est apparu dans les communautés afro-américaines de la Nouvelle-Orléans aux États-Unis à la fin du 19ème et au début du 20ème siècle @fr
definition: A genre of music with roots in blues and ragtime that originated in African American communities of New Orleans in the United States in the late 19th and early 20th centuries
definition: Musik med blandade harmonier, ofta improviserat. @se
definition: Ein Gattung von Musik mit Wurzeln in Blues und Ragtime, die aus afro-amerikanischen Gemeinden in New Orleans (USA) im späten 19. und frühen 20. Jahrhundert hervorging @de
definition: Género de música com raízes nos blues e no ragtime, originário das comunidades afro-americanas de Nova Orleães nos Estados Unidos no fim do século XIX e início do século XX. @pt-pt
definition: Gênero de música com raízes nos blues e no ragtime, originário das comunidades afro-americanas de Nova Orleães nos Estados Unidos no fim do século XIX e início do século XX. @pt-br
definition: Musik med blandede harmonier, ofte improviseret, med rødder i blues og ragtime i det afroamerikanske samfund i New Orleans. @dk
definition: 一种根植于19世纪末20世纪初美国新奥尔良非裔美国人社区的蓝调和拉格泰姆音乐类型 @zh-hans
in scheme: Media Topic
created: 2009-10-22T02:00:00+00:00
modified: 2021-02-18T12:00:00+00:00
broader: musical genre

popular music
type: Concept
preferred label: موسيقى شعبية @ar
preferred label: Pop @se
preferred label: Música popular @es
preferred label: música popular @pt-pt
preferred label: popmusik @dk
preferred label: 流行音乐 @zh-hans
preferred label: pop/populærmusikk @no-nb
definition: Musikstil som är allmänt tillgänglig och komponerad för att locka många lyssnare. @se
definition: Genre musical largement accessible et conçu pour plaire à tous @fr
definition: Eine Gattung von Musik, die von vielen Gruppen in der Bevölkerung gehört wird und darauf abzielt, möglichst viele anzusprechen @de
definition: A genre of music that is widely accessible and designed to appeal to all
definition: Género de música ampliamente accesible y diseñado para atraer a todos @es
definition: Género de música amplamente acessível e criada para agradar a toda a gente. @pt-pt
definition: Gênero de música amplamente acessível e criada para agradar a toda a gente. @pt-br
definition: Musikstil, der er bredt tilgængelig og komponeret for at tiltrække mange lyttere. @dk
definition: 一种广受欢迎的音乐类型，旨在吸引所有人 @zh-hans
in scheme: Media Topic
created: 2009-10-22T02:00:00+00:00
modified: 2021-02-18T12:00:00+00:00
broader: musical genre

rock and roll music
type: Concept
preferred label: Rock'n' Roll @de
preferred label: Rock @fr
preferred label: Música rock and roll @es
preferred label: موسيقى الروك @ar
preferred label: música rock @pt-pt
preferred label: rockmusik @dk
preferred label: 摇滚乐 @zh-hans
preferred label: rock @no-nb
definition: Eine Gattung einer Musik, die aus den USA der 1940er und 1950er Jahre stammt, entwickelt aus afroamerikanischen Musikstilen wie den Gospels, Jump Blues, Jazz, Boogie Woogie und Rythm and Blues @de
definition: A genre of music that originated in the United States during the late 1940s and early 1950s, evolving from African American musical styles such as gospel, jump blues, jazz, boogie woogie, and rhythm and blues.
definition: Musikstil som utvecklades i USA under slutet av 1940-talet och början av 1950-talet. Den blandade influenser från tidigare afro-amerikanska musikstilar som gospel, blues, jazz, boogie woogie och rythm'n'blues. @se
definition: Género de música que se originó en Estados Unidos a fines de los años 1940 y principios de los 1950, evolucionando desde estilos musicales afroamericanos como el góspel, el jump blues, el jazz, el boogie woogie y el rhythm and blues @es
definition: Genre musical originaire des États-Unis à la fin des années 1940 et au début des années 1950 évoluant à partir de styles musicaux afro-américains tels que le gospel, le jump blues, le jazz, le boogie woogie et le rhythm and blues @fr
definition: Género de música com origem nos Estados Unidos durante as décadas de 1940 e 1950, que evoluiu dos estilos musicais afro-americanos, como o gospel, blues, jazz, boogie woogie e R&B. @pt-pt
definition: Gênero de música com origem nos Estados Unidos durante as décadas de 1940 e 1950, que evoluiu dos estilos musicais afro-americanos, como o gospel, blues, jazz, boogie woogie e R&B. @pt-br
definition: En genre af musik, der stammer fra USA i slutningen af 1940'erne og begyndelsen af 1950'erne, hvor den udviklede sig fra afroamerikanske musikalske stilarter som gospel, jump blues, jazz, boogie woogie og rytme og blues. @dk
definition: 起源于20世纪40年代末50年代初美国的一种音乐流派，由福音乐、跳蓝调、爵士乐、布吉伍吉舞和节奏布鲁斯等非裔美国人的音乐风格演变而来 @zh-hans
in scheme: Media Topic
created: 2009-10-22T02:00:00+00:00
modified: 2021-02-18T12:00:00+00:00
broader: musical genre

hip hop
type: Concept
preferred label: Hip Hop @se
preferred label: hip-hop @pt-pt
preferred label: 嘻哈 @zh-hans
preferred label: hiphop @no-nb
preferred label: Hip-hop @fr
preferred label: Hip hop @es
preferred label: هيب هوب @ar
definition: En musikstil som utvecklades av afro-amerikaner i amerikansks storstäder under 1970-talet. Rap är en form av rytmiskt tal. @se
definition: A genre of music developed in African American communities in the United States in the 1970s which consists of rapping usually with an electronic backing
definition: Género musical surgido em comunidades afro-americanas dos Estados Unidos da década de 1970, que consiste em fazer rap, geralmente com um apoio musical eletrónico. @pt-pt
definition: Gênero musical surgido em comunidades afro-americanas dos Estados Unidos da década de 1970, que consiste em fazer rap, geralmente com um apoio musical eletrônico. @pt-br
definition: En musikstil udviklet af afroamerikanere i amerikanske byer i løbet af 1970'erne, der også omfatter rap. @dk
definition: 20世纪70年代在美国的非裔美国人社区发展起来的一种音乐类型，通常由电子伴奏的说唱组成 @zh-hans
definition: Ein Musikgenre, das in den 1970er Jahren in afroamerikanischen Gemeinden in den Vereinigten Staaten entwickelt wurde und aus Rap besteht, der gewöhnlich mit elektronischer Unterstützung gespielt wird. @de
in scheme: Media Topic
created: 2019-04-06T12:00:00+00:00
modified: 2021-07-12T12:00:00+00:00
broader: musical genre

r&b
type: Concept
preferred label: R&B @se
preferred label: r&b（节奏蓝调） @zh-hans
preferred label: Rhythm & Blues @de
preferred label: موسيقى ريذم أند بلوز @ar
definition: En musikstil som utvecklades bland afro-amerikaner under 1940-talet. Benämningen har levt kvar, men skiftat i betydelse. @se
definition: A genre of music originated in African American communities in the 1940s and featuring soulful vocals
definition: Género musical surgido em comunidades afro-americanas nos anos 1940 e com coros emotivos, cheios de alma. @pt-pt
definition: Gênero musical surgido em comunidades afro-americanas nos anos 1940 e com coros emotivos, cheios de alma. @pt-br
definition: En musikalsk stil udviklet blandt afroamerikanere i løbet af 1940'erne. @dk
definition: 又译节奏布鲁斯。起源于20世纪40年代的非裔美国人社区，以深情的歌声为特色的音乐类型 @zh-hans
definition: Eine Musikgattung, die in den 1940er Jahren in afroamerikanischen Gemeinschaften entstand und sich durch gefühlvollen Gesang auszeichnet. @de
in scheme: Media Topic
created: 2019-04-06T12:00:00+00:00
modified: 2021-07-12T12:00:00+00:00
broader: musical genre

heavy metal
type: Concept
preferred label: Metal @se
preferred label: 重金属 @zh-hans
preferred label: Heavy Metal @de
preferred label: Heavy metal @fr
preferred label: موسيقى الميتال @ar
definition: En musikstil som utvecklades främst i Storbritannien under sena 60-talet och tidiga 70-talet. Med rötter i blues och rock blev ljudbilden tyngre och snabbare. @se
definition: A genre of loud, aggressive rock music that was developed in the late 1960s and early 1970s
definition: Género de música rock pesada e agressiva surgida no final dos anos 1960 e início dos anos 1970. @pt-pt
definition: Gênero de música rock pesada e agressiva surgida no final dos anos 1960 e início dos anos 1970. @pt-br
definition: En tung musikstil, der hovedsageligt blev udviklet i England i slutningen af 60'erne og begyndelsen af 70'erne. @dk
definition: 20世纪60年代末和70年代初发展起来的一种喧闹、激进的摇滚音乐类型 @zh-hans
definition: Ein Genre der lauten, aggressiven Rockmusik, das in den späten 1960er und frühen 1970er Jahren entwickelt wurde. @de
in scheme: Media Topic
created: 2019-04-06T12:00:00+00:00
modified: 2021-07-12T12:00:00+00:00
broader: musical genre

dance band music
type: Concept
preferred label: Dansband @se
preferred label: música de banda de dança @pt-pt
preferred label: dansktop @dk
preferred label: 舞蹈乐队音乐 @zh-hans
preferred label: danseband @no-nb
preferred label: Tanzbandmusik (Schweden) @de
preferred label: Musique de danse @fr
preferred label: Música de baile @es
preferred label: موسيقى الرقص @ar
definition: Svensk term för lättlyssnad musik som passar bra att dansa par-dans till. @se
definition: A Swedish genre of music characterized by music inspired by swing, schlager, country, jazz and rock that is often danced to in pairs
definition: Género musical de origem sueca, caracterizado por música inspirada em swing, schlager, country, jazz e rock, que frequentemente se dança em pares. @pt-pt
definition: Gênero musical de origem sueca, caracterizado por música inspirada em swing, schlager, country, jazz e rock, que frequentemente se dança em pares. @pt-br
definition: En svensk inspireret musikgenre, der er karakteriseret ved swing, schlager, country, jazz og rock og som ofte er dansevenligt til pardans. @dk
definition: 一种瑞典音乐类型，以摇摆、施拉格、乡村、爵士乐和摇滚乐为灵感，通常成对跳舞 @zh-hans
definition: Eine schwedische Musikgattung, die sich durch eine von Swing, Schlager, Country, Jazz und Rock inspirierte Musik auszeichnet, zu der oft paarweise getanzt wird @de
in scheme: Media Topic
created: 2019-04-06T12:00:00+00:00
modified: 2021-07-12T12:00:00+00:00
broader: musical genre

electronic dance music
type: Concept
preferred label: Elektronisk dansmusik (EDM) @se
preferred label: música de dança eletrónica @pt-pt
preferred label: música de dança eletrônica @pt-br
preferred label: elektronisk musik @dk
preferred label: 电子舞曲 @zh-hans
preferred label: elektronisk dansemusikk @no-nb
preferred label: Elektronische Tanzmusik @de
preferred label: Electronic dance music @fr
preferred label: Música dance @es
preferred label: موسيقى الرقص الإلكترونية @ar
definition: En bred genre av elektroniskt baserad dans-musik. @se
definition: A genre of music that employs electronic instruments and is primarily made for nightclubs, raves, and festivals
definition: Género musical que usa instrumentos eletrónicos e que é feito principalmente para discotecas, raves e festivais. @pt-pt
definition: Gênero musical que usa instrumentos eletrônicos e que é feito principalmente para boates, raves e festivais. @pt-br
definition: En bred genre af elektronisk baseret dansemusik. @dk
definition: 一种使用电子乐器的音乐类型，主要为夜总会、狂欢会和节日而创作 @zh-hans
definition: Ein Musikgenre, das elektronische Instrumente einsetzt und hauptsächlich für Nachtclubs, Raves und Festivals gemacht ist. @de
in scheme: Media Topic
created: 2019-04-06T12:00:00+00:00
modified: 2021-07-12T12:00:00+00:00
broader: musical genre

children's music
type: Concept
preferred label: Barnmusik @se
preferred label: música para crianças @pt-pt
preferred label: børnemusik @dk
preferred label: 儿童音乐 @zh-hans
preferred label: barnemusikk @no-nb
preferred label: Kinderlieder @de
preferred label: Musique pour enfants @fr
preferred label: Música infantil @es
preferred label: موسيقى للاطفال @ar
definition: Musik som är gjord speciellt för barn. Lätta melodier och texter som är enkla att följa med i. Ofta med rörelser till. @se
definition: A genre of music featuring songs composed and performed for children
definition: Género musical com músicas compostas e executadas para crianças. @pt-pt
definition: Gênero musical com músicas compostas e executadas para crianças. @pt-br
definition: En musikgenre med sange komponeret og udført for børn. @dk
definition: 一种专为儿童创作和表演的音乐类型 @zh-hans
definition: Ein Musikgenre mit Liedern, die für Kinder komponiert und aufgeführt werden. @de
in scheme: Media Topic
created: 2019-04-06T12:00:00+00:00
modified: 2021-07-12T12:00:00+00:00
broader: musical genre

opera
type: Concept
preferred label: Oper @de
preferred label: اوبرا @ar
preferred label: Opéra @fr
preferred label: Opera @se
preferred label: Ópera @es
preferred label: ópera @pt-pt
preferred label: 歌剧 @zh-hans
definition: Framförande av musikaliska verk, ofta dramatiska, av klassiskt skolade sångare och musiker. @se
definition: A form of performing art where classically trained musicians and singers perform a musical and dramatic work
definition: Eine Form der darstellenden Kunst bei der Musiker und Sänger mit Ausbildung in klassischer Musik ein vertontes dramaturgisches Werk aufführen @de
definition: Art du spectacle où des chanteurs et des musiciens de formation classique interprètent une œuvre musicale et théâtrale @fr
definition: Obra musical y teatral intepretada por músicos y cantantes de formación clásica @es
definition: Forma de arte performativa em que músicos e cantores clássicos representam obras dramáticas e musicais. @pt-pt
definition: Udførelse af musikværker, ofte dramatiske, af klassisk trænede sangere og musikere. @dk
definition: 一种表演艺术，由受过古典训练的音乐家和歌手表演音乐和戏剧作品 @zh-hans
change note: Changes: 2018-04-09 other Broader Term
in scheme: Media Topic
created: 2009-10-22T02:00:00+00:00
modified: 2021-09-30T12:00:00+00:00
broader: theatre
broad match: http://cv.iptc.org/newscodes/subjectcode/01017001

music theatre
type: Concept
preferred label: Musiktheater @de
preferred label: مسرح غنائي @ar
preferred label: Théâtre musical @fr
preferred label: Musikteater @se
preferred label: Teatro musical @es
preferred label: teatro musical @pt-pt
preferred label: musikteater @dk
preferred label: 音乐剧 @zh-hans
preferred label: musikal @no-nb
preferred label: music theater
definition: Ein Form der darstellenden Kunst, bei der Künstler eine Erzählung vor dem Publikum durch Lieder, Dialog und Aktivitäten vermitteln, wie etwa in Musicals und Operetten @de
definition: Uttryck av känslor eller överförande av budskap via en historia som framförs genom dialog, musik eller fysiska uttryck, såsom musikaler och operetter. @se
definition: Forma de arte escénico donde los artistas interpretan una obra frente a un público a través de canciones, diálogos y acciones, como musicales y operetas @es
definition: A form of performing art where live performers portray a narrative to an audience through song, dialogue and action, such as musicals and operettas
definition: Art du spectacle où les artistes interpètent une œuvre sur scène devant un public à travers la chanson, la danse, le dialogue et l'action @fr
definition: Representação de uma história através de canções, diálogo e ação, como a ópera, a opereta, as revistas musicais, os music halls. @pt-pt
definition: En kunstform, der udtrykker følelser og budskaber gennem en historie formidlet via dialog, musik og handlinger, såsom musicals og operetter. @dk
definition: 一种表演艺术形式，表演者在现场通过歌曲、对白和动作向观众描绘一个故事，如轻歌剧等 @zh-hans
definition: A form of performing art where live performers portray a narrative to an audience through song, dialog and action, such as musicals and operettas
change note: Retired on 2021-09-30. Child terms moved up to be children of medtop:20000029 theatre.
in scheme: Media Topic
created: 2009-10-22T02:00:00+00:00
retired: 2021-09-30T12:00:00+00:00
modified: 2021-09-30T12:00:00+00:00
broader: theatre

musical
type: Concept
preferred label: Comédie musicale @fr
preferred label: Musical @de
preferred label: Musikal @se
preferred label: 歌舞剧 @zh-hans
preferred label: musikal @no-nb
preferred label: مسرح موسيقي @ar
definition: A genre of music theatre in which singing and dancing play an essential part of the storytelling
definition: Genre théâtral dans lequel le chant et la danse jouent un rôle essentiel dans la narration @fr
definition: Género teatral en el cual el canto y el baile son parte esencial de la narración @es
definition: Eine Gattung von Musiktheater, in der das Singen und Tanzen ein wesentlicher Teil des Erzählens einer Geschichte sind. @de
definition: Teater där musik och sång är en betydelsefull del av själva historieberättandet. @se
definition: Género de teatro musical no qual o canto e a dança são parte essencial da narrativa. @pt-pt
definition: Gênero de teatro musical no qual o canto e a dança são parte essencial da narrativa. @pt-br
definition: Teater, hvor musik og sang er en vigtig del af selve historien. @dk
definition: 一种舞台音乐剧类型，其中唱歌和跳舞是叙事的重要组成部分 @zh-hans
in scheme: Media Topic
created: 2012-10-04T12:00:00+00:00
modified: 2021-09-30T12:00:00+00:00
broader: theatre

operetta
type: Concept
preferred label: Operette @de
preferred label: Opereta @es
preferred label: Operett @se
preferred label: Opérette @fr
preferred label: opereta @pt-pt
preferred label: operette @dk
preferred label: 轻歌剧 @zh-hans
preferred label: أوبريت @ar
definition: Ein Gattung von Musiktheater, die meist ein leichtes und humorvolles Thema hat und bei der ein Teil des Librettos gesprochen und nicht gesungen wird @de
definition: A genre of music theatre that usually has a light or humorous theme where some of the libretto is usually spoken rather than sung.
definition: Påminner om opera men där både handling och musik är mer lättsamt och humoristiskt. @se
definition: Genre d'opéra qui a généralement un thème léger ou humoristique et où une partie du livret est habituellement parlée plutôt que chantée @fr
definition: Género de ópera que generalmente tiene un tema ligero o humorístico en el cual parte del libreto se suele declamar en lugar de cantar @es
definition: Género de teatro musical de tema leve ou bem-humorado em que parte do libreto é geralmente falada em vez de cantada. @pt-pt
definition: Gênero de teatro musical de tema leve ou bem-humorado em que parte do libreto é geralmente falada em vez de cantada. @pt-br
definition: En kunstform, der minder om opera, men hvor både handling og musik er mere lette og humoristiske. @dk
definition: 一种音乐戏剧流派，通常有一个轻快或幽默的主题，其中一些剧本通常是说而不是唱 @zh-hans
in scheme: Media Topic
created: 2012-10-04T12:00:00+00:00
modified: 2021-09-30T12:00:00+00:00
broader: theatre

drama (theatre)
type: Concept
preferred label: Drama @es
preferred label: Pièce de théâtre @fr
preferred label: Dramatisk teater @se
preferred label: Drama (Theater) @de
preferred label: drama (teatro) @pt-pt
preferred label: drama (teater) @dk
preferred label: 话剧 @zh-hans
preferred label: drama @no-nb
preferred label: مسرحية @ar
definition: Género teatral en el que se representan obras dramáticas o comedias en un escenario @es
definition: Genre théâtral où des pièces dramatiques ou comiques sont jouées sur scène @fr
definition: A genre of theatre where dramatic or comedic plays are performed on the stage
definition: Eine Gattung von Theater bei der dramatische oder unterhaltende Stücke auf einer Bühne aufgeführt werden. @de
definition: En teatergenre där ett drama eller en komedi framförs uteslutande med tal och agerande av skådespelare på en scen. @se
definition: Género teatral em que peças dramáticas ou cómicas são representadas em palco. @pt-pt
definition: Gênero teatral em que peças dramáticas ou cômicas são representadas em palco. @pt-br
definition: En teatergenre, hvor et drama eller en komedie udelukkende udføres med tale og skuespil af skuespillere på en scene. @dk
definition: 一种在舞台上演出的戏剧或喜剧 @zh-hans
in scheme: Media Topic
created: 2018-04-09T12:00:00+00:00
modified: 2021-07-12T12:00:00+00:00
broader: theatre

stand-up comedy
type: Concept
preferred label: Stand up comedy @se
preferred label: stand-up @pt-pt
preferred label: standupkomedie @dk
preferred label: 单口喜剧 @zh-hans
preferred label: standup @no-nb
preferred label: Stand-Up-Comedy @de
preferred label: Stand-up @fr
preferred label: Comedia en vivo @es
preferred label: ستاند أب كوميدي @ar
definition: Typ av underhållning, där en person står på scen och pratar till publiken. Ofta skämtsamt men med en allvarlig underton och ibland svidande satir. @se
definition: A comic style in which a comedian performs a series of jokes or stories in front of a live audience, usually speaking directly to them
definition: Estilo de comédia em que um comediante, habitualmente de pé, conta uma série de piadas ou histórias à frente de um público ao vivo, falando diretamente para ele. @pt-pt
definition: En stil, hvor en komiker udfører en række vittigheder eller historier foran et levende publikum og ofte taler direkte til dem. @dk
definition: 一种喜剧形式，演员面对观众现场讲述一系列笑话或故事 @zh-hans
definition: Ein Comic-Stil, bei dem ein Komiker eine Reihe von Witzen oder Geschichten vor einem Live-Publikum vorträgt, wobei er sich in der Regel direkt an das Publikum wendet. @de
in scheme: Media Topic
created: 2019-04-06T12:00:00+00:00
modified: 2021-07-12T12:00:00+00:00
broader: theatre

cabaret
type: Concept
preferred label: Revy @se
preferred label: cabaré @pt-pt
preferred label: kabaret @dk
preferred label: 歌舞表演 @zh-hans
preferred label: Cabaret @de
preferred label: كباريه @ar
definition: Dramaföreställningar som är en satir över något som hänt under det gångna året @se
definition: A form of theatrical entertainment featuring music, song, dance, recitation, or drama that is performed in a nightclub or restaurant while the audience eats or drinks at tables
definition: Tipo de entretenimento teatral com música, canções, dança, récita ou representação, que é apresentado em clubes noturnos ou em restaurantes enquanto o público come ou bebe à mesa. @pt-pt
definition: En kunstform med musik, sang, dialog og dans, der ofte opføres i et severingslokale. @dk
definition: 一种戏剧娱乐形式，以音乐、歌曲、舞蹈、朗诵或戏剧为特色，在夜总会或餐馆表演，通常餐桌上摆放吃或喝的供给观众食用 @zh-hans
definition: Eine Form der theatralischen Unterhaltung mit Musik, Gesang, Tanz, Rezitation oder Drama, die in einem Nachtclub oder Restaurant aufgeführt wird, während das Publikum an Tischen isst oder trinkt. @de
in scheme: Media Topic
created: 2019-04-06T12:00:00+00:00
modified: 2021-09-30T12:00:00+00:00
broader: theatre

architecture
type: Concept
preferred label: Arkitektur @se
preferred label: Arquitectura @es
preferred label: Architecture @fr
preferred label: هندسة معمارية @ar
preferred label: Architektur @de
preferred label: arquitetura @pt-pt
preferred label: arkitektur @dk
preferred label: 建筑设计 @zh-hans
definition: Conception des bâtiments, des monuments et des espaces qui les entourent @fr
definition: Den mer visuella delen av att bestämma hur byggnadsverk, monument och anlagda områden ska se ut. @se
definition: The design of buildings, monuments and the spaces around them
definition: El diseño de edificios, monumentos y de los espacios que los rodean @es
definition: Entwurf und Gestaltung von Gebäuden, Denkmälern und deren Umgebung @de
definition: Arte de projetar e construir edifícios, monumentos e espaços envolventes. @pt-pt
definition: Construção de edifícios, monumentos e espaços envolventes. @pt-br
definition: Den mere visuelle del af beslutningen om, hvordan bygninger, monumenter og anlagte områder skal se ud. @dk
definition: 建筑物、纪念碑及其周围空间的设计 @zh-hans
in scheme: Media Topic
created: 2009-10-22T02:00:00+00:00
modified: 2021-02-18T12:00:00+00:00
broader: visual arts

design (visual arts)
type: Concept
preferred label: Diseño @es
preferred label: تصميم @ar
preferred label: Design @se
preferred label: Design (Bildende Kunst) @de
preferred label: design @pt-pt
preferred label: design (visuel kunst) @dk
preferred label: 设计（视觉艺术） @zh-hans
definition: Eine Kunstdisziplin, die sich auf visuelle Kommunikation und Präsentation konzentriert, die daraus hervorgehenden Produkte reichen von Schmuckstücken bis zur Wohnraumgestaltung @de
definition: Discipline artistique axée sur la communication visuelle et la présentation, dont le produit final peut aller de la joaillerie à la décoration intérieure @fr
definition: När man artistiskt bestämmer hur något ska se ut, kan vara så vitt skilda saker som smycken och interiörer. @se
definition: An artistic discipline which focuses on visual communication and presentation, the final product of which can range from jewellery to interior design
definition: Disciplina artística que se centra en la comunicación visual y la presentación, cuyo producto final puede variar desde joyas hasta diseño de interiores @es
definition: Disciplina artística que se foca na comunicação e apresentação visuais, e cujo produto final pode ir da joalharia ao design de interiores. @pt-pt
definition: Disciplina artística que se foca na comunicação e apresentação visuais, e cujo produto final pode ir da joalheria ao design de interiores. @pt-br
definition: En kunstnerisk disciplin, der fokuserer på visuel kommunikation og præsentation af et slutprodukt, kan spænde fra smykker til interiørdesign. @dk
definition: 一门注重视觉传达和展示的艺术学科，包括平面设计、珠宝首饰设计、室内设计等 @zh-hans
definition: An artistic discipline which focuses on visual communication and presentation, the final product of which can range from jewelry to interior design
in scheme: Media Topic
created: 2009-10-22T02:00:00+00:00
modified: 2021-02-18T12:00:00+00:00
broader: visual arts
broad match: http://cv.iptc.org/newscodes/subjectcode/01000000

drawing
type: Concept
preferred label: رسم @ar
preferred label: Zeichnen @de
preferred label: Dessin @fr
preferred label: Dibujo @es
preferred label: Teckning @se
preferred label: desenho @pt-pt
preferred label: tegning @dk
preferred label: 素描 @zh-hans
preferred label: tegnekunst @no-nb
preferred label: teiknekunst @no-nn
definition: Forma de arte visual que utiliza medios tales como lápices, rotuladores, pluma y tinta o carbón @es
definition: En form av visuell konst där pennor, kritor och liknande används. @se
definition: Ein Form der bildenden Künste die sich auf die Verwendung von Bleistiften, Filzstiften, Federn und Tinte sowie Holzkohle konzentriert @de
definition: A form of visual arts using mediums such as pencils, markers, pen and ink, charcoal
definition: Forme d'art visuel réalisé avec des outils tels que crayons, marqueurs, plume et encre, fusain @fr
definition: Forma de arte visual que usa materiais como lápis, marcadores, caneta e tinta, carvão. @pt-pt
definition: En form for visuel kunst, hvor penne, farveblyanter og lignende bruges. @dk
definition: 一种使用铅笔、记号笔、钢笔和墨水、木炭等媒介创作的视觉艺术形式 @zh-hans
in scheme: Media Topic
created: 2009-10-22T02:00:00+00:00
modified: 2021-02-18T12:00:00+00:00
broader: visual arts
broad match: http://cv.iptc.org/newscodes/subjectcode/01000000

painting
type: Concept
preferred label: Peinture @fr
preferred label: Pintura @es
preferred label: تصوير @ar
preferred label: Måleri @se
preferred label: Malerei @de
preferred label: pintura @pt-pt
preferred label: maleri @dk
preferred label: 绘画 @zh-hans
preferred label: malekunst @no-nb
preferred label: målarkunst @no-nn
definition: En form av visuell konst där pensel och olika färger används. @se
definition: Forma de arte visual que utiliza medios tales como pintura al óleo, acuarela, pastel o cera @es
definition: Eine Form der bildenden Künste die sich auf die Verwendung von Ölfarbe, Wasserfarbe, Pastelkreide und anderen Farbstoffen konzentriert @de
definition: Forme d'art visuel réalisé avec des matériaux tels que la peinture à l'huile, l'aquarelle, le pastel, le crayon @fr
definition: A form of visual arts using mediums such as oil paint, watercolour, pastel, crayon
definition: Arte visual que expressa emoções ou mensagens através do uso de óleos, aguarelas, pastéis, lápis, carvão, etc., em diversas bases. @pt-pt
definition: Arte visual que expressa emoções ou mensagens através do uso de óleos, aguarelas, pastéis, lápis, carvão etc., em diversas bases. @pt-br
definition: En form for visuel kunst, der bruger pensel og forskellige farver. @dk
definition: 一种使用油彩、水彩、蜡笔等媒介创作的视觉艺术形式 @zh-hans
definition: A form of visual arts using mediums such as oil paint, watercolor, pastel, crayon
in scheme: Media Topic
created: 2009-10-22T02:00:00+00:00
modified: 2021-02-18T12:00:00+00:00
broader: visual arts

photography
type: Concept
preferred label: Fotografía @es
preferred label: Photographie @fr
preferred label: Fotografie @de
preferred label: Fotografi @se
preferred label: تصوير فوتوغرافي @ar
preferred label: fotografia @pt-pt
preferred label: fotografi @dk
preferred label: 摄影 @zh-hans
definition: Eine Form der bildenden Künste, die fotografische Bilder verwendet @de
definition: A form of visual arts using photographic images
definition: Forma de arte visual en el cual se producen imágenes capturando luz @es
definition: Forme d'art visuel qui consiste à produire des images en captant la lumière @fr
definition: En form av visuell konst där avbildande utrustning används, t ex analog eller digital kamera. @se
definition: Meio mecânico de criar imagens mediante o uso da luz e de materiais sensíveis à luz, com químicos ou mediante meios digitais. @pt-pt
definition: En form for visuel kunst ved hjælp af fotografiske billeder. @dk
definition: 一种使用摄影图像的视觉艺术形式 @zh-hans
in scheme: Media Topic
created: 2009-10-22T02:00:00+00:00
modified: 2021-02-18T12:00:00+00:00
broader: visual arts

sculpture
type: Concept
preferred label: Escultura @es
preferred label: نحت @ar
preferred label: Bildhauerei @de
preferred label: Sculpture @fr
preferred label: Skulptur @se
preferred label: escultura @pt-pt
preferred label: skulptur @dk
preferred label: 雕塑 @zh-hans
definition: Eine Form der bildenden Künste, die sich auf die Verwendung von Lehm, Stein, Holz und Metall zur Herstellung dreidimensionaler Werke konzentriert @de
definition: Forme d'art visuel réalisé avec des matériaux tels que l'argile, la pierre, le bois et le métal pour créer des œuvres en trois dimensions @fr
definition: A form of visual arts using mediums such as clay, stone, wood and metal to create three-dimensional works
definition: Forma de arte visual que utiliza medios tales como arcilla, piedra, madera y metal para crear obras tridimensionales @es
definition: En form av visuell konst där föremål framställs av någon form av fast material som exempelvis sten, trä eller lera. @se
definition: Representação de formas em barro, pedra, madeira, metal ou outros materiais. @pt-pt
definition: En kunstart, hvor genstande er lavet af en form for fast materiale, såsom sten, træ eller ler. @dk
definition: 用黏土、石头、木头和金属等媒介创作三维作品的视觉艺术形式 @zh-hans
in scheme: Media Topic
created: 2009-10-22T02:00:00+00:00
modified: 2021-05-05T12:00:00+00:00
broader: visual arts

textile arts
type: Concept
preferred label: Textil @se
preferred label: artes têxteis @pt-pt
preferred label: tekstilkunst @dk
preferred label: 纺织艺术 @zh-hans
preferred label: Textilkunst @de
preferred label: Arts textiles @fr
preferred label: Artes textiles @es
preferred label: فنون النسيج @ar
definition: Arts and crafts that use plant, animal, or synthetic fibres to construct practical or decorative object
definition: Hantverk där olika former av fiber används för att producera praktiska och/eller dekorativa objekt. @se
definition: Artes e ofícios que usam fibras vegetais, animais ou sintéticas para construir objetos práticos ou decorativos. @pt-pt
definition: Håndværk, hvor forskellige former for fiber bruges til at fremstille praktiske og/eller dekorative genstande. @dk
definition: 用植物、动物或合成纤维制作实用或装饰性物品的工艺美术 @zh-hans
definition: Kunsthandwerk, bei dem pflanzliche, tierische oder synthetische Fasern zur Herstellung praktischer oder dekorativer Gegenstände verwendet werden @de
in scheme: Media Topic
created: 2019-04-06T12:00:00+00:00
modified: 2021-07-12T12:00:00+00:00
broader: visual arts

woodworking
type: Concept
preferred label: Träsnide @se
preferred label: marcenaria @pt-pt
preferred label: træbearbejdning @dk
preferred label: 木工 @zh-hans
preferred label: trearbeider @no-nb
preferred label: Schreinern @de
preferred label: Travail du bois @fr
preferred label: Carpintería @es
preferred label: مشغولات خشبية @ar
preferred label: trearbeid @no-nn
definition: The activity or skill of making items, such as furniture or cabinets, from wood
definition: Hantverk där man använder trä och olika verktyg för att producera föremål eller detaljer till föremål. För nytta eller prydnad. @se
definition: A atividade ou a arte de fazer objetos de madeira, como móveis ou armários. @pt-pt
definition: Håndværk, hvor man anvender træ og forskellige værktøjer til fremstilling af genstande eller detaljer til genstande. @dk
definition: 用木头制作物品的活动或技巧，如家具或橱柜 @zh-hans
definition: Die Tätigkeit oder Fähigkeit, Gegenstände wie Möbel oder Schränke aus Holz herzustellen @de
in scheme: Media Topic
created: 2019-04-06T12:00:00+00:00
modified: 2021-07-12T12:00:00+00:00
broader: visual arts

forging
type: Concept
preferred label: Smide @se
preferred label: forjamento @pt-pt
preferred label: smedning @dk
preferred label: 锻造（艺术） @zh-hans
preferred label: smiing @no-nb
preferred label: Schmieden @de
preferred label: Forgeage @fr
preferred label: Forja @es
preferred label: تطريق @ar
definition: The shaping of metal using localized compressive forces, such as heating and hammering
definition: Hantverk där man bearbetar upphettad metall med verktyg för att tillverka nyttoföremål eller prydnadsföremål. @se
definition: Modelagem de metal usando forças de compressão localizadas, como aquecimento e martelamento. @pt-pt
definition: Håndværk, hvor man arbejder med opvarmet metal med værktøjer til fremstilling af redskaber eller dekorative genstande. @dk
definition: 利用局部压缩力，如加热和锤击金属制成艺术品 @zh-hans
definition: Die Formgebung von Metall mit Hilfe von lokalisierten Druckkräften, wie Erwärmung und Hämmern @de
in scheme: Media Topic
created: 2019-04-06T12:00:00+00:00
modified: 2021-07-12T12:00:00+00:00
broader: visual arts

cultural development
type: Concept
preferred label: تنمية ثقافية @ar
preferred label: Kulturhistoria @se
preferred label: Kulturgeschichte @de
preferred label: Histoire de l'art @fr
preferred label: Artes tradicionales @es
preferred label: desenvolvimento cultural @pt-pt
preferred label: kulturhistorie @dk
preferred label: 文化发展 @zh-hans
definition: Hur kultur utvecklats under olika tidsperioder. @se
definition: Histoire du développement de l'art et de la culture comme l'évolution des peintures rupestres, les variations linguistiques dans le temps, l'évolution des valeurs socioculturelles @fr
definition: Historia del desarrollo del arte y de la cultura, como la evolución de las pinturas rupestres, las variaciones lingüísticas a lo largo del tiempo, la evolución de los valores @es
definition: Die Geschichte der Entwicklung von Kunst und Kultur, wie beispielsweise die Entstehung der Höhlenmalerei, die Änderungen in der Sprache über die Zeit hinweg, die Entwicklung von Werten. @de
definition: The history of the development of art and culture such as the rise of cave paintings, linguistic variations over time, the evolution of values
definition: História do desenvolvimento de artes e culturas, tais como pinturas rupestres, arte pré-colombiana ou confeção de papel chinês. @pt-pt
definition: História do desenvolvimento de artes e culturas, tais como pinturas rupestres, arte pré-colombiana, confecção de papel chinês. @pt-br
definition: Historien om, hvordan kunst og kultur har udviklet sig over forskellige tidsperioder. @dk
definition: 艺术和文化发展史，如岩画的兴起、语言随时间的变化、价值观的演变 @zh-hans
in scheme: Media Topic
created: 2009-10-22T02:00:00+00:00
modified: 2021-02-18T12:00:00+00:00
broader: culture

customs and tradition
type: Concept
preferred label: عادات وتقاليد @ar
preferred label: Coutumes et traditions @fr
preferred label: Costumbres y tradiciones @es
preferred label: Brauchtum @de
preferred label: Seder och traditioner @se
preferred label: costumes e tradições @pt-pt
preferred label: skik og tradition @dk
preferred label: 习俗和传统 @zh-hans
preferred label: skikk og tradisjon @no-nb
preferred label: skikk og bruk @no-nn
definition: A particular way of behaving, or observances that have developed over time by a group of people
definition: Eine spezielle Verhaltensweise oder ein Brauch, die sich für eine bestimmte Gruppe von Menschen über einen Zeitraum entwickelt haben @de
definition: Beteende hos en grupp människor som utvecklats över tid. @se
definition: Comportamentos ou atitudes que se desenvolveram ao longo do tempo entre um grupo de pessoas. @pt-pt
definition: En bestemt måde at opføre sig på eller observationer, der har udviklet sig over tid af en gruppe mennesker. @dk
definition: 一群人随着时间的推移而发展起来的一种行为方式或礼仪 @zh-hans
in scheme: Media Topic
created: 2009-10-22T02:00:00+00:00
modified: 2021-02-18T12:00:00+00:00
broader: culture

festive event (culture)
type: Concept
preferred label: Kulturell fest eller händelse @se
preferred label: Festividades @es
preferred label: Fest (Kultur) @de
preferred label: حدث احتفالي @ar
preferred label: Festivals et commémorations @fr
preferred label: festividades (cultura) @pt-pt
preferred label: festlig begivenhed (kultur) @dk
preferred label: 节日活动（文化） @zh-hans
preferred label: festivaler @no-nb
preferred label: festivalar @no-nn
definition: Ein Ereignis, das von einer Gruppe gefeiert wird und das sich auf eine charakteristische Eigenschaft der Gruppe oder ihrer Religion oder Gebräuche konzentriert @de
definition: An event ordinarily celebrated by a community and centring on some characteristic aspect of that community and its religion or traditions
definition: Evento comúnmente celebrado por una comunidad y centrado en algún aspecto característico de esa comunidad y su religión o sus tradiciones @es
definition: Événement habituellement célébré par une communauté et centré sur un aspect caractéristique de cette communauté, de sa religion ou de ses traditions @fr
definition: En händelse som firas av en grupp personer med samma intresse och som fokuserar på en karakteristisk aspekt av gruppen och dess traditioner. @se
definition: Um evento geralmente celebrado por uma comunidade e centrado em algum aspeto dessa comunidade ou na sua religião e tradições. @pt-pt
definition: Um evento geralmente celebrado por uma comunidade e centrado em algum aspeto dessa comunidade ou em sua religião e tradições. @pt-br
definition: En begivenhed fejret af en gruppe mennesker med samme interesse, og som fokuserer på et karakteristisk aspekt af gruppen og dens traditioner. @dk
definition: 通常由一个社群举行的庆祝活动，以该社群及其宗教或传统的某些特征为中心 @zh-hans
definition: An event ordinarily celebrated by a community and centering on some characteristic aspect of that community and its religion or traditions
in scheme: Media Topic
created: 2009-10-22T02:00:00+00:00
modified: 2021-02-18T12:00:00+00:00
broader: culture

language
type: Concept
preferred label: Språk @se
preferred label: لغة @ar
preferred label: Sprache @de
preferred label: Langue @fr
preferred label: Lenguaje @es
preferred label: linguagem @pt-pt
preferred label: língua @pt-br
preferred label: sprog @dk
preferred label: 语言 @zh-hans
preferred label: språk @no-nb
definition: The method of human communication, either spoken or written, consisting of words that are used in a structured and conventional way
definition: En metod för mänsklig kommunikation, antingen skriftlig eller muntlig, som består av ord som sätts samman på ett sätt som utvecklats över tid inom en grupp människor som därmed kan kommunicera med varandra. @se
definition: Eine Form menschlicher Kommunikation, entweder gesprochen oder geschrieben, in der Wörter in einer strukturierten und allgemein gebräuchlichen Form verwendet werden @de
definition: Méthode de communication humaine, orale ou écrite, composée de mots utilisés de manière structurée et conventionnelle @fr
definition: Método de comunicación humana, hablado o escrito, que consiste en palabras que se utilizan de una manera estructurada y convencional @es
definition: Meio através do qual as pessoas comunicam umas com as outras. @pt-pt
definition: Metode til menneskelig kommunikation, enten talt eller skrevet, bestående af ord, der bruges på en struktureret og konventionel måde. @dk
definition: 人类交流的方法，包括口头与书面形式 @zh-hans
in scheme: Media Topic
created: 2009-10-22T02:00:00+00:00
modified: 2021-02-18T12:00:00+00:00
broader: culture

library and museum
type: Concept
preferred label: Bibliotecas y museos @es
preferred label: Bibliothèque et musée @fr
preferred label: مكاتب ومتاحف @ar
preferred label: Bibliotek och museum @se
preferred label: Bibliothek und Museum @de
preferred label: bibliotecas e museus @pt-pt
preferred label: bibliotek og museum @dk
preferred label: 图书馆和博物馆 @zh-hans
definition: Instituciones que albergan colecciones de libros, música, arte u objetos del pasado y del presente, opcionalmente para uso público y exposiciones @es
definition: Institutioner som samlar böcker, musikinspelningar, filmer, konstverk och gamla saker från olika tidsepoker och låter intresserade titta på dessa och i vissa fall låna hem dem. @se
definition: Einrichtungen, die Sammlungen von Büchern, Musik, Kunst oder Objekten aus der Vergangenheit beherbergen und wahlweise der Öffentlichkeit zur Besichtigung und Nutzung öffnen @de
definition: Institutions that house collections of books, music, art, or objects from the past and present optionally for public use and display
definition: Institution qui abrite des collections de livres, de musique, d'œuvres d'art ou d'objets du passé et du présent pouvant être exposées ou mises à la disposition du public @fr
definition: Edifícios utilizados para albergar coleções de livros, música, arte ou objetos do passado e do presente para uso público e exibição. @pt-pt
definition: Institutioner, der samler bøger, musikoptagelser, film, kunstværker og gamle ting fra forskellige epoker og lader interesserede se på dem og i nogle tilfælde låne dem hjem. @dk
definition: 收藏书籍、音乐、艺术品等的机构，既可服务于公共用途，也可以是对内用途 @zh-hans
in scheme: Media Topic
created: 2009-10-22T02:00:00+00:00
modified: 2021-05-05T12:00:00+00:00
broader: culture

monument and heritage site
type: Concept
preferred label: Patrimoine @fr
preferred label: Denkmal und Gedenkstätte @de
preferred label: Monumentos y patrimonio cultural @es
preferred label: تراث @ar
preferred label: Kulturarv @se
preferred label: monumentos e património @pt-pt
preferred label: monumentos e patrimônio @pt-br
preferred label: monument og kulturarv @dk
preferred label: 纪念碑和遗址 @zh-hans
preferred label: kulturvern @no-nb
definition: Commemorations of historical people, events, or the areas containing them, in the form of structures such as sculptures, statues or buildings
definition: Erinnerungen an historische Personen, Ereignisse in Form von Skulpturen, Statuen, und Bauten, sowie Stätten die sie umfassen @de
definition: Platser med någon form av påminnelse för att något hänt där eller befunnit sig där. Kan också vara en plats som utsetts för att vara ett minnesmärke för något som hänt någon annanstans. @se
definition: Monumentos que recuerdan a personas o eventos históricos y las áreas que los contienen @es
definition: Biens et monuments commémorant des personnages ou des événements historiques et les sites qui les entourent @fr
definition: Construção ou obra que comemora alguém ou algum facto memorável. @pt-pt
definition: Áreas que contêm objetos comemorativos da história, de um povo ou de eventos. @pt-br
definition: Mindesmærker over historiske mennesker, begivenheder eller bestemte områder i form af strukturer som skulpturer, statuer eller bygninger. @dk
definition: 以雕塑、雕像或建筑物等结构形式纪念历史人物、历史事件或包含这些事件的地区 @zh-hans
in scheme: Media Topic
created: 2009-10-22T02:00:00+00:00
modified: 2021-05-05T12:00:00+00:00
broader: culture
narrower: restoration

art exhibition
type: Concept
preferred label: Exposition artistique @fr
preferred label: Konstutställning @se
preferred label: Exposición de arte @es
preferred label: Kunstausstellung @de
preferred label: exposição artística @pt-pt
preferred label: udstilling @dk
preferred label: 艺术展览 @zh-hans
preferred label: kunstutstilling @no-nb
preferred label: معرض فني @ar
definition: Zeitlich begrenzte Präsentation von Kunst in einem Museum, einer Kunsthalle oder Galerie @de
definition: Temporary presentation of art in museums, art halls or galleries
definition: Ett tillfälle då en eller flera konstverk visas upp i en lokal, vanligtvis under en avgränsad period. @se
definition: Présentation temporaire d'art dans des musées, des salles ou des galeries @fr
definition: Presentación temporal de arte en museos, salas de arte o galerías @es
definition: Apresentação temporária de arte em museus, salas de arte ou galerias. @pt-pt
definition: Midlertidig præsentation af kunst eller særemner på museer, kunsthaller eller gallerier. @dk
definition: 在博物馆、艺术大厅或画廊举办的短期艺术品展出 @zh-hans
definition: Mellombels presentasjon av kunst i museum, kunsthallar eller galleri. @no-nn
definition: Midlertidig presentasjon av kunst i museer, kunsthaller eller gallerier. @no-nb
in scheme: Media Topic
created: 2012-10-04T12:00:00+00:00
modified: 2023-03-31T12:00:00+00:00
broader: culture

restoration
type: Concept
preferred label: Sanierung @de
preferred label: ترميم @ar
preferred label: Renovering @se
preferred label: Renovación @es
preferred label: Rénovation @fr
preferred label: obras de renovação @pt-pt
preferred label: renovering @dk
preferred label: 翻修 @zh-hans
preferred label: bygningsvern @no-nb
definition: Restoring historic or important properties or structures to a former better state by cleaning, repairing or rebuilding
definition: Återställande av en byggnad i ett tekniskt skick som motsvarar nyskick. @se
definition: Wiederherstellung von Eigentum/Bauwerken in einen ehemaligen Zustand durch Reinigung, Reparatur oder Wiederaufbau @de
definition: Recuperação de propriedades ou estruturas, mediante limpeza, reparação ou reconstrução. @pt-pt
definition: Renovering af en bygning svarende til ny tilstand. @dk
definition: 通过清洁、修理或重建使性质或结构恢复到以前的较好状态 @zh-hans
in scheme: Media Topic
created: 2009-10-22T02:00:00+00:00
modified: 2023-03-31T12:00:00+00:00
broader: monument and heritage site

news media
type: Concept
preferred label: Nachrichtensender @de
preferred label: اعلام اخباري @ar
preferred label: Medios de información @es
preferred label: Média d'information @fr
preferred label: Nyhetsmedier @se
preferred label: órgãos noticiosos @pt-pt
preferred label: mídia noticiosa @pt-br
preferred label: nyhedsmedie @dk
preferred label: 新闻媒体 @zh-hans
preferred label: nyhetsmedier @no-nb
preferred label: nyheitsmedium @no-nn
definition: Présentation d'informations au public à travers différentes plateformes, telles que la télévision, la radio, les journaux, les magazines et l'internet @fr
definition: Presentación de noticias al público a través de diferentes plataformas, televisión, radio, periódicos, revistas, páginas web y blogs @es
definition: Massmedier som har som första syfte att samla in och presentera sådant som är nytt för sin respektive publik. @se
definition: The presentation of news to the public through different platforms, such as TV, radio, newspapers, magazines, web pages and blogs
definition: Die Präsentation von Nachrichten gegenüber der Öffentlichkeit in unterschiedlichen Formen wie Fernsehen, Radion, Zeitungen, Magazinen, Webseiten oder Blogs @de
definition: Órgãos de comunicação que se dedicam à difusão pública de notícias, incluindo as publicações impressas (jornais e revistas), a rádio e a televisão e, mais recentemente, os serviços de notícias eletrónicos. @pt-pt
definition: Televisão, rádio, serviços de notícias que recolhem fatos sobre incidentes, desenvolvendo e fazendo sua apresentação ao público como uma história completa. @pt-br
definition: Præsentation af nyheder til offentligheden gennem forskellige platforme, såsom tv, radio, aviser, magasiner, websider og blogs. @dk
definition: 通过电视、广播、报纸、杂志、网页和博客等不同平台向公众传播新闻的机构 @zh-hans
in scheme: Media Topic
created: 2009-10-22T02:00:00+00:00
modified: 2021-02-18T12:00:00+00:00
broader: mass media

newspaper
type: Concept
preferred label: صحيفة @ar
preferred label: Journaux @fr
preferred label: Zeitung @de
preferred label: Tidningar @se
preferred label: Diarios y revistas @es
preferred label: jornais @pt-pt
preferred label: avis @dk
preferred label: 报纸 @zh-hans
definition: Regelbundet producerade publikationer som innehåller nyheter och andra saker som är av intresse för läsarna. Var tidigare uteslutande distribuerat i pappersform, men nya tekniska lösningar används numera. @se
definition: Daily or weekly publication that presents the news, locally, regionally or globally, as well as features, opinion columns, comics and other content
definition: Publication périodique qui présente des informations locales, régionales ou mondiales, ainsi que des sujets magazines, des reportages, des articles d'opinion, des bandes dessinées et d'autres contenus @fr
definition: Eine täglich oder wöchentlich erscheinende Publikation, die Lokal-, Regional- oder Weltnachrichten präsentiert sowie Features, Meinungsspalten, Comics und weitere Inhalte @de
definition: Publicación diaria o semanal que presenta las noticias, a nivel local, regional o mundial, reportajes, columnas de opinión, cómics y otros contenidos @es
definition: Publicações diárias ou semanais que apresentam em geral notícias e informações atualizadas, locais, nacionais e internacionais, assim como artigos de opinião, artigos de fundo, banda desenhada e outros conteúdos. @pt-pt
definition: Publicações diárias ou semanais que apresentam em geral notícias e informações atualizadas, locais, nacionais e internacionais, assim como artigos de opinião, artigos de fundo, quadrinhos e outros conteúdos. @pt-br
definition: Regelmæssigt producerede publikationer, der indeholder nyheder og andet indhold af interesse for læserne. @dk
definition: 每日或每周发行的出版物，提供本地、区域或全球新闻以及专题、评论专栏、漫画和其他内容 @zh-hans
in scheme: Media Topic
created: 2009-10-22T02:00:00+00:00
modified: 2021-02-18T12:00:00+00:00
broader: mass media

online media outlet
type: Concept
preferred label: اعلام الكتروني @ar
preferred label: Online Medien @de
preferred label: Internet @fr
preferred label: Internetmedier @se
preferred label: meios de comunicação online @pt-pt
preferred label: mídia online @pt-br
preferred label: online medie @dk
preferred label: 网络媒体 @zh-hans
preferred label: nettmedier @no-nb
preferred label: nettmedium @no-nn
definition: Nyheter som distribueras via internet. @se
definition: Publicación que distribuye contenido, como artículos, blogs, fotos, videos y música, solo a través de Internet @es
definition: Publication distributing content, such as articles, blogs, photos, video and music, only over the internet
definition: Eine Publikation, die Inhalte wie Artikel, Blogs, Fotos, Videos oder Musik über das Internet verbreitet. @de
definition: Média proposant des contenus multimédias sur Internet, tel que des nouvelles, des articles, des blogs, des photos, des infographies, des vidéos et de la musique @fr
definition: Conteúdos publicados na Internet, como artigos, blogues, fotos, vídeo e música. @pt-pt
definition: Nyheder og andet indhold distribueret via internettet. @dk
definition: 仅指在互联网上发布文章、博客、照片、视频和音乐等内容的媒体 @zh-hans
in scheme: Media Topic
created: 2009-10-22T02:00:00+00:00
modified: 2021-05-05T12:00:00+00:00
broader: mass media
broad match: http://cv.iptc.org/newscodes/subjectcode/01026000

periodical
type: Concept
preferred label: Périodiques @fr
preferred label: دورية @ar
preferred label: Periodiska tidskrifter @se
preferred label: Periódicos @es
preferred label: Zeitschrift @de
preferred label: periódicos @pt-pt
preferred label: tidssskrift og magasin @dk
preferred label: 期刊 @zh-hans
preferred label: tidsskrift @no-nb
definition: Publication qui est généralement publiée chaque semaine, toutes les deux semaines, tous les mois ou tous les ans, comme les magazines, les revues et les bulletins d'information @fr
definition: Publication that is usually published weekly, bi-weekly, monthly or annually, such as magazines, journals or newsletters
definition: Publicación que generalmente se publica semanal, quincenal, mensual o anualmente, como revistas o boletines @es
definition: Sammanställningar av material som är mer specialicerat och som publiceras regelbundet, men mer sällan än tidningar. @se
definition: Eine Publikation, die üblicherweise wöchentlich, vierzehntägig, monatlich, quartalsweise oder jährlich erscheint, wie zum Beispiel Magazine, Zeitschriften oder Rundbriefe @de
definition: Material escrito que se publica semanal, quinzenal, mensal ou anualmente. @pt-pt
definition: Publikation, der normalt offentliggøres ugentligt, månedligt eller årligt, såsom magasiner, tidsskrifter eller nyhedsbreve. @dk
definition: 通常每周、每两周、每月或每年出版的出版物，如杂志、期刊或时事通讯 @zh-hans
in scheme: Media Topic
created: 2009-10-22T02:00:00+00:00
modified: 2021-02-18T12:00:00+00:00
broader: mass media

radio
type: Concept
preferred label: Radio @se
preferred label: اذاعة @ar
preferred label: rádio @pt-pt
preferred label: 广播 @zh-hans
definition: Audio content, such as news, entertainment or information, distributed via broadcast or internet
definition: Die hörbare Form von Nachrichten, Unterhaltung oder Information, die über Rundfunk oder das Internet verbreitet wird. @de
definition: Program som bara består av ljud och distribueras trådlöst eller via internet. @se
definition: Média proposant des contenus audio, tel que nouvelles, magazines ou émissions de divertissement, transmis par ondes ou par Internet @fr
definition: Contenido audio, noticias, entretenimiento o información, distribuido a través de ondas de radio o por internet @es
definition: Histórias relativas à rádio como difusora de conteúdo noticioso e meio de entretenimento. @pt-pt
definition: Programmer, der kun består af lyd og distribueres trådløst eller over internettet. @dk
definition: 通过无线电广播或互联网传播的音频内容，如新闻、娱乐或信息 @zh-hans
in scheme: Media Topic
created: 2009-10-22T02:00:00+00:00
modified: 2021-02-18T12:00:00+00:00
broader: mass media

television
type: Concept
preferred label: Télévision @fr
preferred label: Televisión @es
preferred label: Tv @se
preferred label: Fernsehen @de
preferred label: تلفزيون @ar
preferred label: televisão @pt-pt
preferred label: tv @dk
preferred label: 电视 @zh-hans
definition: Contenido audiovisual, noticias, entretenimiento o información, distribuido a través de redes de televisión, cable o por internet @es
definition: Video content, such as news, entertainment or information, distributed via broadcast or internet
definition: Média proposant des contenus audiovisuels, tel que nouvelles, magazines ou émissions de divertissement, transmis par ondes, câble ou Internet @fr
definition: Program som har både ljud och bild och distribueras trådlöst eller via internet. @se
definition: Die sicht- und hörbare Videoform von Nachrichten, Unterhaltung oder Information, die über Rundfunk oder das Internet verbreitet wird. @de
definition: Histórias relativas à televisão como difusora de conteúdo informativo e meio de entretenimento. @pt-pt
definition: Programmer, der omfatter både lyd og video og distribueres trådløst eller via Internettet. @dk
definition: 通过无线电广播或互联网传播的视频内容，如新闻、娱乐或信息 @zh-hans
in scheme: Media Topic
created: 2009-10-22T02:00:00+00:00
modified: 2021-02-18T12:00:00+00:00
broader: mass media

social media
type: Concept
preferred label: Réseaux sociaux @fr
preferred label: Redes sociales @es
preferred label: Sociala medier @se
preferred label: Soziale Medien @de
preferred label: média sociais @pt-pt
preferred label: mídias sociais @pt-br
preferred label: socialt medie @dk
preferred label: 社交媒体 @zh-hans
preferred label: sosiale medier @no-nb
preferred label: شبكات تواصل اجتماعي @ar
preferred label: sosiale medium @no-nn
definition: Innehåll som görs tillgängligt av både företag och enskilda via forum på internet. @se
definition: Inhalte, die geschaffen wurden um über soziale Netze des Internets verbreitet zu werden @de
definition: Content created to be shared within online social networks
definition: Contenu créé pour être partagé sur les réseaux sociaux en ligne @fr
definition: Contenido creado para ser compartido en las redes sociales @es
definition: Tecnologia que permite a criação e partilha de informação online. @pt-pt
definition: Indhold, der stilles til rådighed af både virksomheder og enkeltpersoner via fora på internettet. @dk
definition: 为在线社交网络共享而创建的内容 @zh-hans
in scheme: Media Topic
created: 2018-04-09T12:00:00+00:00
modified: 2021-07-12T12:00:00+00:00
broader: mass media
narrower: influencers

disinformation and misinformation
type: Concept
preferred label: desinformasjon og feilinformasjon @no-nb
preferred label: Desinformation @se
preferred label: disinformation og misinformation @dk
preferred label: desinformação e informação errada @pt-pt
preferred label: 误导和不实消息 @zh-hans
preferred label: Desinformation und Fehlinformation @de
preferred label: Désinformation @fr
preferred label: Desinformación @es
preferred label: تضليل إعلامي @ar
definition: The spread of false information regardless of intent
definition: Spridande av falsk information oavsett avsikt. @se
definition: Spredning af falske nyheder eller informationer, uanset hensigten. @dk
definition: Disseminação de informação falsa ou incorreta, independentemente da intenção. @pt-pt
definition: 有意无意散布虚假信息 @zh-hans
definition: Die Verbreitung von Falschinformationen unabhängig von der Absicht @de
in scheme: Media Topic
created: 2021-02-18T12:00:00+00:00
modified: 2021-07-12T12:00:00+00:00
broader: mass media

act of bioterrorism
type: Concept
preferred label: Acto de bioterrorismo @es
preferred label: Bioterrorismus @de
preferred label: Bioterrorisme @fr
preferred label: عمل ارهاب بيولوجي @ar
preferred label: Biologisk terrorism @se
preferred label: atos de bioterrorismo @pt-pt
preferred label: bioterrorisme @dk
preferred label: 生物恐怖主义活动 @zh-hans
definition: Attacker med biologiska ämnen för att öka rädslan hos folk. @se
definition: Attaques où sont utilisés des agents biologiques, destinées à provoquer un effet de panique au sein d'une population @fr
definition: Attacks using biological agents intended to raise the level of fear within a population
definition: Einsatz von biologischen Kampfstoffen, um Angst innerhalb der Bevölkerung auszulösen @de
definition: Ataques donde se usan agentes biológicos, con el propósito de generar pánico y terror en una población @es
definition: Ataques com utilização de substâncias biológicas ou químicas para aumentar o nível de medo da população, com ou sem mortes. @pt-pt
definition: Biologiske angreb for at øge frygt hos mennesker. @dk
definition: 为了提高人群的恐惧程度而使用生物制剂进行攻击的行为 @zh-hans
in scheme: Media Topic
created: 2009-10-22T02:00:00+00:00
modified: 2021-02-18T12:00:00+00:00
broader: act of terror

terrorist bombings
type: Concept
preferred label: Attentat à la bombe @fr
preferred label: عمليات قصف @ar
preferred label: Bombenattentat @de
preferred label: Bombdåd @se
preferred label: Atentado con bomba @es
preferred label: atentados à bomba @pt-pt
preferred label: bombning @dk
preferred label: 爆炸袭击 @zh-hans
preferred label: bombeattentat @no-nb
definition: Geplanter Einsatz von Sprengkörpern gegen Menschen, Gebäude oder andere Objekte @de
definition: Intentional use of explosive devices on people, buildings or other structures
definition: Avsiktligt användande av sprängmedel med personer eller byggnader som mål. @se
definition: Uso intencional de dispositivos explosivos en personas, edificios u otras estructuras @es
definition: Utilisation intentionnelle d'engins explosifs sur des personnes, des bâtiments ou d'autres structures @fr
definition: Uso de dispositivos explosivos contras pessoas, edifícios ou estruturas. @pt-pt
definition: Forsætlig brug af eksplosionsanordninger mod mennesker, bygninger eller andre strukturer. @dk
definition: 有意地在人、大厦或其他建筑物上使用爆炸装置的行为 @zh-hans
in scheme: Media Topic
created: 2009-10-22T02:00:00+00:00
modified: 2023-03-31T12:00:00+00:00
broader: act of terror

guerrilla activity
type: Concept
preferred label: Guerilla @de
preferred label: Actividad guerrillera @es
preferred label: Gerillakrig @se
preferred label: Guérilla @fr
preferred label: حرب عصابات @ar
preferred label: guerrilha @pt-pt
preferred label: guerillaaktivitet @dk
preferred label: 游击活动 @zh-hans
preferred label: geriljakrig @no-nb
definition: Actions antigouvernementales ou actions de guerre menées par des groupes de combattants clandestins ou indépendants, utilisant souvent des tactiques telles que l'embuscade, le sabotage, les raids et les enlèvements @fr
definition: Anti-government or wartime actions by clandestine or non-state combatant groups, often using tactics such as ambush, sabotage, raids and kidnapping
definition: Regierungsfeindliche oder kriegerische Aktionen von Untergrundgruppen oder anderen nicht-staatlichen Kämpfern, in denen oft Hinterhalte, Sabotage, Überfälle oder Entführungen eingesetzt werden @de
definition: Acciones de guerra o antigubernamentales dirigidas por grupos de combatientes clandestinos o independientes, utilizando tácticas como emboscadas, sabotajes, incursiones y secuestros @es
definition: Krigföring som avser att beröva motståndaren en etablerad kontroll över ett område, främst genom rörlig strid av talrika mindre förband, vilka under lång tid utför sabotage och eldöverfall. @se
definition: Ações antigovernamentais de grupos clandestinos armados, mediante ataques súbitos, sabotagem, sequestro, etc. @pt-pt
definition: Ações antigovernamentais de grupos clandestinos armados, mediante ataques súbitos, sabotagem, sequestro etc. @pt-br
definition: Krigsførelse beregnet til at fratage modstanderen en etableret kontrol over et område, primært gennem den mobile kamp om adskillige mindre enheder, ofte ved anvendelse sabotage og overraskelsesangreb. @dk
definition: 秘密或非国家武装组织的反政府或战时行为，经常使用伏击、破坏、突袭和绑架等战术 @zh-hans
in scheme: Media Topic
created: 2009-10-22T02:00:00+00:00
modified: 2021-02-18T12:00:00+00:00
broader: armed conflict

international military intervention
type: Concept
preferred label: Internationell militär intervention @se
preferred label: Intervention militaire internationale @fr
preferred label: Intervención militar internacional @es
preferred label: تدخل عسكري دولي @ar
preferred label: Internationale militärische Intervention @de
preferred label: intervenção militar internacional @pt-pt
preferred label: international militær indgriben @dk
preferred label: 国际军事介入 @zh-hans
preferred label: militær intervensjon @no-nb
definition: Zeitlich begrenzter Einsatz von internationalen Streitkräften in einem Land oder einer Region, welche(s) Hilfe von außen benötigt, zur Lösung einer Krise @de
definition: Présence temporaire de forces internationales dans un pays ou une région qui nécessite une aide extérieure pour résoudre une crise @fr
definition: Presencia temporal de fuerzas internacionales en un país o región que requiere asistencia externa para resolver una crisis @es
definition: Tillfälligt användande av internationella trupper i ett land eller en region, som behöver hjälp från utsidan för att lösa en kris. @se
definition: The temporary use of international forces in a country or region that requires outside help with resolving a crisis
definition: Uso temporário de forças internacionais, seja por convite ou por decisão de órgão estrangeiro, num país ou numa região com intenção de resolver uma crise. @pt-pt
definition: Midlertidig brug af internationale tropper i et land eller en region, som har brug for hjælp udefra til at løse en krise. @dk
definition: 在需要外界帮助解决危机的国家或地区临时使用国际部队 @zh-hans
in scheme: Media Topic
created: 2009-10-22T02:00:00+00:00
modified: 2021-02-18T12:00:00+00:00
broader: armed conflict

military occupation
type: Concept
preferred label: احتلال عسكري @ar
preferred label: Ocupación militar @es
preferred label: Militärische Besetzung @de
preferred label: Forces d'occupation @fr
preferred label: Ockupation @se
preferred label: ocupação militar @pt-pt
preferred label: militær besættelse @dk
preferred label: 军事占领 @zh-hans
preferred label: militær okkupasjon @no-nb
definition: Die möglichst zeitlich begrenzte, gewaltsame Übernahme eines Landes oder einer Region durch den Einmarsch von Militärstreitkräften @de
definition: Ta över kontrollen över ett land eller område med militära medel. @se
definition: Invasion temporaire d'un pays ou d'une région par des forces militaires @fr
definition: The temporary forceful taking over of a country or region by invading military forces
definition: Invasión temporal de un país o de una región por fuerzas militares @es
definition: A invasão forçada temporária de um país ou região por forças militares. @pt-pt
definition: Overtage kontrol over et land eller område med militære midler. @dk
definition: 通过军事力量入侵和暂时强占一个国家或地区 @zh-hans
in scheme: Media Topic
created: 2009-10-22T02:00:00+00:00
modified: 2021-02-18T12:00:00+00:00
broader: armed conflict
broad match: http://cv.iptc.org/newscodes/subjectcode/16000000

war
type: Concept
preferred label: Krieg @de
preferred label: Guerre @fr
preferred label: حرب @ar
preferred label: Krig @se
preferred label: Guerra @es
preferred label: guerra @pt-pt
preferred label: krig @dk
preferred label: 战争 @zh-hans
definition: Hostilidades armadas de un grupo o entidad geopolítica contra otro @es
definition: Hostilités armées d'un groupe ou d'une entité géopolitique contre une autre @fr
definition: Eine formale Feindschaftserklärung des einen Landes gegen ein anderes @de
definition: Armed hostilities by one group or geopolitical entity against another
definition: Tillstånd av väpnad kamp i stor skala mellan nationer eller andra geopolitiska entiteter. @se
definition: Declaração formal de hostilidades de um país a outro. @pt-pt
definition: Tilstand med væbnet kamp i stor skala mellem nationer eller andre geopolitiske enheder. @dk
definition: 一集团或地缘政治实体对另一集团或地缘政治实体的武装敌对行动 @zh-hans
in scheme: Media Topic
created: 2009-10-22T02:00:00+00:00
modified: 2021-02-18T12:00:00+00:00
broader: armed conflict
narrower: civil war
narrower: war crime action

peacekeeping force
type: Concept
preferred label: Fredsbevarande styrkor @se
preferred label: Friedenstruppe @de
preferred label: قوة حفظ السلام @ar
preferred label: Forces de maintien de la paix @fr
preferred label: Fuerza de paz @es
preferred label: força de paz @pt-pt
preferred label: fredsbevarende styrke @dk
preferred label: 维和部队 @zh-hans
preferred label: fredsstyrke @no-nb
definition: The military forces of a nation, or of several nations working together, whose mission is to maintain peace in areas of conflict
definition: Militära trupper från olika länder som under ett samlande internationellt styre upprätthåller freden i konfliktområden. @se
definition: Fuerzas militares de una nación, o de naciones colaborando juntas, cuya misión es mantener la paz en áreas de conflicto @es
definition: Militärstreitkräfte eines Landes oder mehrerer Länder, deren Aufgabe es ist, sich für den Frieden in einem Gebiet einzusetzen @de
definition: Forces militaires d'une nation, ou de plusieurs nations travaillant ensemble, dont la mission est de maintenir la paix dans des zones de conflit @fr
definition: Forças militares de diferentes nacionalidades agrupadas sob comando internacional para manter a ordem em áreas de conflito. @pt-pt
definition: Militære tropper fra forskellige lande, der under en samlet international organisation eller samarbejde opretholder fred i konfliktområder. @dk
definition: 由一个国家或几个国家的军事力量组成，其任务是在冲突地区维持和平 @zh-hans
in scheme: Media Topic
created: 2009-10-22T02:00:00+00:00
modified: 2024-03-28T12:00:00+00:00
broader: peace process

missing in action
type: Concept
preferred label: Kriegsvermisste @de
preferred label: Disparus au combat @fr
preferred label: Saknad i krig @se
preferred label: مفقودون في الحرب @ar
preferred label: Desaparecido en acción @es
preferred label: desaparecidos em combate @pt-pt
preferred label: savnet i kamp @dk
preferred label: 战争失踪人员 @zh-hans
preferred label: savnet i krig @no-nb
preferred label: sakna i krig @no-nn
definition: Personer, både civila och militära, som saknas under och efter ett krig. @se
definition: Civilians or military personnel who have gone missing during or after hostilities, conflicts or war
definition: Civils ou militaires qui ont disparu pendant ou après les hostilités, les conflits ou la guerre @fr
definition: Civiles o militares que desaparecieron durante o después de las hostilidades, conflictos o guerra @es
definition: Zivilisten und Soldaten, die nach Feindseligkeiten, einem Konflikt oder einer kriegerischen Auseinandersetzung vermisst werden @de
definition: Pessoas, civis e militares, desaparecidas durante ou após conflitos, guerras ou hostilidades. @pt-pt
definition: Mennesker, både civile og militære, der er savnet under og efter en krig. @dk
definition: 在敌对行动、冲突或战争期间或之后失踪的平民或军事人员 @zh-hans
in scheme: Media Topic
created: 2009-10-22T02:00:00+00:00
modified: 2024-07-01T12:00:00+00:00
broader: war victims

civil war
type: Concept
preferred label: Guerre civile @fr
preferred label: Guerra civil @es
preferred label: Bürgerkrieg @de
preferred label: Inbördeskrig @se
preferred label: حرب اهلية @ar
preferred label: guerra civil @pt-pt
preferred label: borgerkrig @dk
preferred label: 国内战争 @zh-hans
preferred label: borgarkrig @no-nn
definition: Krig mellan olika grupper inom en och samma nation, ibland med målet att dela landet. @se
definition: Conflicto armado entre miembros de un mismo país, en algunos casos para dividir el país @es
definition: Conflit armé entre membres d'un même pays, dans certains cas dans le but de diviser le pays @fr
definition: Armed conflict between members of the same country, in some cases with the goal of dividing the country
definition: Bewaffnete Auseinandersetzung zwischen den Bewohnern eines Landes oder einer seiner Regionen, in einigen Fällen mit dem Ziel deren Aufteilung @de
definition: Conflito armado entre membros de um país ou de uma região geográfica, em alguns casos com intenção de causar a divisão do país ou da região. @pt-pt
definition: Krig mellem forskellige grupper inden for samme nation, undertiden med målet om at dele landet. @dk
definition: 同一国家各派别之间的武装冲突，在某些情况下是为了分裂国家 @zh-hans
in scheme: Media Topic
created: 2009-10-22T02:00:00+00:00
modified: 2021-02-18T12:00:00+00:00
broader: war

war crime action
type: Concept
preferred label: Crimen de guerra @es
preferred label: Kriegsverbrechen @de
preferred label: Crime de guerre @fr
preferred label: Krigsbrott @se
preferred label: جريمة حرب @ar
preferred label: crimes de guerra @pt-pt
preferred label: krigsforbrydelse @dk
preferred label: 战争犯罪行为 @zh-hans
preferred label: krigsforbrytelse @no-nb
preferred label: krigsbrotsverk @no-nn
definition: Actions alleged as crimes committed during a war or armed conflict, usually against civilians or POWs
definition: Svåra överträdelser av krigets lagar, exempelvis genom användning av förbjudna vapen, order om eller deltagande i tortyr eller annan svår misshandel av krigsfångar eller civila. @se
definition: Kriminelle Handlungen und deren Strafverfolgung, die während eines Krieges oder bewaffneten Konfliktes begangen werden, gewöhnlich gegen Zivilisten oder Kriegsgefangene @de
definition: Crimes cometidos durante uma guerra ou conflito armado, geralmente contra civis ou prisioneiros de guerra. @pt-pt
definition: Alvorlige krænkelser af krigslovene, for eksempel gennem brug af forbudte våben, ordrer om eller deltagelse i tortur eller andet alvorligt overgreb på krigsfanger eller civile. @dk
definition: 指在战争或武装冲突中犯下的罪行，通常针对平民或战俘 @zh-hans
change note: 2016-04-05: As two concepts with very similar definitions exist this concept (medtop:20000064) was retired and it is recommended to use war crime (medtop:20000105)
in scheme: Media Topic
created: 2009-10-22T02:00:00+00:00
retired: 2016-04-05T12:00:00+00:00
modified: 2021-05-05T12:00:00+00:00
broader: war

protests and demonstrations
type: Concept
preferred label: تظاهرة @ar
preferred label: Demonstrationer och protester @se
preferred label: Demonstration @de
preferred label: Manifestaciones @es
preferred label: Manifestation @fr
preferred label: manifestação @pt-pt
preferred label: demonstration @dk
preferred label: 示威游行 @zh-hans
preferred label: demonstrasjoner @no-nb
preferred label: demonstrasjonar @no-nn
definition: Manifestation publique non-violente de soutien ou d'opposition à une cause, une idée ou une politique, sous la forme d'une réunion de masse ou d'une marche @fr
definition: A non-violent public show of support for or opposition to a cause, idea or policy, in the form of a mass meeting or march
definition: Offentlig kollektiv meningsyttring, särskilt i form av massmarsch med slagord på plakat och banderoller. @se
definition: Demostración pública no violenta de apoyo u oposición a una causa, idea o política en la forma de una reunión masiva o marcha @es
definition: Gewaltfrei und öffentlich geäußerte Kritik an einer Sache, Idee oder Politik in Form einer Massenveranstaltung. @de
definition: Demonstração pública de sentimentos ou opiniões através de concentrações ou marchas de caráter político e/ou social. @pt-pt
definition: Offentlig kollektiv meningstilkendegivelse i form af en masseforsamling og/eller march med slagord på plakater og bannere. @dk
definition: 以群众集会或游行的形式，非暴力地公开表示对某一主张、思想或政策的支持或反对 @zh-hans
in scheme: Media Topic
created: 2009-10-22T02:00:00+00:00
modified: 2026-07-02T12:00:00+00:00
broader: civil unrest

rebellion
type: Concept
preferred label: Rébellion @fr
preferred label: Rebellion @de
preferred label: Uppror @se
preferred label: تمرد @ar
preferred label: Rebelión @es
preferred label: rebeliões @pt-pt
preferred label: oprør @dk
preferred label: 叛乱 @zh-hans
preferred label: opprør @no-nb
definition: Acciones de oposición a un gobierno o partido gobernante, frecuentamente violentas, organizadas por los residentes de una nación con el objetivo de derrocar al gobierno @es
definition: Actions d'opposition à un gouvernement ou à un parti au pouvoir, souvent violentes, organisées par les résidents d'une nation dans le but de renverser le gouvernement @fr
definition: Organisierte Aktionen zum Widerspruch gegen eine Regierung oder regierende Partei durch die Bewohner eines Landes, oft gewalttätig und mit dem Ziel eines Regierungsumsturzes @de
definition: Organized actions of opposition to a government or ruling party by a country's residents, often violent and with the aim of overthrowing the government
definition: Organiserat angrepp mot statsmakten av någon grupp i samma land med syfte att störta regeringen och ändra det politiska systemet. @se
definition: Ações organizadas de oposição a um governo ou partido governante pelos cidadãos de um país, muitas vezes com violência e com a intenção de derrubar o governo. @pt-pt
definition: Organiseret angreb på statsmagten af en gruppe i det samme land, ofte voldeligt og med det formål at vælte regeringen og ændre det politiske system. @dk
definition: 由一个国家的居民组织起来的反对政府或执政党的行动，通常是暴力的，目的是推翻政府 @zh-hans
in scheme: Media Topic
created: 2009-10-22T02:00:00+00:00
modified: 2021-02-18T12:00:00+00:00
broader: civil unrest

revolution
type: Concept
preferred label: ثورة @ar
preferred label: Revolution @de
preferred label: Révolution @fr
preferred label: Revoluciones @es
preferred label: revoluções @pt-pt
preferred label: 革命 @zh-hans
preferred label: revolusjon @no-nb
definition: A forcible and often violent change to, or overthrow of, a country's political system or social order by internal forces, in favour of a new system
definition: Changement par la force et souvent violent, ou renversement, du système de gouvernement ou de l'ordre social d'un pays par des forces internes, en faveur d'un nouveau système @fr
definition: Större, väpnad, organiserad omstörtning av det bestående samhället. @se
definition: Ein oft gewalttätiger Wechsel oder Umsturz der Regierung eines Landes oder von dessen politischen System durch Kräfte aus dem Land um ein neues System durchzusetzen. @de
definition: Un cambio por la fuerza y a menudo violento, o un derrocamiento del sistema de gobierno o del orden social de un país, por parte de fuerzas internas, en favor de un nuevo sistema @es
definition: Alteração por vezes violenta do sistema governativo de um país, feita por forças internas que provocam mudanças sociais sistemáticas. @pt-pt
definition: Større, væbnet og organiseret omstyrtning af det eksisterende samfund. @dk
definition: 内部势力为支持一种新制度而强行改变或推翻一个国家的政治制度或社会秩序，这种改变通常是暴力的 @zh-hans
definition: A forcible and often violent change to, or overthrow of, a country's political system or social order by internal forces, in favor of a new system
in scheme: Media Topic
created: 2009-10-22T02:00:00+00:00
modified: 2021-02-18T12:00:00+00:00
broader: civil unrest

riot
type: Concept
preferred label: Disturbios @es
preferred label: شغب @ar
preferred label: Upplopp @se
preferred label: Ausschreitung @de
preferred label: Emeutes @fr
preferred label: motins @pt-pt
preferred label: optøjer @dk
preferred label: 暴乱 @zh-hans
preferred label: opptøyer @no-nb
preferred label: opptøyar @no-nn
definition: Gewalttätige, zerstörerische Aktionen des zivilen Ungehorsams durch Personengruppen, oft in Reaktion auf einen Missstand oder als aktiver Widerstand, meist mit Verletzungen von Personen verbunden @de
definition: Tillfälligt våldsamt uppträdande av folkmassa utanför myndigheternas kontroll. @se
definition: Eventos violentos y destructivos de desorden civil por grupos de personas, por lo general en respuesta a un agravio o como actos de oposición, causando frecuentamente heridas a personas y destrucción de propiedad @es
definition: Troubles de l'ordre public provoqués par des groupes de personnes, en réponse à un grief ou pour faire acte d'opposition, provoquant souvent des violences, des blessures et des destructions de biens @fr
definition: Violent, destructive events of civil disorder by groups of people, usually in response to a grievance or as acts of opposition, often involving injury to individuals and destruction of property
definition: Manifestações violentas e destrutivas de desordem civil, frequentemente envolvendo feridos e destruição de propriedade. @pt-pt
definition: Midlertidig voldelig opførsel af menneskegrupper uden for myndighedernes kontrol. @dk
definition: 由一群人制造的暴力的、破坏性的公众骚乱事件，通常是为发泄不满和表示抗议，常常造成对个人的伤害和财产的破坏 @zh-hans
in scheme: Media Topic
created: 2009-10-22T02:00:00+00:00
modified: 2021-02-18T12:00:00+00:00
broader: civil unrest

genocide
type: Concept
preferred label: Genocidio @es
preferred label: Völkermord @de
preferred label: Génocide @fr
preferred label: ابادة @ar
preferred label: Folkmord @se
preferred label: genocídio @pt-pt
preferred label: folkedrab @dk
preferred label: 种族灭绝 @zh-hans
preferred label: folkemord @no-nb
definition: The systematic killing of one clan, tribe, or religious or ethnic group by another
definition: Systematisches Töten einer Glaubensgemeinschaft, eines Volkstammes oder einer ethnischen Gruppe durch eine andere @de
definition: Systematiskt dödande av en folkgrupp eller delar av en folkgrupp. @se
definition: Asesinato sistemático de un clan, tribu o grupo religioso o étnico @es
definition: Assassinat systématique d'un clan, d'une tribu ou d'un groupe religieux ou ethnique @fr
definition: Morte sistemática de clã, tribo ou grupo étnico por outro. @pt-pt
definition: Systematisk drab på en folkegruppe eller dele af en folkegruppe. @dk
definition: 有组织地杀害一个氏族、部落、宗教或民族的行为 @zh-hans
in scheme: Media Topic
created: 2009-10-22T02:00:00+00:00
modified: 2024-03-28T12:00:00+00:00
broader: crime

peace envoy
type: Concept
preferred label: Enviado de paz @es
preferred label: Fredsmäklare @se
preferred label: موفد سلام @ar
preferred label: Friedensverhandlung @de
preferred label: Émissaire de la paix @fr
preferred label: enviado de paz @pt-pt
preferred label: fredsmægler @dk
preferred label: 和平特使 @zh-hans
preferred label: fredsmegler @no-nb
preferred label: fredsmeklar @no-nn
definition: Person eller organisation som initierar och genomför en fredsprocess. @se
definition: Persona u organización que inicia y lidera un proceso de paz @es
definition: Person or organisation initiating and carrying out a peace process
definition: Personne ou organisation initiant et menant un processus de paix @fr
definition: Person oder Organisation, die einen Friedensprozess einleitet und begleitet @de
definition: Pessoa ou organização que inicia ou desenvolve um processo de paz. @pt-pt
definition: Person eller organisation, der initierer og implementerer en fredsproces. @dk
definition: 发起并执行和平进程的个人或组织 @zh-hans
definition: Person or organization initiating and carrying out a peace process
in scheme: Media Topic
created: 2009-10-22T02:00:00+00:00
modified: 2021-07-12T12:00:00+00:00
broader: peace process
broad match: http://cv.iptc.org/newscodes/subjectcode/11002003

peace plan
type: Concept
preferred label: Plan de paz @es
preferred label: خطة سلام @ar
preferred label: Friedensplan @de
preferred label: Plan de paix @fr
preferred label: Fredsplan @se
preferred label: plano de paz @pt-pt
preferred label: fredsplan @dk
preferred label: 和平计划 @zh-hans
definition: Estrategia para lograr la paz en una nación beligerante o en una zona de conflicto @es
definition: En strategi för att uppnå fred i ett krigs- eller konfliktområde. @se
definition: Stratégie pour parvenir à la paix dans une nation belligérante ou dans une zone de conflit @fr
definition: A strategy for achieving peace in a warring nation or area of conflict
definition: Eine Strategie um Frieden wiederherzustellen in einem Kriegs- oder Konfliktgebiet @de
definition: Uma estratégia para atingir a paz numa nação em guerra ou área em conflito. @pt-pt
definition: En strategi for at opnå fred i et krigs- eller konfliktområde. @dk
definition: 在交战国家或冲突地区实现和平的计划 @zh-hans
in scheme: Media Topic
created: 2009-10-22T02:00:00+00:00
modified: 2021-02-18T12:00:00+00:00
broader: peace process
broad match: http://cv.iptc.org/newscodes/subjectcode/11002003

peace talks
type: Concept
preferred label: Pourparlers de paix @fr
preferred label: Fredssamtal @se
preferred label: Negociaciones de paz @es
preferred label: محادثات سلام @ar
preferred label: Friedensgespräche @de
preferred label: conversações de paz @pt-pt
preferred label: fredsforhandling @dk
preferred label: 和平谈判 @zh-hans
definition: Diskussioner mellan länder, regioner eller geopolitiska entiteter i krig eller konflikt, ofta med en medlare, med målet att uppnå en lösning som leder till fred. @se
definition: Discusiones entre países, regiones del mundo o entidades geopolíticas en conflicto o en guerra, a menudo conducidas con un mediador, con el objetivo de alcanzar una solución de paz @es
definition: Discussions entre pays, régions du monde ou entités géopolitiques en conflit ou en guerre, souvent menées avec un médiateur, dans le but d'arriver à une solution pour la paix @fr
definition: Discussions between countries, world regions or geopolitical entities in conflict or at war, often with a mediator, with the goal of arriving at a solution for peace
definition: Gespräche zwischen Ländern, und Weltregionen die miteinander im Konflikt oder Krieg sind, um wieder Frieden zu erreichen @de
definition: Discussões entre países, regiões ou entidades geopolíticas em conflito ou em guerra, muitas vezes com um mediador, com o objetivo de chegar a uma solução para a paz. @pt-pt
definition: Drøftelser mellem lande, regioner eller geopolitiske enheder i krig eller konflikt, ofte med en mægler, hvor målet er at nå en løsning, der fører til fred. @dk
definition: 冲突或战争中的国家、世界区域或地缘政治实体之间的讨论，通常由调解员主持，目的是达成和平的解决方案，简称和谈 @zh-hans
in scheme: Media Topic
created: 2009-10-22T02:00:00+00:00
modified: 2021-05-05T12:00:00+00:00
broader: peace process
broad match: http://cv.iptc.org/newscodes/subjectcode/11002003

disarmament
type: Concept
preferred label: نزع اسلحة @ar
preferred label: Desarme @es
preferred label: Désarmement @fr
preferred label: Nedrustning @se
preferred label: Abrüstung @de
preferred label: desarmamento @pt-pt
preferred label: nedrustning @dk
preferred label: 裁军 @zh-hans
preferred label: nedrusting @no-nn
definition: Réduction ou destruction de la cache d'armes militaires d'une nation @fr
definition: Göra slut på eller dra ned på ett lands vapenarsenal. @se
definition: Reducción o destrucción de armas militares de una nación @es
definition: The abolishment or reduction of a country's military weapons cache
definition: Die Abschaffung oder Reduzierung des Bestandes an militärischen Waffen eines Landes @de
definition: A abolição ou redução da provisão de armas militares de um país. @pt-pt
definition: Nedlægge eller nedtrappe et lands våbenarsenal. @dk
definition: 裁减一国的军事力量和武器装备 @zh-hans
in scheme: Media Topic
created: 2009-10-22T02:00:00+00:00
modified: 2024-03-28T12:00:00+00:00
broader: peace process
broad match: http://cv.iptc.org/newscodes/subjectcode/11002000

ordnance clearance
type: Concept
preferred label: ازالة الغام @ar
preferred label: Minröjning/Röjning av krigsmateriel @se
preferred label: Desminado @es
preferred label: Déminage @fr
preferred label: Kampfmittelbeseitigung @de
preferred label: neutralização de material bélico @pt-pt
preferred label: ammunitionsrydning @dk
preferred label: 军火清理 @zh-hans
preferred label: rydding av miner/bomber/eksplosiver @no-nb
preferred label: rydding av miner/bomber/eksplosiv @no-nn
definition: Das Entfernen oder Entschärfen von Waffen, wie Landminen oder Streubomben, die nach einem Krieg oder bewaffneten Konflikt auf öffentlichem Grund noch vorhanden sind. @de
definition: Remoción o inhabilitación de municiones tales como minas antipersonal o bombas de racimo que pueden permanecer después de una guerra o conflicto armado en terreno público @es
definition: The removal or neutralisation of ordnance such as landmines or cluster bombs that may remain after a war or armed conflict on public ground
definition: Borttagande eller neutraliserande av minor och klusterbomber efter ett krig eller en konflikt. @se
definition: Enlèvement ou neutralisation de munitions telles que les mines antipersonnel ou les bombes à sous-munitions qui peuvent subsister après une guerre ou un conflit armé sur un terrain public @fr
definition: Remoção ou neutralização de elementos que permanecem ativos após o fim de guerras ou conflitos armados, como minas terrestres ou bombas de fragmentação. @pt-pt
definition: Fjernelse eller neutralisering af miner og klyngebomber efter en krig eller konflikt. @dk
definition: 清除战争或武装冲突后可能留在地面上的军械，如地雷或集束炸弹 @zh-hans
definition: The removal or neutralization of ordnance such as landmines or cluster bombs that may remain after a war or armed conflict on public ground
in scheme: Media Topic
created: 2009-10-22T02:00:00+00:00
modified: 2021-02-18T12:00:00+00:00
broader: post-war reconstruction

prisoners of war
type: Concept
preferred label: Krigsfångar @se
preferred label: Prisonniers de guerre @fr
preferred label: Prisioneros de guerra @es
preferred label: Kriegsgefangene @de
preferred label: سجناء ومعتقلون @ar
preferred label: prisioneiros de guerra @pt-pt
preferred label: krigsfange @dk
preferred label: 战俘 @zh-hans
preferred label: krigsfanger @no-nb
preferred label: krigsfangar @no-nn
definition: Personas capturadas, encarceladas o detenidas por facciones enemigas durante conflictos militares o guerras @es
definition: Individus capturés, emprisonnés ou détenus par des factions ennemies pendant les conflits militaires ou la guerre @fr
definition: Individuals captured, imprisoned or detained by enemy factions during military conflicts or war
definition: Personer som har blivit tillfångatagna och fängslade under krig. @se
definition: Menschen, die während eines Krieges oder eines bewaffneten Konflikts von den Gegnern gefangen gehalten werden @de
definition: As pessoas capturadas e presas pelo inimigo durante guerras e conflitos armados. @pt-pt
definition: Et menneske, der er blevet fanget og frihedsberøvet under krig. @dk
definition: 在军事冲突或战争中被敌方俘虏、囚禁或关押的人员 @zh-hans
in scheme: Media Topic
created: 2009-10-22T02:00:00+00:00
modified: 2024-03-28T12:00:00+00:00
broader: war victims

arson
type: Concept
preferred label: Anlagd brand @se
preferred label: Incendio premeditado @es
preferred label: Brandstiftung @de
preferred label: Incendie volontaire @fr
preferred label: حريق متعمد @ar
preferred label: fogo posto @pt-pt
preferred label: incêndio criminoso @pt-br
preferred label: forsætlig brandstiftelse @dk
preferred label: 纵火 @zh-hans
preferred label: brannstiftelse @no-nb
preferred label: eldspåsetjing @no-nn
definition: Att medvetet tända eld på något som man inte har rätt att elda upp. @se
definition: Absichtliches in Brand stecken mit krimineller Intention @de
definition: The intentional setting of fires with criminal intent
definition: Incêndio intencional, de origem criminosa. @pt-pt
definition: Med forsættelighed at brænde noget af, som man ikke har ret til. @dk
definition: 故意放火或恶意烧毁建筑、财产等 @zh-hans
in scheme: Media Topic
created: 2009-10-22T02:00:00+00:00
modified: 2021-02-18T12:00:00+00:00
broader: crime

assault
type: Concept
preferred label: Agression @fr
preferred label: Agresión @es
preferred label: اعتداء @ar
preferred label: Gewalt @de
preferred label: Överfall @se
preferred label: assalto @pt-pt
preferred label: overfald @dk
preferred label: 攻击 @zh-hans
preferred label: vold @no-nb
preferred label: vald @no-nn
definition: Alla former av fysiskt våld mot en eller flera personer. @se
definition: Physical crime against a person, including battery, brawls and threat of bodily harm
definition: Körperverletzung von Personen, Prügeleien, Streit und bedrohliches Verhalten @de
definition: Agressão física, briga, rixa e comportamento ameaçador. @pt-pt
definition: Alle former for fysisk vold mod en eller flere personer. @dk
definition: 对人身的侵犯，包括殴打、斗殴和人身伤害威胁 @zh-hans
in scheme: Media Topic
created: 2009-10-22T02:00:00+00:00
modified: 2021-02-18T12:00:00+00:00
broader: crime
narrower: sex crime

cyber crime
type: Concept
preferred label: Piratage informatique @fr
preferred label: Computerkriminalität @de
preferred label: جريمة معلوماتية @ar
preferred label: IT-brott @se
preferred label: Delitos informáticos @es
preferred label: cibercrime @pt-pt
preferred label: cyberkriminalitet @dk
preferred label: 网络犯罪 @zh-hans
preferred label: nettkriminalitet @no-nb
definition: Diebstahl oder zerstörerisches Verhalten mithilfe eines Computers @de
definition: Brottslig aktivitet som främst utförs genom att använda datorer och/eller internet, t ex hacking, phising och identitetsstölder. @se
definition: Criminal activities carried out by means of computers or the internet, such as hacking, phishing scams and identity theft
definition: Atividades criminosas cometidas através de computadores ou através da Internet, como hacking, roubo de entidade ou phishing. @pt-pt
definition: Kriminel aktivitet, der primært udføres ved hjælp af computere og/eller internettet, for eksempel hacking, phishing og identitetstyveri. @dk
definition: 利用计算机或互联网进行的犯罪活动，如黑客、网络钓鱼欺诈和身份盗窃 @zh-hans
in scheme: Media Topic
created: 2009-10-22T02:00:00+00:00
modified: 2023-03-31T12:00:00+00:00
broader: crime

corporate crime
type: Concept
preferred label: جريمة منظمة @ar
preferred label: Délinquance financière @fr
preferred label: Delitos corporativos @es
preferred label: Firmenkriminalität @de
preferred label: Ekobrott @se
preferred label: crime económico @pt-pt
preferred label: crime econômico @pt-br
preferred label: økonomisk kriminalitet @dk
preferred label: 法人犯罪 @zh-hans
definition: Crimes committed by a corporation or by individuals acting on behalf of a corporation
definition: Untaten von Unternehmen oder Geschäftsführungen @de
definition: När ett företag, eller personer som representerar ett företag, begår ett brott. @se
definition: Delitos cometidos por empresas e pelos seus responsáveis. @pt-pt
definition: Delitos cometidos por empresas e por seus responsáveis. @pt-br
definition: En forbrydelse, der er begået af en virksomhed eller personer, der repræsenterer virksomheden. @dk
definition: 公司或代表公司行事的个人所犯的罪行 @zh-hans
in scheme: Media Topic
created: 2009-10-22T02:00:00+00:00
modified: 2021-02-18T12:00:00+00:00
broader: crime
narrower: anti-trust crime
narrower: breach of contract
narrower: embezzlement
narrower: insider trading
narrower: restraint of trade
narrower: accounting crime

corruption
type: Concept
preferred label: Corruption @fr
preferred label: Corrupción @es
preferred label: Korruption @de
preferred label: فساد @ar
preferred label: corrupção @pt-pt
preferred label: korruption @dk
preferred label: 腐败 @zh-hans
preferred label: korrupsjon @no-nb
definition: Generelles Missverhalten in Geschäftsbeziehungen @de
definition: Olagliga handlingar av en eller flera personer som utnyttjar sin position i utbyte mot pengar eller annan form av ersättning. @se
definition: Dishonest actions by a person in power in return for pecuniary or personal gain
definition: Comportamento desonesto por alguém no poder em troca de ganho pecuniário ou pessoal. @pt-pt
definition: Ulovlige handlinger udført af en eller flere personer, der udnytter deres position til at modtage penge eller anden form for personlig vinding. @dk
definition: 当权者为获取金钱或个人利益而采取的不诚实行为 @zh-hans
in scheme: Media Topic
created: 2009-10-22T02:00:00+00:00
modified: 2021-02-18T12:00:00+00:00
broader: crime
narrower: bribery

drug related crimes
type: Concept
preferred label: جرائم مخدرات @ar
preferred label: Drogenkriminalität @de
preferred label: Crímenes relacionados con las drogas @es
preferred label: Narkotikabrott @se
preferred label: Crimes liés aux stupéfiants @fr
preferred label: crimes relacionados com drogas @pt-pt
preferred label: narkokriminalitet @dk
preferred label: 毒品犯罪 @zh-hans
preferred label: narkotikalovbrudd @no-nb
preferred label: narkotikalovbrot @no-nn
definition: Alle Arten von Kriminalität im Zusammenhang mit Drogen @de
definition: Illegal activities involving illicit substances, including buying, distribution, selling and smuggling
definition: Aktiviteter som bryter mot lagar kring hantering av narkotiska preparat och utrustning. @se
definition: Atividades ilegais que envolvem substâncias ilícitas, incluindo a compra, a distribuição, a venda e o tráfego. @pt-pt
definition: Aktiviteter, der overtræder love om håndtering af narkotiske stoffer og udstyr. @dk
definition: 涉及违禁药品的非法活动，包括购买、分销、售卖和走私 @zh-hans
in scheme: Media Topic
created: 2009-10-22T02:00:00+00:00
modified: 2021-02-18T12:00:00+00:00
broader: crime
narrower: drug trafficking
broad match: http://cv.iptc.org/newscodes/subjectcode/02001000

fraud
type: Concept
preferred label: احتيال @ar
preferred label: Bedrägeri @se
preferred label: Fraude @fr
preferred label: Betrug @de
preferred label: fraude @pt-pt
preferred label: bedrageri @dk
preferred label: 欺诈 @zh-hans
definition: Intentional deception for personal or financial gain
definition: Planerade aktiviteter för att lura till sig pengar eller värdesaker från andra personer, företag eller organisationer. @se
definition: Absichtliche Täuschung, die die Rechte und das Eigentum anderer beschädigen @de
definition: Engano intencional para ganho pessoa ou financeiro. @pt-pt
definition: Planlagte aktiviteter for at bedrage penge eller værdigenstande fra andre mennesker, virksomheder eller organisationer. @dk
definition: 为个人或经济利益而故意欺骗 @zh-hans
in scheme: Media Topic
created: 2009-10-22T02:00:00+00:00
modified: 2021-02-18T12:00:00+00:00
broader: crime
narrower: tax evasion

hijacking
type: Concept
preferred label: قرصنة @ar
preferred label: Entführung @de
preferred label: Secuestro / piratería @es
preferred label: Kapning @se
preferred label: Détournement @fr
preferred label: kapring @dk
preferred label: 劫持 @zh-hans
definition: Taking over a transportation vehicle by force
definition: Übernahme eines Transportfahrzeuges mit Gewalt @de
definition: Att med våld ta över någon form av transportfordon. @se
definition: Captura forçada de um veículo de transporte. @pt-pt
definition: Overtagelse af transportmiddel ved tvang. @dk
definition: 强行接管交通工具 @zh-hans
in scheme: Media Topic
created: 2009-10-22T02:00:00+00:00
modified: 2021-02-18T12:00:00+00:00
broader: crime
broad match: http://cv.iptc.org/newscodes/subjectcode/02001000

homicide
type: Concept
preferred label: قتل @ar
preferred label: Homicide @fr
preferred label: Mord @de
preferred label: Homicidio @es
preferred label: Dråp @se
preferred label: homicídio @pt-pt
preferred label: drab @dk
preferred label: 凶杀 @zh-hans
preferred label: drap @no-nb
definition: Att döda en annan person. @se
definition: Tod eines Menschen durch einen anderen @de
definition: The killing of one person by another, including murder and manslaughter
definition: Morte de uma pessoa cometida por outra(s). @pt-pt
definition: Drab på en anden person. @dk
definition: 一个人被另一个人杀死，包括谋杀和误杀 @zh-hans
in scheme: Media Topic
created: 2009-10-22T02:00:00+00:00
modified: 2021-03-31T12:00:00+00:00
broader: crime

kidnapping
type: Concept
preferred label: Enlèvement @fr
preferred label: Geiselnahme @de
preferred label: خطف @ar
preferred label: Secuestro @es
preferred label: Kidnappning @se
preferred label: rapto @pt-pt
preferred label: kidnapning @dk
preferred label: 绑架 @zh-hans
preferred label: bortføring @no-nb
definition: Att tvinga med sig en annan person mot dess vilja, hålla den personen fången. @se
definition: Jemanden gegen seinen Willen widerrechtlich und gewaltsam gefangen nehmen, festhalten oder verschleppen @de
definition: To seize and detain a person against that person's will by unlawful threat, force or fraud
definition: Levar ou capturar e deter alguém contra a sua vontade, mediante ameaças ilegais, força ou fraude. @pt-pt
definition: Levar ou capturar e deter alguém contra sua vontade, mediante ameaças ilegais, força ou fraude. @pt-br
definition: Tilfangetagelse og tilbageholdelse af en anden person mod dennes vilje ved brug af trusler og magt. @dk
definition: 以非法威胁、武力或欺诈手段，将违反其意愿的人扣押和拘留 @zh-hans
in scheme: Media Topic
created: 2009-10-22T02:00:00+00:00
modified: 2021-02-18T12:00:00+00:00
broader: crime

organised crime
type: Concept
preferred label: Crimen organizado @es
preferred label: Organiserad brottslighet @se
preferred label: جريمة منظمة @ar
preferred label: Organisierte Kriminalität @de
preferred label: Crime organisé @fr
preferred label: crime organizado @pt-pt
preferred label: organiseret kriminalitet @dk
preferred label: 有组织犯罪 @zh-hans
preferred label: organisert kriminalitet @no-nb
preferred label: organized crime
definition: Kriminelle Handlungen, die von Banden oder kriminellen Gruppen begangen wurden @de
definition: Planerad brottslighet som utförs av en samling kriminella i grupp, exempelvis maffia. @se
definition: Crimes committed by gangs or criminal organizations, such as the mafia
definition: Crimes cometidos por gangues ou grupos criminosos, como a máfia. @pt-pt
definition: Planlagt kriminalitet udført af kriminelle i en gruppe, for eksempel mafiaen. @dk
definition: 如黑手党等犯罪集团或犯罪组织所犯的罪行 @zh-hans
in scheme: Media Topic
created: 2009-10-22T02:00:00+00:00
modified: 2021-02-18T12:00:00+00:00
broader: crime
narrower: gang activity

terrorism
type: Concept
preferred label: Terrorismo @es
preferred label: Terrorism @se
preferred label: Terrorismus @de
preferred label: ارهاب @ar
preferred label: Terrorisme @fr
preferred label: terrorismo @pt-pt
preferred label: terrorisme @dk
preferred label: 恐怖主义 @zh-hans
definition: Violence against people to create fear in order to achieve political or ideological objectives
definition: Gewalt gegen Menschen, um Angst auszulösen mit der Absicht bestimmte politische oder ideologische Ziele zu erreichen @de
definition: Våld som är ägnat att skrämma många fler än de som direkt drabbas och med syfta att nå politiska eller ideologiska mål. @se
definition: Violência contra as pessoas para criar medo e alcançar objetivos políticos ou ideológicos. @pt-pt
definition: Vold, der bruges til at skræmme store dele af en befolkning og sigter mod at nå politiske eller ideologiske mål. @dk
definition: 为达成政治或意识形态目的而对人群使用暴力制造恐惧的行为 @zh-hans
in scheme: Media Topic
created: 2009-10-22T02:00:00+00:00
modified: 2021-02-18T12:00:00+00:00
broader: crime

robbery and theft
type: Concept
preferred label: سرقة @ar
preferred label: Stöld @se
preferred label: Robo @es
preferred label: Diebstahl @de
preferred label: Vol @fr
preferred label: roubo @pt-pt
preferred label: tyveri @dk
preferred label: 盗窃 @zh-hans
preferred label: tyveri og innbrudd @no-nb
preferred label: tjuveri og innbrot @no-nn
definition: Att olagligt ta någon annans egendom. @se
definition: Ungesetzliche Beschaffung @de
definition: The taking of another person's property without their consent, sometimes by force
definition: Apropriação ilegal. @pt-pt
definition: Ulovlig erhvervelse af en andens ejendom. @dk
definition: 非法占有他人财物的行为 @zh-hans
in scheme: Media Topic
created: 2009-10-22T02:00:00+00:00
modified: 2021-05-05T12:00:00+00:00
broader: crime

war crime
type: Concept
preferred label: Kriegsverbrechen @de
preferred label: جرائم حرب @ar
preferred label: Krigsbrott @se
preferred label: Crimen de guerra @es
preferred label: Crime de guerre @fr
preferred label: crime de guerra @pt-pt
preferred label: krigskriminalitet @dk
preferred label: 战争罪 @zh-hans
preferred label: krigsforbrytelser @no-nb
preferred label: krigsbrotsverk @no-nn
definition: Crimes committed during a war or armed conflict, usually against civilians or prisoners of war, including the prosecution of such crimes
definition: Svåra överträdelser av krigets lagar, exempelvis genom användning av förbjudna vapen, order om eller deltagande i tortyr eller annan svår misshandel av krigsfångar eller civila. @se
definition: Kriminelle Handlungen und deren Strafverfolgung, die während eines Krieges oder bewaffneten Konfliktes begangen werden, gewöhnlich gegen Zivilisten oder Kriegsgefangene @de
definition: Crimes cometidos durante uma guerra ou conflito armado, geralmente contra civis ou prisioneiros de guerra, incluindo o julgamento desses crimes. @pt-pt
definition: Alvorlige krænkelser af krigslovene, ofte overgreb på civile eller krigsfanger, herunder retsforfølgelse af disse forbrydelser. @dk
definition: 在战争或武装冲突中对平民或战俘犯下的罪行，包括对此类罪行的起诉 @zh-hans
in scheme: Media Topic
created: 2009-10-22T02:00:00+00:00
modified: 2024-03-28T12:00:00+00:00
broader: crime

reckless driving
type: Concept
preferred label: Trafikbrott @se
preferred label: infração de trânsito @pt-pt
preferred label: færdselsovertrædelser @dk
preferred label: 野蛮驾驶 @zh-hans
preferred label: trafikklovbrudd @no-nb
preferred label: Verkehrsdelikte @de
preferred label: Conduite dangereuse @fr
preferred label: Conducción peligrosa @es
preferred label: مخالفة مرور @ar
preferred label: trafikklovbrot @no-nn
definition: Serious traffic violations that are likely to, or have led to, the endangerment, injury or death of a person or persons, or the endangerment of or significant property damage
definition: Händelser i trafiken som lett fram till skador, eller kunnat leda fram till skador, där den ansvarige uppträtt brottsligt. Till skillnad från rena olyckshändelser. @se
definition: Infrações rodoviárias graves que possam causar, ou que causaram, possível perigo, ferimento ou morte de pessoa ou pessoas, ou possível perigo ou danos significativos de propriedade. @pt-pt
definition: Ulovlige handlinger i trafikken. @dk
definition: 可能或已导致人身伤亡、财产遭受重大损毁的严重交通违法行为 @zh-hans
definition: Schwere Verkehrsverstöße, die zur Gefährdung, Verletzung oder zum Tod einer Person oder von Personen oder zur Gefährdung oder zu erheblichen Sachschäden führen können oder geführt haben. @de
in scheme: Media Topic
created: 2019-04-06T12:00:00+00:00
modified: 2021-07-12T12:00:00+00:00
broader: crime

human smuggling and trafficking
type: Concept
preferred label: menneskesmugling og trafficking @dk
preferred label: menneskehandel @no-nb
preferred label: Människosmuggling och trafficking @se
preferred label: 偷运及贩卖人口 @zh-hans
preferred label: contrabando e tráfico de pessoas @pt-pt
preferred label: Menschenhandel @de
preferred label: Trafic d'êtres humains @fr
preferred label: Trata de personas @es
preferred label: الاتجار بالبشر @ar
definition: The illegal transporting of people from one country or area to another. When the result is forced labour or sexual exploitation, the crime is considered trafficking.
definition: Ulovlig transport af mennesker over landegrænser. Hvis det sker ufrivilligt, regnes det for trafficking. @dk
definition: Olaglig förflyttning av människor från ett land till ett annat. Om människorna dessutom tvingas till arbete eller utnyttjas sexuellt rubriceras det som trafficking. @se
definition: 将自然人从一国或地区非法运送至另一国或地区的行为。如果涉及强迫劳动或性剥削等犯罪则为贩卖人口 @zh-hans
definition: Transporte ilegal de pessoas de um país ou local para outro. Quando o resultado é trabalho forçado ou exploração sexual, o crime é considerado tráfico. @pt-pt
definition: Die illegale Beförderung von Menschen von einem Land oder Gebiet in ein anderes. Wenn das Ergebnis Zwangsarbeit oder sexuelle Ausbeutung ist, gilt das Verbrechen als Menschenhandel. @de
definition: The illegal transporting of people from one country or area to another. When the result is forced labor or sexual exploitation, the crime is considered trafficking.
in scheme: Media Topic
created: 2019-11-20T12:00:00+00:00
modified: 2021-07-12T12:00:00+00:00
broader: crime

vandalism
type: Concept
preferred label: hærværk @dk
preferred label: hærverk @no-nb
preferred label: Vandalism @se
preferred label: 故意毁坏财物 @zh-hans
preferred label: vandalismo @pt-pt
preferred label: Vandalismus @de
preferred label: Vandalisme @fr
preferred label: Vandalismo @es
preferred label: تخريب @ar
definition: Deliberately damaging or destroying public or private property
definition: Beskadige eller ødelægge offentlig eller privat ejendom med vilje. @dk
definition: Att medvetet förstöra annans egendom. @se
definition: 故意破坏损毁公共或私人财产的行为 @zh-hans
definition: Danificar ou destruir deliberadamente propriedade pública ou privada. @pt-pt
definition: Absichtliches Beschädigen oder Zerstören von öffentlichem oder privatem Eigentum @de
in scheme: Media Topic
created: 2019-11-20T12:00:00+00:00
modified: 2021-07-12T12:00:00+00:00
broader: crime

shootings
type: Concept
preferred label: skyting @no-nb
preferred label: Skjutningar @se
preferred label: skyderi @dk
preferred label: tiroteios @pt-pt
preferred label: 枪击 @zh-hans
preferred label: Schießerei @de
preferred label: Fusillade @fr
preferred label: Tiroteo @es
preferred label: اطلاق نار @ar
definition: An act of violence committed by individuals with the use of armed weapons
definition: Våld där skjutvapen används. @se
definition: Voldelige handlinger, der begås ved hjælp af skydevåben. @dk
definition: Atos de violência cometidos por indivíduos com recurso a armas de fogo. @pt-pt
definition: 个人用枪支等武器实施的暴力行为 @zh-hans
definition: Eine Gewalttat, die von Einzelpersonen unter Verwendung von bewaffneten Waffen begangen wird @de
in scheme: Media Topic
created: 2021-02-18T12:00:00+00:00
modified: 2021-07-12T12:00:00+00:00
broader: crime

animal abuse
type: Concept
preferred label: dyremishandling @no-nb
preferred label: Djurplågeri @se
preferred label: maus-tratos a animais @pt-pt
preferred label: 动物虐待 @zh-hans
preferred label: Tierquälerei @de
preferred label: Maltraitance animale @fr
preferred label: Maltrato animal @es
preferred label: قسوة على الحيوانات @ar
preferred label: dyremishandel @no-nn
definition: The infliction of cruelty or neglect onto animals by humans
definition: Vanvård eller övergrepp mot egna eller andras djur. @se
definition: Mishandling eller misrøgt af dyr. @dk
definition: Comportamento cruel ou negligente imposto por humanos a animais. @pt-pt
definition: 人类施加于动物的残害或忽视行为 @zh-hans
definition: Die Zufügung von Grausamkeit oder Vernachlässigung von Tieren durch Menschen @de
in scheme: Media Topic
created: 2021-02-18T12:00:00+00:00
modified: 2021-07-12T12:00:00+00:00
broader: crime

torture
type: Concept
preferred label: tortur @no-nb
preferred label: Tortyr @se
preferred label: Tortura @es
preferred label: Torture @fr
preferred label: تعذيب @ar
preferred label: Folter @de
definition: Intentionally inflicting severe physical or psychological pain in order to punish the victim or get the victim to take an action or give information
definition: Handlingar som via fysisk och/eller psykisk smärta eller lidande ska förmå det utsatte att erkänna, svara på frågor, utföra handlingar eller liknande. @se
definition: Absichtliche Zufügung schwerer körperlicher oder seelischer Schmerzen, um das Opfer zu bestrafen oder es zu einer Handlung oder Auskunft zu bewegen @de
in scheme: Media Topic
created: 2021-05-05T12:00:00+00:00
modified: 2021-12-21T12:00:00+00:00
broader: crime

sex crime
type: Concept
preferred label: Sexuelle Gewalt @de
preferred label: اعتداء جنسي @ar
preferred label: Agression sexuelle @fr
preferred label: Agresión sexual @es
preferred label: Våldtäkt @se
preferred label: crimes sexuais @pt-pt
preferred label: seksualforbrydelse @dk
preferred label: 性犯罪 @zh-hans
preferred label: seksualforbrytelser @no-nb
preferred label: seksualbrotsverk @no-nn
definition: Sexuellt relaterat våld. @se
definition: Sexual crimes against a person, such as rape, harassment, molestation or groping
definition: Sexuelle Nötigung und Körperverletzung @de
definition: Agressão de natureza sexual cometida contra outra pessoa, como violação, assédio ou molestamento. @pt-pt
definition: Seksuel relateret vold, herunder voldtægt, overgreb, chikane eller befamling. @dk
definition: 对人的性犯罪，如强奸、骚扰、性骚扰或猥亵 @zh-hans
in scheme: Media Topic
created: 2009-10-22T02:00:00+00:00
modified: 2021-02-18T12:00:00+00:00
broader: assault

anti-trust crime
type: Concept
preferred label: Kartellverstoß @de
preferred label: Konkurrensbrott @se
preferred label: Infraction à la concurrence @fr
preferred label: جريمة احتكار @ar
preferred label: Delitos antimonopolio @es
preferred label: crime antitrust @pt-pt
preferred label: crime antitruste @pt-br
preferred label: konkurrencekriminalitet @dk
preferred label: 垄断犯罪 @zh-hans
preferred label: konkurranselovbrudd @no-nb
preferred label: konkurranselovbrot @no-nn
definition: Verletzung von Gesetzen gegen Monopole @de
definition: Violations of laws aimed at corporations to promote fair competition for the benefit of consumers
definition: Åtgärder som bryter mot regler och lagar kring fri konkurrens. @se
definition: Violação das leis contra monopólios. @pt-pt
definition: Overtrædelse af love, der er rettet mod virksomheder for at fremme fair konkurrence til fordel for forbrugerne. @dk
definition: 违反旨在保护消费者利益、促进公平竞争的法律条款的行为 @zh-hans
in scheme: Media Topic
created: 2009-10-22T02:00:00+00:00
modified: 2021-05-05T12:00:00+00:00
broader: corporate crime

breach of contract
type: Concept
preferred label: مخالفة عقد @ar
preferred label: Vertragsbruch @de
preferred label: Avtalsbrott @se
preferred label: Violación de contrato @es
preferred label: Violation de contrat @fr
preferred label: quebra de contrato @pt-pt
preferred label: kontraktbrud @dk
preferred label: 合同违约 @zh-hans
preferred label: kontraktbrudd @no-nb
preferred label: kontraktbrot @no-nn
definition: Brott mot överenskommelser som satts upp i ett kontrakt mellan två eller flera parter. @se
definition: The breaking of terms set in a contractual agreement
definition: Bruch von legalen Verträgen zwischen Unternehmen und mit Kunden @de
definition: Quebra de contratos legais entre companhias ou com clientes. @pt-pt
definition: Overtrædelse af aftaler indgået i en kontrakt mellem to eller flere parter. @dk
definition: 违反合同协议中规定的条款 @zh-hans
in scheme: Media Topic
created: 2009-10-22T02:00:00+00:00
modified: 2021-02-18T12:00:00+00:00
broader: corporate crime

embezzlement
type: Concept
preferred label: اختلاس اموال @ar
preferred label: Malversación @es
preferred label: Förskingring @se
preferred label: Détournement de fonds @fr
preferred label: Unterschlagung @de
preferred label: peculato @pt-pt
preferred label: underslæb @dk
preferred label: 挪用公款 @zh-hans
preferred label: underslag @no-nb
definition: Absichtlicher Diebstahl von anvertrautem Geld @de
definition: Medveten stöld eller felaktig användning av pengar som man satts att sköta för någon uppdragsgivare. @se
definition: The intentional theft or misuse of money left in one's care or belonging to one's employer
definition: Desvio e roubo de dinheiros públicos por quem os tinha a seu cargo. @pt-pt
definition: Roubo intencional de dinheiro deixado a cargo de alguém. @pt-br
definition: Bevidst tyveri eller forkert anvendelse af penge, som forvaltes for enhver klient, eller som tilhører en arbejdsgiver. @dk
definition: 故意盗窃或滥用他人保管或属于雇主的钱财 @zh-hans
in scheme: Media Topic
created: 2009-10-22T02:00:00+00:00
modified: 2021-02-18T12:00:00+00:00
broader: corporate crime

insider trading
type: Concept
preferred label: Tráfico de influencias @es
preferred label: Délit d'initié @fr
preferred label: Insiderhandel @de
preferred label: تعامل داخلي @ar
preferred label: abuso de informação privilegiada @pt-pt
preferred label: insiderhandel @dk
preferred label: 内幕交易 @zh-hans
preferred label: innsidehandel @no-nb
definition: Handel med aktier eller andra värdepapper av personer som har tillgång till information som inte är allmänt känd. @se
definition: Handel mit Aktien durch Personen, die Zugang zu internen und zu dem Zeitpunkt unveröffentlichten Informationen haben @de
definition: Trading of stocks by persons having access to internal information not made public at the time
definition: Compra ou venda de ações por pessoas com acesso a informação interna não divulgada ao público na altura da transação. @pt-pt
definition: Handel med aktier eller andre værdipapirer af personer, som har adgang til fortolige oplysninger. @dk
definition: 利用未公开的内部信息进行股票交易 @zh-hans
in scheme: Media Topic
created: 2009-10-22T02:00:00+00:00
modified: 2021-02-18T12:00:00+00:00
broader: corporate crime

restraint of trade
type: Concept
preferred label: Infraction commerciale @fr
preferred label: Wettbewerbsverstoß @de
preferred label: تقييد التجارة @ar
preferred label: Konkurrensbegränsningar @se
preferred label: Infracción comercial @es
preferred label: restrição ao comércio @pt-pt
preferred label: konkurrencebegrænsning @dk
preferred label: 贸易管制 @zh-hans
preferred label: handelshindring @no-nb
definition: Interference in free competition in business and trade
definition: Eingreifen in den freien Wettbewerb in Markttätigkeit und Handel @de
definition: Avtal eller samarbeten mellan företag eller personer som syftar till att begränsa konkurrensen. @se
definition: Entrave à livre concorrência nos negócios e no comércio. @pt-pt
definition: Aftaler eller partnerskaber mellem virksomheder eller personer, der sigter mod at begrænse konkurrencen. @dk
definition: 对商业和贸易自由竞争的干涉 @zh-hans
in scheme: Media Topic
created: 2009-10-22T02:00:00+00:00
modified: 2021-02-18T12:00:00+00:00
broader: corporate crime

accounting crime
type: Concept
preferred label: Bokföringsbrott @se
preferred label: fraude contabilística @pt-pt
preferred label: fraude contábil @pt-br
preferred label: regnskabskriminalitet @dk
preferred label: 会计犯罪 @zh-hans
preferred label: bedrageri @no-nb
preferred label: Wirtschaftskriminalität @de
preferred label: Fraude comptable @fr
preferred label: Delito contable @es
preferred label: جريمة مالية @ar
definition: The intentional misrepresentation or alteration of accounting records regarding sales, revenues, expenses and other factors
definition: Brottslighet som inbegriper felaktigt förda noteringar om ett företags eller organisations ekonomi. @se
definition: Deturpação intencional ou alteração de registos contabilísticos relativos a vendas, receitas, despesas e outros fatores. @pt-pt
definition: Deturpação intencional ou alteração de registros contábeis relativos a vendas, receitas, despesas e outros fatores. @pt-br
definition: Kriminalitet, der involverer vildledende oplysninger om en virksomheds eller organisations økonomi. @dk
definition: 虚假记录或篡改销售、收入、费用等会计数据的行为 @zh-hans
definition: Die absichtliche Falschdarstellung oder Änderung von Buchhaltungsunterlagen in Bezug auf Verkäufe, Einnahmen, Ausgaben und andere Faktoren. @de
in scheme: Media Topic
created: 2019-04-06T12:00:00+00:00
modified: 2021-07-12T12:00:00+00:00
broader: corporate crime

bribery
type: Concept
preferred label: Subornation de témoins @fr
preferred label: Bestechung @de
preferred label: Mutbrott @se
preferred label: Soborno @es
preferred label: رشوة @ar
preferred label: suborno @pt-pt
preferred label: bestikkelse @dk
preferred label: 贿赂 @zh-hans
preferred label: bestikking @no-nn
definition: The giving of money or favours in order to influence the judgment or conduct of a person in a position of power
definition: Att erbjuda pengar eller annat i utbyte mot tjänster från en person i beslutande ställning. @se
definition: Zahlungen oder Spenden, um den Ausgang einer legalen Angelegenheit zu beeinflussen @de
definition: Dinheiro ou benefícios com que se pretende influenciar o juízo ou conduta de uma pessoa numa posição de poder. @pt-pt
definition: Dinheiro ou benefícios com que se pretende influenciar o juízo ou conduta de uma pessoa em uma posição de poder. @pt-br
definition: Tilbud om penge eller tjenester til en person i en afgørende position for at påvirke vedkommendes handlinger @dk
definition: 给予金钱或恩惠以影响当权者的判断或行为 @zh-hans
definition: The giving of money or favors in order to influence the judgment or conduct of a person in a position of power
in scheme: Media Topic
created: 2009-10-22T02:00:00+00:00
modified: 2021-02-18T12:00:00+00:00
broader: corruption

drug trafficking
type: Concept
preferred label: تهريب مخدرات @ar
preferred label: Trafic de drogue @fr
preferred label: Narkotikasmuggling @se
preferred label: Narcotráfico @es
preferred label: Drogenhandel @de
preferred label: tráfico de droga @pt-pt
preferred label: narkosmugling @dk
preferred label: 贩毒 @zh-hans
preferred label: narkotikahandel @no-nb
definition: Att illegalt föra droger mellan olika länder. @se
definition: Dealing in illicit often harmful substances
definition: Unerlaubter Handel mit meist gesundheitsgefährdenden Stoffen @de
definition: Tráfico de substâncias ilícitas. @pt-pt
definition: Tráfico de substâncias ilegais. @pt-br
definition: Ulovlig smugle narkotika mellem forskellige lande. @dk
definition: 从事有害药品的非法交易 @zh-hans
in scheme: Media Topic
created: 2009-10-22T02:00:00+00:00
modified: 2021-02-18T12:00:00+00:00
broader: drug related crimes

tax evasion
type: Concept
preferred label: Skattebrott @se
preferred label: evasão fiscal @pt-pt
preferred label: sonegação fiscal @pt-br
preferred label: skatteunddragelse @dk
preferred label: 逃税 @zh-hans
preferred label: skatteunndragelse @no-nb
preferred label: Steuerhinterziehung @de
preferred label: Fraude fiscale @fr
preferred label: Evasión fiscal @es
preferred label: تهرب ضريبي @ar
preferred label: skattesvik @no-nn
definition: The illegal evasion of taxes by individuals, corporations, and trusts
definition: Brottslighet som innehåller olika åtgärder från enskilda individer, företag eller organisationer för att undvika att betala skatt. @se
definition: Evasão ilegal de impostos por indivíduos, corporações e fundos. @pt-pt
definition: Når nogen forsøger at undgå at betale skat. @dk
definition: 个人、公司和信托公司的非法逃税行为 @zh-hans
definition: Die illegale Hinterziehung von Steuern durch Einzelpersonen, Unternehmen und Stiftungen. @de
definition: Unndraging av skatt. @no-nn
definition: Ulovlig unngåelse av skatt. @no-nb
in scheme: Media Topic
created: 2019-04-06T12:00:00+00:00
modified: 2021-07-12T12:00:00+00:00
broader: fraud

gang activity
type: Concept
preferred label: Gängbrott @se
preferred label: Bandenkriminalität @de
preferred label: Bandes criminelles @fr
preferred label: نشاط عصابات @ar
preferred label: Actividad pandillera @es
preferred label: gangues @pt-pt
preferred label: bandekriminalitet @dk
preferred label: 帮派活动 @zh-hans
preferred label: gjengkriminalitet @no-nb
definition: Brottslighet som sker av grupper som har en sammanhållning via exempelvis områden, språk, etnicitet eller bakgrund. Medlemmarna är ofta identifierade genom exempelvis tatueringar och/eller kläder. @se
definition: Kriminelle Aktivitäten von Gruppen, meist in Randgebieten, die verbunden sind durch gemeinsame Herkunft, Sprache und ethnischem Hintergrund aber meist nur wenig organisiert @de
definition: Criminal activities by groups of individuals, who are allied by common territories, languages or ethnic backgrounds and identify by a common group identity by using a shared name, tattoo, hand sign, clothing style or graffiti symbol
definition: Atividades criminosas cometidas por grupos de indivíduos, ligados por territórios, línguas ou origens étnicas comuns, e que se identificam por um identidade de grupo comum, usando um nome, tatuagens, gestos, estilo de roupa ou símbolos partilhados. @pt-pt
definition: Kriminalitet udført af grupper, der har en samhørighed gennem for eksempel områder, sprog, etnicitet eller baggrund. @dk
definition: 群体性犯罪活动，这个群体由具有相同地域、语言或种族背景的人组成，并具有相同的可辨识的称呼、纹身、服饰风格等特点 @zh-hans
in scheme: Media Topic
created: 2009-10-22T02:00:00+00:00
modified: 2021-05-05T12:00:00+00:00
broader: organised crime

court
type: Concept
preferred label: Corte @es
preferred label: Gericht @de
preferred label: محكمة @ar
preferred label: Tribunal @fr
preferred label: Domstol @se
preferred label: tribunal @pt-pt
preferred label: domstol @dk
preferred label: 法院 @zh-hans
definition: Gremium der Rechtsprechung wo Rechtsfälle angehört werden @de
definition: Place where legal cases are heard and decided
definition: En instans där rättsfall tas upp och parterna får lägga fram sin respektive syn innan ett avgörande fälls och eventuell påföljd bestäms. @se
definition: O órgão jurisdicional onde são ouvidos os casos legais. @pt-pt
definition: En institution, hvor en retssag føres, og hvor parterne får lov til at fremlægge deres respektive synspunkter, før der fældes en dom. @dk
definition: 审理法律案件的管辖机构 @zh-hans
in scheme: Media Topic
created: 2009-10-22T02:00:00+00:00
modified: 2021-02-18T12:00:00+00:00
broader: judiciary
narrower: appeal (court)
narrower: court administration
narrower: judge
narrower: trial (court)
narrower: supreme and high court
broad match: http://cv.iptc.org/newscodes/subjectcode/02007000

out of court procedures
type: Concept
preferred label: خارج اطار القضاء @ar
preferred label: Förlikningar @se
preferred label: Procédures hors tribunal @fr
preferred label: Procedimientos judiciales fuera del tribunal @es
preferred label: Außergerichtliche Einigung @de
preferred label: procedimentos judiciais fora do tribunal @pt-pt
preferred label: udenretslig procedure @dk
preferred label: 庭外程序 @zh-hans
preferred label: forlik @no-nb
definition: Legal issues which are settled outside of court
definition: När ett tvistemål avgörs genom att parterna kommer överens vid sidan av själva domstolen. @se
definition: Legale Absprachen außerhalb des Gerichts @de
definition: Questões legais que são resolvidas fora do tribunal. @pt-pt
definition: To parters tvistbilæggelse med neutral mægler uden om retten. @dk
definition: 庭外解决的法律问题 @zh-hans
in scheme: Media Topic
created: 2009-10-22T02:00:00+00:00
modified: 2021-05-05T12:00:00+00:00
broader: judiciary
narrower: arbitration and mediation
broad match: http://cv.iptc.org/newscodes/subjectcode/02000000

prosecution and prosecutors
type: Concept
preferred label: Åtal @se
preferred label: Anklage @de
preferred label: Accusation @fr
preferred label: ملاحقات @ar
preferred label: Proceso judicial @es
preferred label: acusação @pt-pt
preferred label: retsforfølgelse @dk
preferred label: 起诉和控方律师 @zh-hans
preferred label: tiltale @no-nb
definition: Åtgärder som genomförs av åklagare för att få ett utrett fall behandlat av domstol. @se
definition: The process of holding a trial against a person who is accused of a crime to determine guilt and the lawyers and legal team who argue that the accused is guilty
definition: Aktivitäten und Nachforschungen von Staatsanwälten @de
definition: Processo de realizar um julgamento contra uma pessoa acusada de um crime para determinar a sua culpa e os advogados e a equipa legal que defendem que o acusado é culpado. @pt-pt
definition: Processo de realizar um julgamento contra uma pessoa acusada de um crime para determinar a sua culpa e os advogados e a equipe legal que defendem que o acusado é culpado. @pt-br
definition: Processen med afholdelse af en retssag mod en person der er anklaget for at begå en forbrydelse. @dk
definition: 对被控犯罪嫌疑人进行审判和定罪的过程，以及辩称被告有罪的律师和法律团队 @zh-hans
definition: The process of holding a trial against a person or entity who is accused of a crime to determine guilt and the lawyers and legal team who argue that the accused is guilty
in scheme: Media Topic
created: 2009-10-22T02:00:00+00:00
modified: 2021-03-31T12:00:00+00:00
broader: judiciary

appeal (court)
type: Concept
preferred label: Överklagande av dom @se
preferred label: Apelación @es
preferred label: استئناف @ar
preferred label: Appel @fr
preferred label: Berufung (Gericht) @de
preferred label: recurso (tribunal) @pt-pt
preferred label: appel (domstol) @dk
preferred label: 上诉 @zh-hans
preferred label: anke (domstol) @no-nb
definition: Verfahren bei dem das Urteil nicht akzeptiert wird @de
definition: Åtgärder från en eller båda parter efter ett utslag från en domstol om de inte är nöjda med utslaget. @se
definition: Process in which parties request a formal change to an official decision
definition: Ações realizadas quando o veredicto não é aceite. @pt-pt
definition: Handlinger truffet, når dommen ikke accepteres. @dk
definition: 不接受判决时采取的行动 @zh-hans
definition: Når ein eller fleire partar påklagar ei rettsleg avgjerd. @no-nn
definition: Når en eller flere parter påklager en rettslig avgjørelse. @no-nb
in scheme: Media Topic
created: 2009-10-22T02:00:00+00:00
modified: 2021-02-18T12:00:00+00:00
broader: court
broad match: http://cv.iptc.org/newscodes/subjectcode/02000000

court administration
type: Concept
preferred label: Gerichtsverwaltung @de
preferred label: Administración de corte @es
preferred label: Greffe @fr
preferred label: Domstolspersonal @se
preferred label: محكمة ادارية @ar
preferred label: serviços de tribunal @pt-pt
preferred label: domstolsadministration @dk
preferred label: 法院行政 @zh-hans
preferred label: domstoladministrasjon @no-nb
preferred label: domstolsadministrasjon @no-nn
definition: Personer som är anställda och arbetar i domstolar. @se
definition: Angestellte des Gerichts, Gerichtsdiener, Stenografen etc. @de
definition: Court clerks, bailiffs, stenographers etc.
definition: Auxiliares de justiça. @pt-pt
definition: Personer, som er ansat og arbejder ved domstolene. @dk
definition: 法院职员、法警、速记员等 @zh-hans
in scheme: Media Topic
created: 2009-10-22T02:00:00+00:00
retired: 2019-10-07T12:00:00+00:00
modified: 2021-05-05T12:00:00+00:00
broader: court

judge
type: Concept
preferred label: Domare (Rättsväsendet) @se
preferred label: قضاة @ar
preferred label: Juge @fr
preferred label: Richter @de
preferred label: Juez @es
preferred label: juiz @pt-pt
preferred label: dommer @dk
preferred label: 法官 @zh-hans
preferred label: dommar @no-nn
definition: Official who decides cases in a court of law and passes sentences on those found guilty
definition: Den person eller de personer som leder förhandlingen i domstolen och fäller avgörandet. @se
definition: Mitglieder des Gerichts, die zu Gericht sitzen und Recht sprechen @de
definition: Membro do poder judicial que tem autoridade para julgar. @pt-pt
definition: Membro do poder judiciário que tem autoridade para julgar @pt-br
definition: Den eller de personer, der træffer juridiske afgørelser. @dk
definition: 坐在审判席上的人员 @zh-hans
in scheme: Media Topic
created: 2009-10-22T02:00:00+00:00
modified: 2024-03-28T12:00:00+00:00
broader: court

trial (court)
type: Concept
preferred label: Prozess (Gericht) @de
preferred label: Rättegång @se
preferred label: محاكمة @ar
preferred label: Juicio @es
preferred label: Procès @fr
preferred label: julgamentos @pt-pt
preferred label: straffesag @dk
preferred label: 审判 @zh-hans
preferred label: rettssak @no-nb
definition: Proceduren då ett rättsfall tas upp i en domstol. @se
definition: Vorgang, bei dem Schuld oder Unschuld, richtig oder falsch festgesetzt und geklärt wird @de
definition: The process by which evidence is presented and guilt, innocence or culpability is determined
definition: Processo mediante o qual se determina e julga a culpa ou a inocência, o certo e o errado. @pt-pt
definition: Processo mediante o qual culpado ou inocente, certo ou errado é determinado e julgado. @pt-br
definition: Den retslige procedure, der afgør skyldsspørgsmål og udmåler en evt. straf. @dk
definition: 判断和决定有罪或无罪，或对或错的过程 @zh-hans
in scheme: Media Topic
created: 2009-10-22T02:00:00+00:00
modified: 2021-02-18T12:00:00+00:00
broader: court
narrower: pre-trial
narrower: defendant
narrower: litigation
narrower: witness
narrower: sentencing (criminal)

supreme and high court
type: Concept
preferred label: højesteret @dk
preferred label: høyesterett @no-nb
preferred label: Högre instans @se
preferred label: 最高法院与高等法院 @zh-hans
preferred label: supremo tribunal e tribunal superior @pt-pt
preferred label: Oberstes Gericht @de
preferred label: Cour suprême et Haute Cour @fr
preferred label: Corte Suprema y Corte Superior @es
preferred label: محكمة عليا @ar
preferred label: høgsterett @no-nn
definition: matters related to supreme or high courts, including nominations and rulings
definition: Den øverste retsinstans i et land. @dk
definition: Frågor som hanteras av en högre juridisk instans. @se
definition: 有关最高法院与高等法院的事务，包括提名与裁决 @zh-hans
definition: Questões relativas a tribunais supremos ou superiores, incluindo nomeações e decisões. @pt-pt
definition: Angelegenheiten im Zusammenhang mit Obersten oder Hohen Gerichten, einschließlich Nominierungen und Urteile @de
in scheme: Media Topic
created: 2019-11-25T12:00:00+00:00
modified: 2021-07-12T12:00:00+00:00
broader: court

pre-trial
type: Concept
preferred label: Anhörung @de
preferred label: Audiencias preliminares @es
preferred label: Domstolsförberedelser @se
preferred label: جلسة تمهيدية @ar
preferred label: Audiences préliminaires @fr
preferred label: processos preliminares @pt-pt
preferred label: Forberedende retsmøde @dk
preferred label: 初审 @zh-hans
preferred label: varetekt @no-nb
definition: Saker som sker som förberedelse innan rättsfallet tas upp i en domstol. @se
definition: Vorgerichtliches Vorgehen inklusive Verteidigung, Kaution, Anträge, Indizien, Aussagen @de
definition: Actions that happen before the start of a trial, such as pleas, bail motions, discovery and depositions
definition: Procedimentos anteriores à fase de julgamento que incluem arguições, fianças, moções e depoimentos. @pt-pt
definition: Eventos preliminares que incluem arguições, fianças, moções, descobertas, depoimentos. @pt-br
definition: Forberedende retsbehandling, før de egentlige retsmøder @dk
definition: 审判前事件包括抗辩、保释、声请、证据揭示、取口供证词 @zh-hans
in scheme: Media Topic
created: 2009-10-22T02:00:00+00:00
modified: 2021-05-05T12:00:00+00:00
broader: trial (court)

defendant
type: Concept
preferred label: Acusado @es
preferred label: Angeklagter @de
preferred label: Svarande @se
preferred label: Accusé @fr
preferred label: مدعى عليه @ar
preferred label: réu @pt-pt
preferred label: tiltalt @dk
preferred label: 被告 @zh-hans
definition: The person on trial
definition: Person, die vor Gericht steht @de
definition: Den som är åtalad i en rättegång och ska svara på anklagelserna. @se
definition: Indivíduo que está a ser julgado em tribunal. @pt-pt
definition: Indivíduo que está sendo julgado em tribunal. @pt-br
definition: Enhver, der er tiltalt i en retssag, og som skal svare på anklagerne. @dk
definition: 受审者 @zh-hans
in scheme: Media Topic
created: 2009-10-22T02:00:00+00:00
retired: 2019-10-07T12:00:00+00:00
modified: 2021-02-18T12:00:00+00:00
broader: trial (court)

litigation
type: Concept
preferred label: Litigios @es
preferred label: Contentieux @fr
preferred label: Tvistemål @se
preferred label: Rechtsstreit @de
preferred label: نزاع @ar
preferred label: litígio @pt-pt
preferred label: civilretssag @dk
preferred label: 起诉 @zh-hans
preferred label: rettstvist @no-nb
definition: Streitigkeiten, die vor Gericht gebracht werden, um von einer Jury entschieden zu werden @de
definition: Om två parter är oense, utan att något brottsligt är inblandat, och inte kan komma överens kan det avgöras i en speciell form av rättsprocess. @se
definition: Taking disputed issues to court for settlement by judge and/or jury
definition: Levar a tribunal assuntos que se disputam para resolução por meio de juiz e/ou júri. @pt-pt
definition: Tvistafgørelse imellem to parter ved en domstol. @dk
definition: 将争议问题提交法院，由法官或陪审团解决 @zh-hans
in scheme: Media Topic
created: 2009-10-22T02:00:00+00:00
modified: 2021-05-05T12:00:00+00:00
broader: trial (court)

witness
type: Concept
preferred label: Témoin @fr
preferred label: شهود @ar
preferred label: Zeuge @de
preferred label: Vittne @se
preferred label: Testigo @es
preferred label: testemunha @pt-pt
preferred label: vidne @dk
preferred label: 证人 @zh-hans
preferred label: vitne @no-nb
definition: En person som framträder i domstolen och berättar om sina iaktagelser kring fallet som avgörs. @se
definition: Person, die etwas bezeugt @de
definition: A person who testifies
definition: Indivíduo que testemunha. @pt-pt
definition: En person, der optræder i retten og fortæller om sine oplevelser af sagen. @dk
definition: 作证的人 @zh-hans
in scheme: Media Topic
created: 2009-10-22T02:00:00+00:00
retired: 2019-10-07T12:00:00+00:00
modified: 2021-02-18T12:00:00+00:00
broader: trial (court)

sentencing (criminal)
type: Concept
preferred label: Strafe @de
preferred label: Straff @se
preferred label: عقوبة @ar
preferred label: Penas @es
preferred label: Peines @fr
preferred label: pena / sentença @pt-pt
preferred label: pena/sentença @pt-br
preferred label: straf (kriminel) @dk
preferred label: 刑罚 @zh-hans
preferred label: straffeutmåling @no-nb
definition: Vergeltung, die gegen Gesetzesbrecher verhängt wird @de
definition: Påföljd mot personer (eller organisationer) som fällts för brott. @se
definition: The retribution handed out to those who break laws
definition: Sentenças impostas àqueles que infringem as leis. @pt-pt
definition: Straf af personer eller organisationer, der er dømt for kriminalitet. @dk
definition: 对违法者的惩罚 @zh-hans
in scheme: Media Topic
created: 2009-10-22T02:00:00+00:00
modified: 2021-02-18T12:00:00+00:00
broader: trial (court)
narrower: capital punishment
narrower: fine (penalty)
narrower: prison
narrower: court-ordered psychiatric treatment
narrower: suspended sentence

arbitration and mediation
type: Concept
preferred label: Schiedsgericht @de
preferred label: تحكيم @ar
preferred label: Arbitraje @es
preferred label: Medling @se
preferred label: Arbitrage @fr
preferred label: arbitragem @pt-pt
preferred label: voldgift @dk
preferred label: 仲裁与调解 @zh-hans
preferred label: skilsdom @no-nn
definition: När någon neutral utomstående person eller organisation försöker få två tvistande parter att komma överens. @se
definition: Lösung von Streitigkeiten durch eine neutrale Instanz @de
definition: Resolution of disputed issues by a neutral panel, including conciliation, negotiation and tribunals
definition: Resolução de disputas por meio de tribunal arbitral. @pt-pt
definition: En afgørelse af et retstvist, hvor parterne benytter en neutral mægler i stedet for en domstol. @dk
definition: 由中立的委员会解决有争议的问题 @zh-hans
definition: Valdgiftsdom. @no-nn
in scheme: Media Topic
created: 2009-10-22T02:00:00+00:00
modified: 2021-12-21T12:00:00+00:00
broader: out of court procedures

civil rights
type: Concept
preferred label: Zivilrecht @de
preferred label: Derechos civiles @es
preferred label: حقوق مدنية @ar
preferred label: Medborgerliga rättigheter @se
preferred label: Droits civiques @fr
preferred label: direitos civis @pt-pt
preferred label: borgerrettighed @dk
preferred label: 公民权 @zh-hans
preferred label: borgerrettigheter @no-nb
preferred label: borgarrettar @no-nn
definition: Skydd för individers frihet från kränkningar av regeringar, politiska och sociala organisationer samt andra individer, oftast reglerade i ett lands lagar eller författningar @se
definition: Rechte des Einzelnen im Bürgerlichen Recht. @de
definition: Guarantees of protection to individuals freedom from violation by governments, political and social organisations, and other individuals as determined by the laws or constitutions of an individual country
definition: Direitos dos indivíduos no plano civil. @pt-pt
definition: De rettigheder som borgerne i en stat har, ofte indskrevet i landets grundlov. @dk
definition: 民法规定的个人权利 @zh-hans
definition: Guarantees of protection to individuals freedom from violation by governments, political and social organizations, and other individuals as determined by the laws or constitutions of an individual country
in scheme: Media Topic
created: 2009-10-22T02:00:00+00:00
modified: 2021-02-18T12:00:00+00:00
broader: fundamental rights

civil law
type: Concept
preferred label: Civilrätt @se
preferred label: Droit civil @fr
preferred label: قانون مدني @ar
preferred label: Bürgerliches Gesetzbuch @de
preferred label: Derecho civil @es
preferred label: lei civil @pt-pt
preferred label: civilret @dk
preferred label: 民法 @zh-hans
preferred label: sivilrett @no-nb
definition: The system of law focused on private rights and disputes between individuals in such areas as contracts, torts, property, and family law
definition: System der zivilen Vergehen und Delikte @de
definition: Den del av ett lands lagar som handlar om förhållanden mellan privatpersoner. @se
definition: Sistema do código civil. @pt-pt
definition: Den del af et lands love, der handler om forhold mellem private. @dk
definition: 集中于解决私人权利和个人之间在合同、侵权、财产和家庭法等领域纠纷的法律体系 @zh-hans
in scheme: Media Topic
created: 2009-10-22T02:00:00+00:00
modified: 2021-03-31T12:00:00+00:00
broader: law
narrower: regulations

criminal law
type: Concept
preferred label: قانون جنائي @ar
preferred label: Brottsbalken @se
preferred label: Strafgesetzbuch @de
preferred label: Droit pénal @fr
preferred label: Derecho penal @es
preferred label: lei criminal @pt-pt
preferred label: straffelov @dk
preferred label: 刑法 @zh-hans
preferred label: strafferett @no-nb
definition: The system of law concerned with the punishment of those who commit crimes
definition: System der Strafvergehen und Delikte @de
definition: Den del av ett lands lagar som handlar om brottslighet. @se
definition: Sistema do código criminal. @pt-pt
definition: Den del af et lands love, der beskæftiger sig med kriminalitet. @dk
definition: 刑法体系 @zh-hans
in scheme: Media Topic
created: 2009-10-22T02:00:00+00:00
modified: 2021-02-18T12:00:00+00:00
broader: law

international law
type: Concept
preferred label: Droit international @fr
preferred label: Internationales Recht @de
preferred label: Derecho internacional @es
preferred label: قانون دولي @ar
preferred label: Internationell rätt @se
preferred label: lei internacional @pt-pt
preferred label: international lov @dk
preferred label: 国际法 @zh-hans
preferred label: folkerett @no-nb
definition: The system of laws embraced by all nations, such as the Geneva Convention and the International Law of the Seas
definition: Lagar som gäller i hela världen, eller åtminstone i flera länder och inte bara i ett land. @se
definition: Rechtssystem, was alle Nationen einschließt, wie die Genfer Konvention, das Internationale Seerecht etc. @de
definition: Sistema de leis adotadas internacionalmente, como a convenção de Genebra, o direito do mar, etc. @pt-pt
definition: Sistema de leis adotadas internacionalmente, como a convenção de Genebra, o direito do mar etc. @pt-br
definition: Love, der gælder over hele verden, eller i flere lande. @dk
definition: 被所有国家接受的法律体系，如《日内瓦公约》、《国际海洋法公约》等 @zh-hans
in scheme: Media Topic
created: 2009-10-22T02:00:00+00:00
modified: 2021-02-18T12:00:00+00:00
broader: law
narrower: extradition
narrower: international court and tribunal

administrative law
type: Concept
preferred label: Förvaltningsrätt @se
preferred label: direito administrativo @pt-pt
preferred label: Forvaltningsret @dk
preferred label: 行政法 @zh-hans
preferred label: forvaltningsrett @no-nb
preferred label: Verwaltungsrecht @de
preferred label: Droit administratif @fr
preferred label: Derecho administrativo @es
preferred label: قانون إداري @ar
definition: Body of law that governs the actions of governmental administrative agencies
definition: Handlägger mål som främst rör tvister mellan enskilda personer och myndigheter @se
definition: Conjunto de leis que regulam o funcionamento das instituições administrativas governamentais. @pt-pt
definition: Det retsområde, der regulerer forholdet mellem offentlige myndigheder og borgere. @dk
definition: 管理政府行政机关的法律 @zh-hans
definition: Gesetzestext, der die Handlungen der staatlichen Verwaltungsbehörden regelt @de
in scheme: Media Topic
created: 2019-04-06T12:00:00+00:00
modified: 2021-07-12T12:00:00+00:00
broader: law

regulations
type: Concept
preferred label: Réglementation @fr
preferred label: Regler @se
preferred label: Verordnung @de
preferred label: تنظيم @ar
preferred label: Regulación @es
preferred label: regulação @pt-pt
preferred label: regulering @dk
preferred label: 法规 @zh-hans
preferred label: reguleringer @no-nb
preferred label: reguleringar @no-nn
definition: laws that guide the conduct and organization of business corporations
definition: Regelungen aus dem Unternehmensrecht @de
definition: Bestämmelser som främst har med lagstiftning kring företag att göra. @se
definition: Regras que derivam do direito empresarial. @pt-pt
definition: Regler, der udspringer af selskabs- og erhvervsret. @dk
definition: 指导商业组织行为和组织的法律/指导商业公司行为和组织的规则 @zh-hans
in scheme: Media Topic
created: 2009-10-22T02:00:00+00:00
modified: 2021-03-31T12:00:00+00:00
broader: civil law
narrower: antitrust regulations
broad match: http://cv.iptc.org/newscodes/subjectcode/02006002

antitrust regulations
type: Concept
preferred label: قضية مكافحة احتكار @ar
preferred label: Legislación antitrust @es
preferred label: Konkurrensfrågor @se
preferred label: Kartellfragen @de
preferred label: Droit de la concurrence @fr
preferred label: antitrust @pt-pt
preferred label: antitruste @pt-br
preferred label: konkurrenceregel @dk
preferred label: 反垄断 @zh-hans
preferred label: konkurranserett @no-nb
definition: Saker som gäller konkurrens mellan företag, såsom regler mot monopol och truster. @se
definition: laws to promote competition between companies for the benefit of consumers
definition: Kartellaktivitäten und Regelungen des Monopols @de
definition: Histórias relativas a atividades antitrust, regulações de monopólio, etc. @pt-pt
definition: Histórias relativas a atividades antitruste, regulações de monopólio etc. @pt-br
definition: Regler, der vedrører konkurrence mellem virksomheder, såsom regler mod monopoler og lignede. @dk
definition: 反垄断活动、对垄断行为的规制等 @zh-hans
in scheme: Media Topic
created: 2009-10-22T02:00:00+00:00
modified: 2021-02-18T12:00:00+00:00
broader: regulations

extradition
type: Concept
preferred label: Utlämning @se
preferred label: Extradition @fr
preferred label: Extradición @es
preferred label: Auslieferung @de
preferred label: تسليم @ar
preferred label: extradição @pt-pt
preferred label: extradição (processos) @pt-br
preferred label: udlevering @dk
preferred label: 引渡 @zh-hans
preferred label: utlevering @no-nb
definition: Legaler Austausch zwischen Ländern von Kriminellen und Verdächtigen @de
definition: Legal transfer of criminals or suspects between countries
definition: Att flytta en brottsmisstänkt eller dömd brottsling från ett land till ett annat. @se
definition: Transferência legal de criminosos ou suspeitos de crimes entre países. @pt-pt
definition: At overføre en mistænkt eller dømt kriminel fra et land til et andet. @dk
definition: 罪犯或嫌疑犯在国家间的合法转移 @zh-hans
in scheme: Media Topic
created: 2009-10-22T02:00:00+00:00
modified: 2021-02-18T12:00:00+00:00
broader: international law

international court and tribunal
type: Concept
preferred label: محكمة دولية @ar
preferred label: Internationell domstol @se
preferred label: Internationales Strafgericht @de
preferred label: Cour ou tribunal international @fr
preferred label: Corte o tribunal internacional @es
preferred label: tribunal internacional @pt-pt
preferred label: international domstol @dk
preferred label: 国际法院、法庭 @zh-hans
preferred label: internasjonal domstol @no-nb
definition: Aktivitäten von internationalen Tribunalen wie der Europäische Gerichtshof für Menschenrechte, Internationaler Gerichtshof in Den Haag etc. @de
definition: The activities of courts under the authority of international organizations or formed by treaties between nations, such as the European Court for Human Rights and International Court of Justice
definition: En domstol som dömer i fall som gäller brott mot internationell lag. @se
definition: Atividades de tribunais internacionais como o Tribunal Europeu dos Direitos do Homem, o Tribunal de Haia, o Tribunal Internacional de Justiça, etc. @pt-pt
definition: Atividades de tribunais internacionais como o Tribunal Europeu dos Direitos do Homem, o Tribunal de Haia, o Tribunal Internacional de Justiça etc. @pt-br
definition: En international domstol, der dømmer i tilfælde af krænkelse af folkeretten. @dk
definition: 欧洲人权法院、海牙法庭、国际法院等国际机构的活动 @zh-hans
in scheme: Media Topic
created: 2009-10-22T02:00:00+00:00
modified: 2021-12-17T12:00:00+00:00
broader: international law

arrest
type: Concept
preferred label: Untersuchungshaft @de
preferred label: Arrestation @fr
preferred label: Frihetsberövande @se
preferred label: توقيف @ar
preferred label: Arresto @es
preferred label: detenção @pt-pt
preferred label: anholdelse @dk
preferred label: 逮捕 @zh-hans
preferred label: pågripelse @no-nb
preferred label: arrestasjon @no-nn
definition: The detention of a suspect of a crime
definition: Festnahme bei Verdacht auf ein Verbrechen @de
definition: När en person som är misstänkt för något brott infångas eller hindras från att fly. @se
definition: Detenção de um suspeito de um crime. @pt-pt
definition: Når en person, der mistænkes for en forbrydelse, bliver fanget eller forhindret i at flygte. @dk
definition: 拘留犯罪嫌疑人 @zh-hans
in scheme: Media Topic
created: 2009-10-22T02:00:00+00:00
modified: 2021-02-18T12:00:00+00:00
broader: law enforcement

investigation (criminal)
type: Concept
preferred label: Förundersökning @se
preferred label: Strafanzeige @de
preferred label: Investigación @es
preferred label: تحقيق @ar
preferred label: Enquête @fr
preferred label: investigação (criminal) @pt-pt
preferred label: efterforskning (kriminel) @dk
preferred label: 犯罪调查 @zh-hans
preferred label: etterforskning @no-nb
preferred label: etterforsking @no-nn
definition: Åtgärder som genomförs av förundersökningsledare och polis för att klargöra vad som skett, identifiera en eller flera misstänkta och gripa dessa. @se
definition: Inquiry into an alleged crime, including searching, interviews, interrogations and evidence collection
definition: Untersuchung über ein mögliches Verbrechen bis zur Verhaftung @de
definition: Processo de investigação sobre um eventual crime. @pt-pt
definition: Undersøgelse af en mulig forbrydelse frem mod opklaringen. @dk
definition: 对可能犯罪进行调查直至逮捕的过程 @zh-hans
in scheme: Media Topic
created: 2009-10-22T02:00:00+00:00
modified: 2021-02-18T12:00:00+00:00
broader: law enforcement
narrower: missing person
narrower: dropped criminal investigation

police
type: Concept
preferred label: Police @fr
preferred label: Polizei @de
preferred label: Policía @es
preferred label: شرطة @ar
preferred label: Polis @se
preferred label: polícia @pt-pt
preferred label: politi @dk
preferred label: 警察 @zh-hans
definition: En instans i samhället som ser till att ordningen upprätthålls, att brottslighet förhindras och utreds när den inträffar. @se
definition: Civil force of a national, regional or local government that is responsible for the prevention and detection of crime and the maintenance of public order
definition: Öffentliche Kräfte, die Gesetze durchsetzen, Kriminalität erfassen und vorbeugen, um die öffentliche Ordnung zu sichern @de
definition: Agentes do estado que têm por missão zelar pelo cumprimento da lei, proteger as pessoas e a propriedade e manter a ordem pública. @pt-pt
definition: Agentes do sistema legal cuja missão é a aplicação das leis para a manutenção da ordem. @pt-br
definition: En institution i samfundet, der sikrer, at orden opretholdes, og at kriminalitet forhindres og efterforskes. @dk
definition: 国家、地区或地方政府中负责防止、侦查犯罪和维护公共秩序的民事力量 @zh-hans
in scheme: Media Topic
created: 2009-10-22T02:00:00+00:00
modified: 2021-03-31T12:00:00+00:00
broader: law enforcement

surveillance
type: Concept
preferred label: Övervakning @se
preferred label: overvåkning @no-nb
preferred label: vigilância @pt-pt
preferred label: overvågning @dk
preferred label: 监控 @zh-hans
preferred label: Überwachung @de
preferred label: Surveillance @fr
preferred label: Vigilancia @es
preferred label: مراقبة @ar
preferred label: overvaking @no-nn
definition: Monitoring the activities of the individual through the use of cameras and data in order to prevent or uncover criminal activities
definition: Med hjälp av kameror och datainsamling försöker polisen förbygga brott och avslöja brottslig verksamhet. @se
definition: Monitorizar atividades individuais por meio do uso de câmaras e dados, a fim de prevenir ou descobrir atividades criminosas. @pt-pt
definition: Monitorar atividades individuais por meio do uso de câmeras e dados, a fim de prevenir ou descobrir atividades criminosas. @pt-br
definition: At holde øje med et individ og dets handlinger ved brug af data og kameraer for at forhindre eller afsløre kriminelle handlinger. @dk
definition: 通过使用摄像头和数据的方式监视个人行为用于预防或揭露犯罪 @zh-hans
in scheme: Media Topic
created: 2020-08-05T12:00:00+00:00
modified: 2021-07-12T12:00:00+00:00
broader: law enforcement

missing person
type: Concept
preferred label: Personas desaparecidas @es
preferred label: Saknad person @se
preferred label: Personne disparue @fr
preferred label: Vermisste @de
preferred label: مفقودون @ar
preferred label: pessoa desaparecida @pt-pt
preferred label: desaparecidos @pt-br
preferred label: savnet person @dk
preferred label: 失踪人员 @zh-hans
preferred label: sakna person @no-nn
definition: En person som saknas sedan en tid och söks, mer eller mindre aktivt. @se
definition: Person, die nicht an dem Ort ist, wo man sie in einem bestimmten Zeitraum erwartet @de
definition: An adult whose disappearance is possibly not voluntary, or a child whose whereabouts are unknown to the child's legal guardian
definition: Pessoa que é considerada ausente sem explicação conhecida e procurada por outros. @pt-pt
definition: Pessoa que não está no lugar esperado, onde deveria estar, há um certo período de tempo. @pt-br
definition: En person, der har været savnet i nogen tid og bliver søgt, mere eller mindre aktivt. @dk
definition: 一个人在一段时间内不在他们应该在的地方 @zh-hans
in scheme: Media Topic
created: 2009-10-22T02:00:00+00:00
modified: 2021-02-18T12:00:00+00:00
broader: investigation (criminal)

dropped criminal investigation
type: Concept
preferred label: Nedlagd förundersökning @se
preferred label: investigação criminal arquivada @pt-pt
preferred label: henlæggelse af straffesag @dk
preferred label: 撤销刑事调查 @zh-hans
preferred label: henleggelse @no-nb
preferred label: Strafrechtliche Ermittlungen eingestellt @de
preferred label: Abandon d'enquête criminelle @fr
preferred label: Abandono de investigación criminal @es
preferred label: اسقاط تحقيق جنائي @ar
preferred label: bortlegging @no-nn
definition: When police and/or prosecutors end an investigation without a conclusion
definition: När polis och förundersökningsledare bedömer att det inte finns förutsättningar att komma längre med en utredning. @se
definition: Encerramento que a polícia e / ou os promotores fazem de investigação criminal por falta de conclusão. @pt-pt
definition: Encerramento que a polícia e/ou os promotores fazem de investigação criminal por falta de conclusão. @pt-br
definition: Når politi og forundersøgere vurderer, at der ikke er noget tilstrækkelig grundlag for at komme videre med en efterforskning. @dk
definition: 警察或检察官在没有结论的情况下结束调查 @zh-hans
definition: Wenn Polizei und/oder Staatsanwälte eine Untersuchung ohne Abschluss beenden @de
change note: Moved from 20001200 (prosecution) to 20000131 (criminal investigation)
in scheme: Media Topic
created: 2019-04-06T12:00:00+00:00
modified: 2021-07-12T12:00:00+00:00
broader: investigation (criminal)

capital punishment
type: Concept
preferred label: Peine capitale @fr
preferred label: عقوبة قصوى @ar
preferred label: Dödsstraff @se
preferred label: Todesstrafe @de
preferred label: Pena capital @es
preferred label: pena de morte @pt-pt
preferred label: dødsstraf @dk
preferred label: 死刑 @zh-hans
preferred label: dødsstraff @no-nb
definition: Påföljd mot en person som fällts för brott där den skyldige mister livet. @se
definition: The legally authorised execution of someone as punishment for a crime
definition: Strafe durch Tod @de
definition: Pena de morte. @pt-pt
definition: Straf af en person, der er dømt til døden for en forbrydelse. @dk
definition: 对犯人处死的刑罚 @zh-hans
definition: The legally authorized execution of someone as punishment for a crime
in scheme: Media Topic
created: 2009-10-22T02:00:00+00:00
modified: 2021-02-18T12:00:00+00:00
broader: sentencing (criminal)
broad match: http://cv.iptc.org/newscodes/subjectcode/14025005

fine (penalty)
type: Concept
preferred label: Multa @es
preferred label: Geldstrafe @de
preferred label: Amende @fr
preferred label: Böter @se
preferred label: غرامة @ar
preferred label: multa @pt-pt
preferred label: bøde @dk
preferred label: 罚款 @zh-hans
preferred label: bøter og forelegg @no-nb
preferred label: bøter og førelegg @no-nn
definition: Strafe die mit Geld abgegolten wird @de
definition: En påföljd som innebär att den som fällts får betala en summa pengar. @se
definition: Money that a court of law or other authority decides has to be paid as punishment for a crime or other offence
definition: Punição monetária. @pt-pt
definition: En straf, hvor den dømte skal betale et beløb. @dk
definition: 货币惩罚 @zh-hans
in scheme: Media Topic
created: 2009-10-22T02:00:00+00:00
modified: 2021-02-18T12:00:00+00:00
broader: sentencing (criminal)

prison
type: Concept
preferred label: Prison @fr
preferred label: Fängelse @se
preferred label: سجن @ar
preferred label: Strafvollzug @de
preferred label: Cárcel @es
preferred label: prisão @pt-pt
preferred label: fængsel @dk
preferred label: 监狱 @zh-hans
preferred label: fengsel @no-nb
definition: Facility where people are held as a punishment for a crime they have committed or while awaiting trial
definition: Ort, für die Inhaftierung aus Menschen aus unterschiedlichen Gründen @de
definition: En påföljd som innebär att den som fällts blir inspärrad för en avgränsad tid, eller tills vidare. @se
definition: Edificação onde são encarcerados os infratores condenados pela justiça. @pt-pt
definition: Prisão, casa de detenção, presídio onde são encarcerados os infratores condenados pela justiça. @pt-br
definition: En institution, hvor kriminelle efter dom er frihedsberøvet. @dk
definition: 惩罚人们所犯的罪行或在等待审判时被关押的场所 @zh-hans
in scheme: Media Topic
created: 2009-10-22T02:00:00+00:00
modified: 2021-03-31T12:00:00+00:00
broader: sentencing (criminal)

court-ordered psychiatric treatment
type: Concept
preferred label: Rättspsykiatrisk vård @se
preferred label: tratamento psiquiátrico por ordem judicial @pt-pt
preferred label: psykiatrisk behandlingsdom @dk
preferred label: 法院强制精神治疗 @zh-hans
preferred label: tvungent psykisk helsevern @no-nb
preferred label: gerichtlich angeordnete psychiatrische Behandlung @de
preferred label: Traitement psychiatrique ordonné par le tribunal @fr
preferred label: Tratamiento psiquiátrico ordenado por el tribunal @es
preferred label: علاج نفسي بأمر قضائي @ar
preferred label: tvunge psykisk helsevern @no-nn
definition: Psychiatric treatment imposed upon persons with mental health conditions in prisons and jails or as a condition of probation, supervision or parole
definition: Dom som innebär att den dömde tvingas till någon form av psykiatrisk vård och den exakta tiden hänger på hur vården fungerar och läkares bedömning. @se
definition: Tratamento psiquiátrico imposto a pessoas com problemas de saúde mental em prisões e cadeias ou como condição de liberdade condicional ou de supervisão. @pt-pt
definition: Dom, hvor retten i stedet for almindelig straf dømmer en psykisk syg kriminel til psykiatrisk behandling. @dk
definition: 监狱和拘留所对有精神健康问题的在押人员进行的精神治疗，或者作为缓刑、监管或假释的条件 @zh-hans
definition: Psychiatrische Behandlung, die Personen mit psychischen Erkrankungen in Gefängnissen oder als Bedingung für Bewährung, Überwachung oder Bewährung auferlegt wird @de
in scheme: Media Topic
created: 2019-04-06T12:00:00+00:00
modified: 2021-07-12T12:00:00+00:00
broader: sentencing (criminal)

suspended sentence
type: Concept
preferred label: Villkorlig dom @se
preferred label: pena suspensa @pt-pt
preferred label: suspensão da pena @pt-br
preferred label: betinget dom @dk
preferred label: 缓刑 @zh-hans
preferred label: Bewährungsstrafe @de
preferred label: Sursis @fr
preferred label: Suspensión de la pena @es
preferred label: حكم مع وقف التنفيذ @ar
preferred label: dom på vilkår @no-nn
definition: Legal arrangement where a judge delays the serving of a sentence by a person who has been found guilty of a crime in order to give them a probationary period
definition: Brottspåföljd för ett brott där påföljden inte bedöms kunna stanna vid böter men den dömde inte behöver avtjäna straffet i fängelse. @se
definition: Disposição legal que permite que um juiz suspenda, mediante condições, o cumprimento de uma sentença por uma pessoa que tenha sido considerada culpada de um crime. @pt-pt
definition: En dom, hvor den dømte kendes skyldig, men hvor vedkommende på bestemte vilkår ikke skal afsone straffen. @dk
definition: 法律上的一种安排，延缓刑期执行，以便给予犯罪人一个考验期 @zh-hans
definition: Rechtliche Regelung für den Fall, dass ein Richter die Verbüßung einer Strafe durch eine Person, die eines Verbrechens für schuldig befunden wurde, hinauszögert, um ihr eine Bewährungsfrist zu geben @de
in scheme: Media Topic
created: 2019-04-06T12:00:00+00:00
modified: 2021-07-12T12:00:00+00:00
broader: sentencing (criminal)

explosion accident and incident
type: Concept
preferred label: Explosión @es
preferred label: حادث انفجار @ar
preferred label: Explosioner @se
preferred label: Explosion @de
preferred label: Explosion accidentelle @fr
preferred label: explosão @pt-pt
preferred label: eksplosionsulykke og -hændelse @dk
preferred label: 爆炸事故 @zh-hans
preferred label: eksplosjoner @no-nb
preferred label: eksplosjonar @no-nn
definition: När någon form av sprängmedel detoneras. @se
definition: Jede ungeplante und plötzliche Ausbreitung einer Menge von Materie @de
definition: Explosions caused by an accidental, non-combat, or non-terrorism source. Also use when the source of the explosion is non-specified or unknown
definition: Súbita fragmentação de um corpo, devido à dilatação de gases ou à conflagração de matérias. @pt-pt
definition: En pludselig detonering af sprængstof @dk
definition: 由意外、非战斗或非恐怖主义原因导致的爆炸。当爆炸源不明时也可使用 @zh-hans
change note: Change Note 2015-08-27: English name changed
in scheme: Media Topic
created: 2009-10-22T02:00:00+00:00
modified: 2021-05-05T12:00:00+00:00
broader: accident and emergency incident

industrial accident and incident
type: Concept
preferred label: حادث صناعي @ar
preferred label: Accident industriel @fr
preferred label: Accidente industrial @es
preferred label: Arbetsplatsolyckor @se
preferred label: Industrieunglück @de
preferred label: acidente industrial @pt-pt
preferred label: arbejdsulykke @dk
preferred label: 工业事故 @zh-hans
preferred label: arbeidsulykker @no-nb
definition: Any unplanned event or mishap in an industrial setting that result in injuries to people and damage to property or the environment
definition: Jedes ungeplante Ereignis mit ungewollten Konsequenzen in einer Fabrik, einem Geschäft oder Büro @de
definition: Oönskade händelser på arbetsplatser som leder till att personer och/eller egendom skadas. @se
definition: Acidente em fábrica, loja ou oficina, potencialmente perigoso. @pt-pt
definition: Uventet hændelser på en arbejdsplads, der forårsager personskader og/eller ejendomsskader. @dk
definition: 在工厂、商店或办公室发生的意外事故 @zh-hans
change note: Change Note 2015-08-27: English name changed
in scheme: Media Topic
created: 2009-10-22T02:00:00+00:00
modified: 2021-05-05T12:00:00+00:00
broader: accident and emergency incident
narrower: nuclear accident and incident

transportation accident and incident
type: Concept
preferred label: Accidente de transporte @es
preferred label: Transportunglück @de
preferred label: حادث نقل @ar
preferred label: Transportolyckor @se
preferred label: Accident de transport @fr
preferred label: acidente de transporte @pt-pt
preferred label: acidentes de transporte @pt-br
preferred label: transportulykke @dk
preferred label: 交通运输事故 @zh-hans
preferred label: transportulykker @no-nb
definition: An accident or incident involving one or more vehicles
definition: Oänskade händelser med transportfordon. @se
definition: Unfall bei dem ein oder mehrere Fahrzeuge verwickelt sind. @de
definition: Acidente envolvendo um ou mais veículos. @pt-pt
definition: Uventet begivenhed med transportkøretøjer. @dk
definition: 涉及一辆或多辆汽车的意外事故 @zh-hans
change note: Change Note 2015-08-27: Concept medtop:20000162 was merged into this one as their semantics were not sufficiently different
in scheme: Media Topic
created: 2009-10-22T02:00:00+00:00
modified: 2021-05-05T12:00:00+00:00
broader: accident and emergency incident
narrower: air and space accident and incident
narrower: maritime accident and incident
narrower: railway accident and incident
narrower: road accident and incident

structural failure
type: Concept
preferred label: انهيار مبان @ar
preferred label: Byggnadsolyckor @se
preferred label: Derrumbe @es
preferred label: Konstruktionsfehler @de
preferred label: Effondrement @fr
preferred label: falhas estruturais @pt-pt
preferred label: konstruktionsulykke @dk
preferred label: 建筑物结构性事故 @zh-hans
preferred label: bygningskollaps @no-nb
definition: Oönskade händelser med byggnadsverk inblandade. @se
definition: Wenn ein Gebäude, eine Brücke oder andere Konstruktionen zusammenbrechen aufgrund von unerwarteten Krafteinwirkungen oder Materialfehlern @de
definition: The unexpected collapse of a building, bridge or other structure
definition: Defeitos de um edifício, ponte ou outra estrutura que podem provocar a sua queda. @pt-pt
definition: Uventet begivenhed hvor en bygning, bro eller en anden konstruktion kollapser helt eller delvist. @dk
definition: 大厦、桥梁或其他建筑物因意外受力或设计不良而倒塌 @zh-hans
change note: Change Note 2015-08-27: broader term changed
in scheme: Media Topic
created: 2009-10-22T02:00:00+00:00
modified: 2021-02-18T12:00:00+00:00
broader: accident and emergency incident

drowning
type: Concept
preferred label: drukning @no-nb
preferred label: Drunkning @se
preferred label: Ahogamiento @es
preferred label: Noyade @fr
preferred label: غرق @ar
preferred label: Ertrinken @de
definition: When a person's airpipe and lungs become filled with water causing death or injury, most often caused by falling into or bathing in rivers, lakes or the ocean
definition: När en persons andningssystem fylls med vätska som hindrar andningen och gör att personen avlider eller skadas. @se
definition: Wenn sich die Luftröhre und die Lungen einer Person mit Wasser füllen, was zum Tod oder zu Verletzungen führt, meist verursacht durch einen Sturz oder ein Bad in Flüssen, Seen oder im Meer @de
in scheme: Media Topic
created: 2021-05-05T12:00:00+00:00
modified: 2021-12-21T12:00:00+00:00
broader: accident and emergency incident

nuclear accident and incident
type: Concept
preferred label: Accidente nuclear @es
preferred label: حادث نووي @ar
preferred label: Atomunglück @de
preferred label: Accident nucléaire @fr
preferred label: Kärnkraftsolyckor @se
preferred label: acidente nuclear @pt-pt
preferred label: atomulykke @dk
preferred label: 核事故 @zh-hans
preferred label: atomulykker @no-nb
definition: Any unplanned event that causes unwanted consequences involving radioactive materials
definition: Oönskade händelser på ställen som ingår i produktion av kärnkraft. @se
definition: Jedes ungeplante Ereignis mit ungewollten Konsequenzen im Zusammenhang mit radioaktiven Materialien @de
definition: Acidente envolvendo materiais radioativos. @pt-pt
definition: Uventet begivenhed på steder, der involvere produktion af atomkraft. @dk
definition: 涉及放射性物质的意外事故 @zh-hans
change note: Change Note 2015-08-27: English name changed
in scheme: Media Topic
created: 2009-10-22T02:00:00+00:00
modified: 2021-02-18T12:00:00+00:00
broader: industrial accident and incident

air and space accident and incident
type: Concept
preferred label: Accidentes aeroespaciales @es
preferred label: Luftfartsolyckor @se
preferred label: حادث جوي او فضائي @ar
preferred label: Accident aérospatial @fr
preferred label: Flugunglück @de
preferred label: acidente aéreo e espacial @pt-pt
preferred label: acidente aéreo @pt-br
preferred label: luft- og rumfartsulykke @dk
preferred label: 航空航天事故 @zh-hans
preferred label: flyulykker @no-nb
definition: Oönskade händelser med farkoster i luften eller rymden. @se
definition: Unfälle mit Fahrzeugen im Luft- und Weltraum @de
definition: An accident or incident involving aircrafts or spacecrafts
definition: Acidente envolvendo aviões ou naves espaciais. @pt-pt
definition: En ulykke eller hændelse, der involverer fartøjer i luft eller rum. @dk
definition: 涉及航空器在空中或太空中的意外事故 @zh-hans
change note: Change Note 2015-08-27: Concept medtop:20000163 was merged into this one as their semantics were not sufficiently different
in scheme: Media Topic
created: 2009-10-22T02:00:00+00:00
modified: 2021-02-18T12:00:00+00:00
broader: transportation accident and incident

maritime accident and incident
type: Concept
preferred label: Schiffsunglück @de
preferred label: Accidente marítimo @es
preferred label: Accident maritime @fr
preferred label: حادث بحري @ar
preferred label: Sjöfartsolyckor @se
preferred label: acidente marítimo @pt-pt
preferred label: søfartsulykke @dk
preferred label: 海上事故 @zh-hans
preferred label: maritime ulykker @no-nb
definition: An accident or incident involving marine vessels.
definition: Oönskade händelser med en eller flera fordon på vatten. @se
definition: Unfälle mit Wasserfahrzeugen @de
definition: Acidente envolvendo embarcações. @pt-pt
definition: Ulykke eller hændelse, der involverer maritime fartøjer. @dk
definition: 涉及海船的意外事故 @zh-hans
change note: Change Note 2015-08-27: Concept medtop:20000164 was merged into this one as their semantics were not sufficiently different
in scheme: Media Topic
created: 2009-10-22T02:00:00+00:00
modified: 2021-02-18T12:00:00+00:00
broader: transportation accident and incident

railway accident and incident
type: Concept
preferred label: حادث قطار @ar
preferred label: Bahnunglück @de
preferred label: Accident ferroviaire @fr
preferred label: Accidente ferroviario @es
preferred label: Tågolyckor @se
preferred label: acidente ferroviário @pt-pt
preferred label: jernbaneulykke @dk
preferred label: 铁路事故 @zh-hans
preferred label: togulykker @no-nb
definition: An accident or incident involving trains.
definition: Oönskade händelser med rälsburna fordon. @se
definition: Unfälle mit Zügen @de
definition: Acidente envolvendo comboios. @pt-pt
definition: Acidente envolvendo trens. @pt-br
definition: Ulykke eller hændelse, der involverer jernbanekøretøjer. @dk
definition: 涉及火车的意外事故 @zh-hans
change note: Change Note 2015-08-27: Concept medtop:20000165 was merged into this one as their semantics were not sufficiently different. Note 2016-08-24: typo in name fixed
in scheme: Media Topic
created: 2009-10-22T02:00:00+00:00
modified: 2021-02-18T12:00:00+00:00
broader: transportation accident and incident

road accident and incident
type: Concept
preferred label: حادث سير @ar
preferred label: Accident routier @fr
preferred label: Accidente de carretera @es
preferred label: Verkehrsunglück @de
preferred label: Trafikolyckor @se
preferred label: acidente rodoviário @pt-pt
preferred label: trafikulykke @dk
preferred label: 道路事故 @zh-hans
preferred label: trafikkulykker @no-nb
definition: Unfälle im Straßenverkehr @de
definition: An accident or incident involving road vehicles.
definition: Oönskade händelser mellan fordon på vägar. @se
definition: Acidente envolvendo veículos terrestres. @pt-pt
definition: Ulykke eller hændelse, der involverer køretøjer på veje. @dk
definition: 涉及道路车辆的意外事故 @zh-hans
change note: Change Note 2015-08-27: Concept medtop:20000166 was merged into this one as their semantics were not sufficiently different
in scheme: Media Topic
created: 2009-10-22T02:00:00+00:00
modified: 2021-02-18T12:00:00+00:00
broader: transportation accident and incident
narrower: wildlife traffic accident

wildlife traffic accident
type: Concept
preferred label: Viltolycka @se
preferred label: atropelamento de animais selvagens @pt-pt
preferred label: påkørt dyr @dk
preferred label: 野生动物交通事故 @zh-hans
preferred label: viltpåkjørsel @no-nb
preferred label: Wildtierunfall @de
preferred label: Accident de la circulation de la faune @fr
preferred label: Accidente de tráfico de vida silvestre @es
preferred label: حادث لحيوانات برية @ar
preferred label: viltpåkøyrsel @no-nn
definition: Traffic accidents involving wild animals
definition: Trafikolycka där vilda djur är inblandade. @se
definition: Acidentes de trânsito envolvendo animais selvagens. @pt-pt
definition: Trafikulykke med vilde dyr. @dk
definition: 涉及野生动物引发的交通事故 @zh-hans
definition: Verkehrsunfälle mit Wildtieren @de
in scheme: Media Topic
created: 2019-04-06T12:00:00+00:00
modified: 2021-07-12T12:00:00+00:00
broader: road accident and incident

famine
type: Concept
preferred label: Hambruna @es
preferred label: Hunger @de
preferred label: Svält @se
preferred label: Famine @fr
preferred label: مجاعة @ar
preferred label: fome @pt-pt
preferred label: hungersnød @dk
preferred label: 饥荒 @zh-hans
preferred label: hungersnaud @no-nn
definition: Severe lack of food for a large population
definition: Schwerer Mangel an Nahrungsmitteln für eine große Bevölkerung @de
definition: När en större mängd människor i ett område blir utan mat så deras hälsa hotas. @se
definition: Grave falta de comida para a população. @pt-pt
definition: Alvorlig og livstruende mangel på mad til en større gruppe mennesker i et område. @dk
definition: 大量人口严重缺乏食物 @zh-hans
in scheme: Media Topic
created: 2009-10-22T02:00:00+00:00
modified: 2021-02-18T12:00:00+00:00
broader: disaster

fire
type: Concept
preferred label: Incendios @es
preferred label: Feuer @de
preferred label: Brand @se
preferred label: حريق @ar
preferred label: Incendie @fr
preferred label: incêndios @pt-pt
preferred label: ild @dk
preferred label: 火灾 @zh-hans
preferred label: brann @no-nb
definition: Verbrennung und Zerstörung von Materialien durch eine Verbindung von großer Hitze und Sauerstoff @de
definition: Fires started by an accidental or unknown source. For wildfires, use wildfire. For fires started with a criminal intent, use arson.
definition: Större eld som inte är under kontroll och som uppstått genom en olyckshändelse eller är olovligt anlagd. @se
definition: Queima e combustão de materiais, mediante a combinação de calor elevado e oxigénio. @pt-pt
definition: Queima e combustão de materiais, mediante a combinação de calor elevado e oxigênio. @pt-br
definition: Stor brand, der ikke er under kontrol, og som er opstået ved en ulykke eller er ulovligt antændt. @dk
definition: 由意外或未知来源引发的火灾。对于野火，宜入“野火”。如果火灾是出于犯罪目的，宜入“纵火” @zh-hans
in scheme: Media Topic
created: 2009-10-22T02:00:00+00:00
modified: 2021-02-18T12:00:00+00:00
broader: disaster
narrower: wildfire

natural disaster
type: Concept
preferred label: Naturkatastrofer @se
preferred label: Catastrophe naturelle @fr
preferred label: كوارث طبيعية @ar
preferred label: Desastre natural @es
preferred label: Naturkatastrophe @de
preferred label: desastre natural @pt-pt
preferred label: naturkatastrofe @dk
preferred label: 自然灾害 @zh-hans
preferred label: naturkatastrofer @no-nb
preferred label: naturkatastrofar @no-nn
definition: Destructive incidents caused by nature, such as earthquakes and floods
definition: Zerstörerische Ereignisse verursacht durch die Natur, wie Hurrikan, Erdbeben, Flut etc. @de
definition: Olika former av olyckor och skador som orsakas av händelser i naturen. @se
definition: Incidentes destrutivos causados pela natureza - furacões, sismos, inundações, etc. @pt-pt
definition: Incidentes destrutivos causados pela natureza - furacões, sismos, inundações etc. @pt-br
definition: Ødelæggende hændelse der er forudsaget af begivenheder i naturen, som orkan, jordskælv og oversvømmelse. @dk
definition: 由自然本身造成的破坏性事件，例如飓风、地震、洪水等 @zh-hans
in scheme: Media Topic
created: 2009-10-22T02:00:00+00:00
modified: 2021-02-18T12:00:00+00:00
broader: disaster
narrower: drought
narrower: earthquake
narrower: flood
narrower: landslide
narrower: meteorological disaster
narrower: volcanic eruption
narrower: tsunami

wildfire
type: Concept
preferred label: Skogsbrand @se
preferred label: incêndio florestal @pt-pt
preferred label: skovbrand @dk
preferred label: 野火 @zh-hans
preferred label: skog-, lyng- og gressbrann @no-nb
preferred label: Flächenbrand @de
preferred label: Feu de forêt @fr
preferred label: Incendio forestal @es
preferred label: حرائق الغابات @ar
preferred label: skog-, lyng- og grasbrann @no-nn
definition: An uncontrolled fire in an area of combustible vegetation
definition: Brand som i huvudsak gäller vegetation (skog) som brinner ner. @se
definition: Incêndio incontrolável em área de vegetação combustível no campo ou em zona rural. @pt-pt
definition: Brand, der hovedsageligt rammer vegetation (skov). @dk
definition: 也译：山火。在乡村或郊野的可燃植被地区发生的不受控制的火灾 @zh-hans
definition: Ein unkontrolliertes Feuer in einem Gebiet mit brennbarer Vegetation @de
in scheme: Media Topic
created: 2019-04-06T12:00:00+00:00
modified: 2021-07-12T12:00:00+00:00
broader: fire

drought
type: Concept
preferred label: Sécheresse @fr
preferred label: Dürre @de
preferred label: جفاف @ar
preferred label: Sequía @es
preferred label: Torka @se
preferred label: seca @pt-pt
preferred label: tørke @dk
preferred label: 旱灾 @zh-hans
definition: När vattnet tar slut i ett område och det går så långt att mark och växter tar skada. @se
definition: A severe lack of water over a period of time
definition: Ein schwerer Mangel an Wasser über einen bestimmten Zeitraum @de
definition: Grave falta de água durante determinado período de tempo. @pt-pt
definition: Alvorlig mangel på vand over en periode. @dk
definition: 一段时间内严重缺水 @zh-hans
in scheme: Media Topic
created: 2009-10-22T02:00:00+00:00
modified: 2021-02-18T12:00:00+00:00
broader: natural disaster

earthquake
type: Concept
preferred label: Tremblement de terre @fr
preferred label: زلزال @ar
preferred label: Erdbeben @de
preferred label: Jordbävningar @se
preferred label: Sismo @es
preferred label: sismo @pt-pt
preferred label: terremoto @pt-br
preferred label: jordskælv @dk
preferred label: 地震 @zh-hans
preferred label: jordskjelv @no-nb
definition: Die Bewegung der Erdplatten, die in manchen Fällen eine Zerstörung der Oberfläche verursacht @de
definition: The shifting of the tectonic plates of the Earth, creating in some cases damage to structures
definition: Rörelser i jordens kontinentalplattor som orsakar skador på ytan. Storleken mäts enligt Richterskalan. @se
definition: Vibração da superfície terrestre resultante de movimentos de placas tectónicas, de atividade vulcânica ou da migração de gases no interior da Terra, principalmente metano. @pt-pt
definition: Movimentos das placas tectônicas da crosta terrestre, que, em alguns casos, provocam danos nas estruturas. @pt-br
definition: Bevægelser i jordens kontinentale plader, der forårsager skade på overfladen. @dk
definition: 地球构造板块的移动，在某些情况下会对地质结构造成损害 @zh-hans
in scheme: Media Topic
created: 2009-10-22T02:00:00+00:00
modified: 2021-02-18T12:00:00+00:00
broader: natural disaster

flood
type: Concept
preferred label: فيضانات @ar
preferred label: Inondation @fr
preferred label: Översvämning @se
preferred label: Inundaciones @es
preferred label: Hochwasser @de
preferred label: inundações @pt-pt
preferred label: oversvømmelse @dk
preferred label: 水灾 @zh-hans
preferred label: flom @no-nb
preferred label: flaum @no-nn
definition: När vattennivån stiger över marken intill vattendraget. Kan exempelsvis orsakas av snösmältning, kraftigt regn eller havsvågor. @se
definition: Übermaß an Wasser, verursacht durch schwere Regenfälle oder Schneeschmelze, in der Regel an Orten, wo es nicht gewünscht ist @de
definition: Surfeit of water, caused by heavy rains or melting snow, usually in places where it's not wanted
definition: Excesso de água, causado por chuvas intensas ou por neve derretida. @pt-pt
definition: Overflod af vand forårsaget af kraftig regn eller smeltende sne, normalt på steder, hvor det ikke er ønsket. @dk
definition: 暴雨或融雪造成的水过剩 @zh-hans
in scheme: Media Topic
created: 2009-10-22T02:00:00+00:00
modified: 2021-02-18T12:00:00+00:00
broader: natural disaster

landslide
type: Concept
preferred label: Erdrutsch @de
preferred label: Glissement de terrain @fr
preferred label: Jordskred @se
preferred label: Deslizamiento de terreno @es
preferred label: انزلاق @ar
preferred label: deslizamento de terra @pt-pt
preferred label: jordskred @dk
preferred label: 滑坡 @zh-hans
preferred label: ras @no-nb
definition: Plötzliches Verrutschen von großen Schnee- oder Erdmassen @de
definition: Sudden dislodging of massive amounts of snow or soil
definition: När större mängder jord och/eller grus släpper och rasar ned. @se
definition: A deslocação repentina de quantidades massivas de neve e terra. @pt-pt
definition: Store mængder jord og/eller grus, der falder sammen. @dk
definition: 积雪或土壤大规模滑落 @zh-hans
in scheme: Media Topic
created: 2009-10-22T02:00:00+00:00
modified: 2021-02-18T12:00:00+00:00
broader: natural disaster
narrower: avalanche
broad match: http://cv.iptc.org/newscodes/subjectcode/03015002

meteorological disaster
type: Concept
preferred label: كارثة تقلبات جوية @ar
preferred label: Väderkatastrofer @se
preferred label: Desastre meteorológico @es
preferred label: Unwetter @de
preferred label: Désastre météorologique @fr
preferred label: desastre meteorológico @pt-pt
preferred label: meteorologisk katastrofe @dk
preferred label: 气象灾害 @zh-hans
preferred label: ekstremvær @no-nb
preferred label: ekstremvêr @no-nn
definition: Eine wetterbedingte Katastrophe @de
definition: Olika former av olyckor och skador som orsakas av vädret. @se
definition: A weather-related disaster
definition: Desastre relacionado com o clima. @pt-pt
definition: Desastre relacionado ao clima. @pt-br
definition: Forskellige katestrofer forårsaget af vejret. @dk
definition: 与天气有关的灾难 @zh-hans
in scheme: Media Topic
created: 2009-10-22T02:00:00+00:00
modified: 2021-02-18T12:00:00+00:00
broader: natural disaster
narrower: windstorms
narrower: hurricane

volcanic eruption
type: Concept
preferred label: Vulkanutbrott @se
preferred label: انفجار بركان @ar
preferred label: Vulkanausbruch @de
preferred label: Erupción volcánica @es
preferred label: Éruption volcanique @fr
preferred label: erupção vulcânica @pt-pt
preferred label: vulkanudbrud @dk
preferred label: 火山喷发 @zh-hans
preferred label: vulkanutbrudd @no-nb
preferred label: vulkanutbrot @no-nn
definition: Bruch in der Erdkruste, aus dem geschmolzenes Material an der Oberfläche ausgeworfen wird @de
definition: Utgjutandet och utslungandet av magmatiskt material på jordytan. @se
definition: A rupture in the crust of the Earth allowing molten material to escape to the surface
definition: Rutura da crosta terrestre que permite a emissão de material derretido para a superfície. @pt-pt
definition: Ruptura da crosta terrestre que permite a emissão de material derretido para a superfície. @pt-br
definition: Udbrud af magmatisk materiale fra jordens indre. @dk
definition: 地球表面的破裂使熔化的物质喷发到地表 @zh-hans
in scheme: Media Topic
created: 2009-10-22T02:00:00+00:00
modified: 2021-07-12T12:00:00+00:00
broader: natural disaster

tsunami
type: Concept
preferred label: Tsunami @es
preferred label: تسونامي @ar
definition: High and powerful ocean waves caused by an underwater land disturbance, such as an earthquake or volcanic eruption, known to cause significant damage and loss when they hit land
definition: Stor og kraftig bølgje i sjøen som følgje av jordskjelv eller underjordisk vulkautbrot. @no-nn
definition: Stor og kraftig bølge i sjøen som følge av jordskjelv eller underjordisk vulkautbrudd. @no-nb
definition: En tsunami, även kallad flodvåg, är en typ av vattenvåg som uppkommer vid en vertikal förskjutning av stora vattenmassor, i de flesta fall på grund av seismisk aktivitet på havsbottnen. @se
definition: Hohe und starke Meereswellen, die durch eine Unterwasserstörung an Land verursacht werden, wie z. B. ein Erdbeben oder einen Vulkanausbruch, und die beim Auftreffen auf Land erhebliche Schäden und Verluste verursachen können @de
in scheme: Media Topic
created: 2022-02-03T12:00:00+00:00
modified: 2022-02-03T12:00:00+00:00
broader: natural disaster

avalanche
type: Concept
preferred label: Laviner @se
preferred label: انهيار @ar
preferred label: Avalanche @fr
preferred label: Lawine @de
preferred label: Avalancha @es
preferred label: avalancha @pt-br
preferred label: lavine @dk
preferred label: 雪崩（山崩） @zh-hans
preferred label: snøskred @no-nb
definition: A sudden fall of snow, ice, rock, or mud down the side of a mountain
definition: Plötzlicher Schneefall, Eis, Steinschlag oder Schlamm von einem Berg herunter @de
definition: När snö samlats på en sluttning och plötsligt släppper och rasar ned. @se
definition: A queda repentina de neve, gelo, rochas ou lama de uma montanha. @pt-pt
definition: Ophobet sne, der pludselig skrider ned af en bjerg side eller skråning. @dk
definition: 雪、冰、岩石或泥土突然从山的一侧滑落 @zh-hans
in scheme: Media Topic
created: 2009-10-22T02:00:00+00:00
modified: 2021-02-18T12:00:00+00:00
broader: landslide
broad match: http://cv.iptc.org/newscodes/subjectcode/03015002

windstorms
type: Concept
preferred label: Stormar @se
preferred label: Tempête @fr
preferred label: Tempestad @es
preferred label: عواصف @ar
preferred label: Orkan @de
preferred label: tempestade ciclónica @pt-pt
preferred label: tempestade ciclônica @pt-br
preferred label: storm @dk
preferred label: 暴风 @zh-hans
definition: Sturm mit hoher Geschwindigkeit, aber ohne das gewaltige Tempo eines Hurrikans, mit wenig oder ohne Regen oder Hagel. Meistens stark zerstörerisch @de
definition: Väder med mycket hård vind, ofta med förstörelse som följd. @se
definition: A storm with very strong wind but little or no rain or snow
definition: Fenómeno atmosférico caracterizado por ventos fortes, geralmente com pouca chuva, que pode ser altamente destrutivo. @pt-pt
definition: Tempestade de grande velocidade mas sem furacões e com pouca chuva ou granizo. Altamente destrutiva. @pt-br
definition: Vejr med meget stærk vind, ofte med ødelæggelse som et resultat. @dk
definition: 一种高速但非飓风的风暴，空气运动很少或没有雨或冰雹，通常具有很强破坏性 @zh-hans
in scheme: Media Topic
created: 2009-10-22T02:00:00+00:00
modified: 2021-05-05T12:00:00+00:00
broader: meteorological disaster

hurricane
type: Concept
preferred label: orkan @dk
preferred label: Orkan @se
preferred label: 飓风 @zh-hans
preferred label: furacão @pt-pt
preferred label: Hurrikan @de
preferred label: Ouragan @fr
preferred label: Huracán @es
preferred label: إعصار @ar
definition: A type of storm also called a tropical cyclone, which forms over tropical or subtropical waters
definition: En voldsom og potentielt ødelæggende storm, som dannes over tropiske eller subtropiske havområder. @dk
definition: En typ av tropisk storm där vindstyrkan överstiger 32,7 m/s. @se
definition: 一种发生在热带和亚热带地区强大而深厚的热带气旋 @zh-hans
definition: Tipo de tempestade, também chamado ciclone tropical, que se forma sobre águas tropicais ou subtropicais. @pt-pt
definition: Tipo de tempestade, também chamado de ciclone tropical, que se forma sobre águas tropicais ou subtropicais. @pt-br
definition: Eine Art von Sturm, auch tropischer Wirbelsturm genannt, der sich über tropischen oder subtropischen Gewässern bildet @de
definition: Også kjend som tropisk syklon, ein stormtype som blir danna over tropiske eller subtropiske havområde. @no-nn
definition: En type storm også kjent som tropisk syklon, som dannes over tropiske eller subtropiske havområder. @no-nb
in scheme: Media Topic
created: 2019-10-07T12:00:00+00:00
modified: 2021-07-12T12:00:00+00:00
broader: meteorological disaster

transport incident
type: Concept
preferred label: Transportnotfall @de
preferred label: Incident de transport @fr
preferred label: Incidente de transporte @es
preferred label: حادثة نقل @ar
preferred label: acidente de transporte @pt-pt
preferred label: transporthændelse @dk
preferred label: 交通运输事件 @zh-hans
preferred label: transportulykke @no-nb
definition: An incident involving one or more vehicles
definition: Notfall bei dem ein oder mehrere Fahrzeuge verwickelt sind @de
definition: Um acidente que envolve um ou mais veículos. @pt-pt
definition: En hændelse, der involverer et eller flere køretøjer. @dk
definition: 涉及一辆或多辆汽车的意外事件 @zh-hans
change note: Change Note 2015-08-27: This concept was merged into concept medtop:20000143 as their semantics were not sufficiently different
in scheme: Media Topic
created: 2009-10-22T02:00:00+00:00
retired: 2015-08-27T12:00:00+00:00
modified: 2021-12-21T12:00:00+00:00
broader: emergency incident
narrower: air and space incident
narrower: maritime incident
narrower: railway incident
narrower: road incident
broad match: http://cv.iptc.org/newscodes/subjectcode/03010000

air and space incident
type: Concept
preferred label: حادثة جوية او فضائية @ar
preferred label: Incident aérien @fr
preferred label: Flugnotfall @de
preferred label: Incidentes aéreos y espaciales @es
preferred label: acidente aéreo ou espacial @pt-pt
preferred label: acidente aéreo e espacial @pt-br
preferred label: luft- og rumfartshændelse @dk
preferred label: 航空和航天事件 @zh-hans
preferred label: fly- og romfartsulykke @no-nb
definition: Notfall mit Fahrzeugen im Luft- oder Weltraum @de
definition: Incident involving craft in air or space.
definition: Um acidente que envolve uma nave aérea ou espacial. @pt-pt
definition: En hændelse, der involverer fartøjer i luft eller rum. @dk
definition: 涉及飞行器在空中或太空中的事件 @zh-hans
change note: Change Note 2015-08-27: This concept was merged into concept medtop:20000144 as their semantics were not sufficiently different
in scheme: Media Topic
created: 2009-10-22T02:00:00+00:00
retired: 2015-08-27T12:00:00+00:00
modified: 2021-12-21T12:00:00+00:00
broader: transport incident
broad match: http://cv.iptc.org/newscodes/subjectcode/03010003

maritime incident
type: Concept
preferred label: Incidentes marítimos @es
preferred label: Schiffsnotfall @de
preferred label: حادثة بحرية @ar
preferred label: Incident maritime @fr
preferred label: acidente marítimo @pt-pt
preferred label: maritim hændelse @dk
preferred label: 海上事件 @zh-hans
preferred label: maritim hendelse @no-nb
preferred label: maritim hending @no-nn
definition: Incident involving marine vessels.
definition: Notfall mit Wasserfahrzeugen @de
definition: Acidente que envolve embarcações marítimas. @pt-pt
definition: En hændelse, der involverer maritime fartøjer. @dk
definition: 涉及海运船舶的事件 @zh-hans
definition: Hending som involverer båtar eller skip. @no-nn
definition: Hendelse som involverer båter eller skip @no-nb
change note: Change Note 2015-08-27: This concept was merged into concept medtop:20000145 as their semantics were not sufficiently different
in scheme: Media Topic
created: 2009-10-22T02:00:00+00:00
retired: 2015-08-27T12:00:00+00:00
modified: 2021-12-21T12:00:00+00:00
broader: transport incident
broad match: http://cv.iptc.org/newscodes/subjectcode/03010004

railway incident
type: Concept
preferred label: حادثة قطار @ar
preferred label: Bahnnotfall @de
preferred label: Incident ferroviaire @fr
preferred label: Incidentes ferroviarios @es
preferred label: acidente ferroviário @pt-pt
preferred label: jernbanehændelse @dk
preferred label: 铁路事件 @zh-hans
preferred label: togulykke @no-nb
definition: Notfall mit Zügen @de
definition: Incident involving trains.
definition: Acidente que envolve comboios. @pt-pt
definition: En hændelser, der involverer jernbanekøretøjer. @dk
definition: 涉及火车的事件 @zh-hans
change note: Change Note 2015-08-27: This concept was merged into concept medtop:20000146 as their semantics were not sufficiently different
in scheme: Media Topic
created: 2009-10-22T02:00:00+00:00
retired: 2015-08-27T12:00:00+00:00
modified: 2021-12-21T12:00:00+00:00
broader: transport incident
broad match: http://cv.iptc.org/newscodes/subjectcode/03010002

road incident
type: Concept
preferred label: Verkehrsnotfall @de
preferred label: حادثة سير @ar
preferred label: Incidentes carreteros @es
preferred label: Incident routier @fr
preferred label: acidente rodoviário @pt-pt
preferred label: vejnetshændelse @dk
preferred label: 道路事件 @zh-hans
preferred label: trafikkulykke @no-nb
definition: Notfall im Straßenverkehr @de
definition: Incident involving road vehicles.
definition: Acidente que envolve veículos terrestres. @pt-pt
definition: En hændelse, der involvere køretøjer på veje. @dk
definition: 涉及道路车辆的事件 @zh-hans
change note: Change Note 2015-08-27: This concept was merged into concept medtop:20000147 as their semantics were not sufficiently different
in scheme: Media Topic
created: 2009-10-22T02:00:00+00:00
retired: 2015-08-27T12:00:00+00:00
modified: 2021-12-21T12:00:00+00:00
broader: transport incident
broad match: http://cv.iptc.org/newscodes/subjectcode/03010001

business finance
type: Concept
preferred label: Unternehmenszahlen @de
preferred label: Finanzas empresariales @es
preferred label: Vie des entreprises @fr
preferred label: Företagsekonomi @se
preferred label: تمويل اعمال تجارية @ar
preferred label: finanças empresariais @pt-pt
preferred label: virksomhedsfinansiering @dk
preferred label: 企业财务 @zh-hans
preferred label: selskapsøkonomi @no-nb
definition: Ett företags ekonomiska situation. @se
definition: Die Finanzen eines Unternehmens @de
definition: A business entity's finances
definition: As finanças de uma entidade empresarial. @pt-pt
definition: Virksomhedens økonomiske situation. @dk
definition: 企业实体的财务状况 @zh-hans
in scheme: Media Topic
created: 2009-10-22T02:00:00+00:00
retired: 2023-03-31T12:00:00+00:00
modified: 2023-03-31T12:00:00+00:00
broader: business information
narrower: analysts comment
broad match: http://cv.iptc.org/newscodes/subjectcode/04000000

business financing
type: Concept
preferred label: Financement et vente d'actions @fr
preferred label: Financiamiento, ofertas de acciones @es
preferred label: Nyemissioner @se
preferred label: Aktien @de
preferred label: عرض تمويل واسهم @ar
preferred label: financiamento e oferta de ações @pt-pt
preferred label: emission @dk
preferred label: 公司金融 @zh-hans
preferred label: selskapsfinansiering @no-nb
definition: Neues Wertpapierangebot, inklusive öffentliche Erstangebote @de
definition: Erbjudande om försäljning av nyutgivna aktier, till exempel i samband med en börsintroduktion, för att kapitalisera ett bolag. @se
definition: The financing, capital structuring, and investment decisions of a business
definition: Novas oferta de ações, incluindo ofertas públicas iniciais. @pt-pt
definition: Tilbud til eksisterende eller nye aktionærer om at købe nyudstedte aktier. @dk
definition: 企业的融资、资本结构和投资决策管理 @zh-hans
in scheme: Media Topic
created: 2009-10-22T02:00:00+00:00
modified: 2023-03-31T12:00:00+00:00
broader: business information
narrower: bankruptcy
narrower: financially distressed company
narrower: restructuring and recapitalisation
narrower: securities
narrower: stocks and securities
narrower: crowdfunding
narrower: corporate bond

human resources
type: Concept
preferred label: Personal @se
preferred label: Ressources humaines @fr
preferred label: Recursos humanos @es
preferred label: موارد بشرية @ar
preferred label: recursos humanos @pt-pt
preferred label: HR (menneskelige ressourcer) @dk
preferred label: 人力资源 @zh-hans
preferred label: menneskelige ressurser (HR) @no-nb
preferred label: menneskelege ressursar (HR) @no-nn
definition: Personal eines Unternehmens und wie sie geführt werden @de
definition: Personer som jobbar för ett företag och hur de hanteras. @se
definition: People working for a business and how they are managed
definition: As pessoas que trabalham para uma empresa e a maneira como são geridas. @pt-pt
definition: Personer, der arbejder for et firma, og hvordan de styres. @dk
definition: 为企业工作的人以及他们是如何被管理的 @zh-hans
in scheme: Media Topic
created: 2009-10-22T02:00:00+00:00
modified: 2021-02-18T12:00:00+00:00
broader: business information
narrower: layoffs and downsizing
narrower: executive officer
broad match: http://cv.iptc.org/newscodes/subjectcode/09000000

business strategy and marketing
type: Concept
preferred label: Marketing @de
preferred label: استراتيجية وتسويق @ar
preferred label: Marknadsföringsstrategi @se
preferred label: Stratégie et marketing @fr
preferred label: Estrategia y marketing @es
preferred label: estratégia e marketing @pt-pt
preferred label: strategi og markedsføring @dk
preferred label: 经营战略和市场营销 @zh-hans
definition: Planning the direction of a company and selling its products and services to achieve the strategy
definition: Planering av ett företags mål och försäljning av dess varor och tjänster för att uppnå målen. @se
definition: Planung der Ausrichtung eines Unternehmens und der Marketingstrategie für Produkte und Dienstleistungen um diese zu erreichen @de
definition: Planeamento da direção de uma empresa e venda dos seus produtos e serviços para cumprir a estratégia. @pt-pt
definition: Planejamento da direção de uma empresa e venda dos seus produtos e serviços para cumprir a estratégia. @pt-br
definition: Planlægning af en virksomheds mål og salg af sine varer og tjenester for at nå disse mål. @dk
definition: 规划经营方向、产品和服务来实现公司战略的行为 @zh-hans
in scheme: Media Topic
created: 2009-10-22T02:00:00+00:00
modified: 2023-03-31T12:00:00+00:00
broader: business information
narrower: commercial contract
narrower: economic globalisation
narrower: licensing agreement
narrower: new product or service
narrower: patent, copyright and trademark
narrower: product recall
narrower: research and development
narrower: market research
narrower: market trend
narrower: public contract
narrower: client relationship management
narrower: outsourcing
broad match: http://cv.iptc.org/newscodes/subjectcode/04016029

business governance
type: Concept
preferred label: Gouvernance @fr
preferred label: Bolagsstyrning @se
preferred label: Gobernanza @es
preferred label: Unternehmensrecht @de
preferred label: حكم رشيد @ar
preferred label: gestão empresarial @pt-pt
preferred label: virksomhedsledelse @dk
preferred label: 公司治理 @zh-hans
preferred label: selskaps- og eierstyring @no-nb
preferred label: selskaps- og eigarstyring @no-nn
definition: Tankegångar och bestämmelser om hur bolag ska ägas och styras. @se
definition: The rules, practices, and processes used to oversee and manage a company
definition: Art und Weise wie ein Unternehmen funktioniert und alle Regeln dazu @de
definition: O modo como funciona uma empresa e quaisquer regras a que esteja obrigada. @pt-pt
definition: Tanker og regler om, hvordan virksomheder skal ejes og styres. @dk
definition: 企业运作方式及其应遵循的规则 @zh-hans
in scheme: Media Topic
created: 2009-10-22T02:00:00+00:00
modified: 2023-03-31T12:00:00+00:00
broader: business information
narrower: proxy filing
narrower: shareholder activity
narrower: annual and special corporate meeting
narrower: annual report
narrower: board of directors
narrower: environmental, social and governance policy (ESG)
broad match: http://cv.iptc.org/newscodes/subjectcode/04016027

business reporting and performance
type: Concept
preferred label: selskapsrapportering @no-nb
preferred label: Delårsrapport @se
preferred label: Geschäftsbericht und Leistung @de
definition: Measuring and reporting on the performance of a business
definition: Regelbunden redovisning av hur ett företag utvecklas. @se
definition: Messung und Berichterstattung über die Leistung eines Unternehmens @de
in scheme: Media Topic
created: 2023-03-31T12:00:00+00:00
modified: 2023-03-31T12:00:00+00:00
broader: business information
narrower: accounting and audit
narrower: credit rating
narrower: corporate earnings
narrower: earnings forecast
narrower: financial statement

business restructuring
type: Concept
preferred label: restrukturering @no-nb
preferred label: Företagsombildning @se
preferred label: Unternehmensumstrukturierung @de
definition: Changes to the structure of a business or organisation
definition: Ändring av ett företags eller organisations struktur. @se
definition: Änderungen in der Struktur eines Unternehmens oder einer Organisation @de
in scheme: Media Topic
created: 2023-03-31T12:00:00+00:00
modified: 2023-03-31T12:00:00+00:00
broader: business information
narrower: company spin-off
narrower: joint venture
narrower: leveraged buyout
narrower: management buyout
narrower: merger or acquisition

analysts comment
type: Concept
preferred label: Comentarios de analistas @es
preferred label: تعليق محللين @ar
preferred label: Commentaires d'analystes @fr
preferred label: Aktieanalyser @se
preferred label: Analyst @de
preferred label: comentários de analistas @pt-pt
preferred label: aktieanalyse @dk
preferred label: 分析师评论 @zh-hans
preferred label: børskommentar @no-nb
definition: Kommentare von Analysten zu Aktien, Analysen und Empfehlungen @de
definition: Stock analyst comments, analysis and recommendations.
definition: Råd om och analyser av aktier och fonder. @se
definition: Comentários de analistas da bolsa, análises e recomendações. @pt-pt
definition: Aktieanalytikeres kommentarer og anbefalinger. @dk
definition: 股票分析师的评论、分析和建议 @zh-hans
change note: Retired. Use medtop:20000396 stocks and securities and/or genre:Analysis instead.
in scheme: Media Topic
created: 2009-10-22T02:00:00+00:00
retired: 2023-03-31T12:00:00+00:00
modified: 2023-03-31T12:00:00+00:00
broader: business finance

accounting and audit
type: Concept
preferred label: Contabilidad y auditoría @es
preferred label: Redovisning och revision @se
preferred label: محاسبة ومراجعة حسابات @ar
preferred label: Buchführung @de
preferred label: Comptabilité et audit @fr
preferred label: contabilidade e auditoria @pt-pt
preferred label: virksomhedsrevision @dk
preferred label: 会计和审计 @zh-hans
preferred label: regnskap og revisjon @no-nb
preferred label: rekneskap og revisjon @no-nn
definition: Changes regarding applicable accounting rules and the audit of accounting
definition: Änderungen der Regeln im Rechnungswesen und der Rechnungsprüfung @de
definition: Registrering av ett företags eller en organisations inkomster, utgifter, skulder och tillgångar samt kontroll av detta. @se
definition: Alterações relativas aos princípios contabilísticos geralmente aceites e à auditoria de contabilidade. @pt-pt
definition: Alterações relativas aos princípios contábeis geralmente aceites e à auditoria de contabilidade. @pt-br
definition: Registrering af en virksomheds eller organisations indtægter, udgifter, forpligtelser og aktiver og kontrol heraf. @dk
definition: 适用会计准则和会计审计的变更 @zh-hans
change note: Retired. Use medtop:20001365 business reporting and performance or medtop:20000272 accountancy and auditing instead.
in scheme: Media Topic
created: 2009-10-22T02:00:00+00:00
retired: 2023-03-31T12:00:00+00:00
modified: 2023-03-31T12:00:00+00:00
broader: business reporting and performance

bankruptcy
type: Concept
preferred label: Konkurser @se
preferred label: Insolvenz @de
preferred label: Défaillance d'entreprise @fr
preferred label: Quiebra @es
preferred label: افلاس @ar
preferred label: falência @pt-pt
preferred label: konkurs @dk
preferred label: 破产 @zh-hans
definition: Nachrichten über aktuelle Einreichungen von Zahlungsunfähigkeit @de
definition: Organisations that cannot pay their debts and file for special treatment by governments and financial systems
definition: Nyheter om konkursansökningar. @se
definition: Notícias sobre declarações de bancarrota. @pt-pt
definition: Vurdering af en virksomheds økonomiske status og evne til at afvikle lån. @dk
definition: 关于实际破产申请的新闻 @zh-hans
definition: News about actual bankruptcy filings.
in scheme: Media Topic
created: 2009-10-22T02:00:00+00:00
modified: 2023-03-31T12:00:00+00:00
broader: business financing

stock buyback
type: Concept
preferred label: Recompra de acciones @es
preferred label: اعادة شراء @ar
preferred label: Rachat d'actions @fr
preferred label: Aktienrückkauf @de
preferred label: Aktieåterköp @se
preferred label: recompra @pt-pt
preferred label: tilbagekøb @dk
preferred label: 回购 @zh-hans
preferred label: tilbakekjøp av aksjer @no-nb
preferred label: tilbakekjøp av aksjar @no-nn
definition: Program där ett bolag köper tillbaka aktier i det egna bolaget från aktieägarna. @se
definition: Aktienrückkaufprogramme. Dies sollte von Aktienbewegung getrennt werden @de
definition: Corporate actions in which companies buy back their own shares
definition: Notícias sobre programas de recompra de ações. Deve ser mantido distinto de atividade bolsista (ver abaixo). @pt-pt
definition: Program, hvor et selskab genkøber aktier i sit eget selskab fra aktionærerne. @dk
definition: 股票回购计划，需与股市动态区分开 @zh-hans
in scheme: Media Topic
created: 2009-10-22T02:00:00+00:00
modified: 2023-03-31T12:00:00+00:00
broader: stocks and securities

stocks and securities
type: Concept
preferred label: Actions @fr
preferred label: اسهم @ar
preferred label: Acciones @es
preferred label: Aktier @se
preferred label: Aktien @de
preferred label: ações @pt-pt
preferred label: aktie @dk
preferred label: 股票 @zh-hans
preferred label: aksjer og verdipapirer @no-nb
preferred label: aksjar og verdipapir @no-nn
definition: Andel med fast storlek i aktiebolag lika stor som alla andra andelar, ger rösträtt på bolagsstämma och del i vinst. @se
definition: Financial instruments such as company shares and bonds
definition: Firmenpapier, das einer Einzelperson das Eigentumsrecht auf einen Gewinnanteil verleiht @de
definition: Documento empresarial que outorga a um indivíduo os direitos de propriedade de uma determinada parte dos ganhos de uma empresa. @pt-pt
definition: Virksomhedspapir, der giver den enkelte en ejendomsret til en del af en virksomheds indtjening. @dk
definition: 一种公司票据，它赋予个人对公司部分收益的所有权 @zh-hans
definition: Verdipapir som gir innehavaren rett til ein del av overskotet i eit selskap, og som vanlegvis gir stemmerett på generalforsamlinga. @no-nn
definition: Verdipapirer som gir innehaveren rett til en del av et selskaps overskudd og som regel gir stemmerett på generalforsamlingen. @no-nb
in scheme: Media Topic
created: 2009-10-22T02:00:00+00:00
modified: 2024-07-01T12:00:00+00:00
broader: business financing
narrower: stock buyback
narrower: corporate dividends
narrower: stock activity
narrower: stock flotation
narrower: derivatives
narrower: stock recommendation
narrower: hot stock

credit rating
type: Concept
preferred label: Notation @fr
preferred label: Clasificación financiera @es
preferred label: Kreditvärdering @se
preferred label: Kreditrating @de
preferred label: تصنيف ائتماني @ar
preferred label: notação de risco @pt-pt
preferred label: kreditvurdering @dk
preferred label: 信用评级 @zh-hans
preferred label: kredittvurdering @no-nb
definition: Formelle Stellungnahmen von verschiedenen Agenturen, die Ratings durchführen über das Investitionsrisiko einer Firma oder eines Unternehmens @de
definition: Formal statements by certain rating agencies on the investment risk of a company or enterprise
definition: Granskning av en juridisk person för att bedöma dess ekonomiska status och förmåga att klara lån. @se
definition: Declarações formais feitas por certas agências, como a Standard & Poor's, sobre o risco de investimento de uma companhia, país ou empresa. @pt-pt
definition: Gennemgang af en juridisk enhed for at vurdere dens økonomiske status og evne til at afvikle lån. @dk
definition: 评级机构就公司或企业的投资风险作出的正式声明 @zh-hans
in scheme: Media Topic
created: 2009-10-22T02:00:00+00:00
modified: 2023-03-31T12:00:00+00:00
broader: business reporting and performance

corporate dividends
type: Concept
preferred label: Anuncios de dividendos @es
preferred label: Dividende @de
preferred label: اعلان ارباح @ar
preferred label: Dividendes @fr
preferred label: Aktieutdelningar @se
preferred label: anúncio de dividendos @pt-pt
preferred label: udbyttebekendtgørelse @dk
preferred label: 分红公告 @zh-hans
preferred label: selskapsutbytte @no-nb
definition: Ankündigungen von Dividendenauszahlungen @de
definition: Besked om utbetalning av aktieutdelning. @se
definition: Distribution of company profits to shareholders via dividend payments
definition: Anúncios relativos à distribuição de dividendos. @pt-pt
definition: Meddelelse om udbetaling af udbytte. @dk
definition: 关于支付分红的公告 @zh-hans
in scheme: Media Topic
created: 2009-10-22T02:00:00+00:00
modified: 2023-03-31T12:00:00+00:00
broader: stocks and securities

corporate earnings
type: Concept
preferred label: Finansiella resultat @se
preferred label: ارباح @ar
preferred label: Beneficios @es
preferred label: Résultats @fr
preferred label: Gewinn @de
preferred label: lucros @pt-pt
preferred label: finansielle resultater @dk
preferred label: 收益 @zh-hans
preferred label: selskapsresultat @no-nb
definition: Announcements and discussions of corporate earnings
definition: Jede Steigerung des Umsatzergebnisses @de
definition: Rapporter om företags finansiella resultat. @se
definition: Qualquer comunicado sobre os lucros de uma empresa. @pt-pt
definition: Todo comunicado sobre os lucros de uma empresa. @pt-br
definition: Alle offentliggørelser af finansielle resultater. Der er ikke tale om regnskabsaflægning, men blot om indtjening eller salgstal. @dk
definition: 任何盈利结果的发布 @zh-hans
in scheme: Media Topic
created: 2009-10-22T02:00:00+00:00
modified: 2023-03-31T12:00:00+00:00
broader: business reporting and performance

earnings forecast
type: Concept
preferred label: تقديرات ارباح @ar
preferred label: Previsión de beneficios @es
preferred label: Resultatprognoser @se
preferred label: Prévisions de résultats @fr
preferred label: Gewinnprognose @de
preferred label: previsão de lucros @pt-pt
preferred label: indtjeningsforventninger @dk
preferred label: 收益预期 @zh-hans
preferred label: resultatprognose @no-nb
definition: Analytikers förväntningar på företags finansiella resultat. @se
definition: Vorhersage von Firmenumsätzen durch Analysten @de
definition: Analyst prediction of company earnings.
definition: Previsões dos analistas sobre os lucros de empresas. @pt-pt
definition: Analytikeres eller virksomhedens egne forventninger til økonomiske resultater. @dk
definition: 分析师对公司收益的预测 @zh-hans
change note: Retired. Use medtop:20000178 corporate earnings instead.
in scheme: Media Topic
created: 2009-10-22T02:00:00+00:00
retired: 2023-03-31T12:00:00+00:00
modified: 2023-03-31T12:00:00+00:00
broader: business reporting and performance

financial statement
type: Concept
preferred label: Bokslut @se
preferred label: Communiqué de résultats @fr
preferred label: Resultados empresariales @es
preferred label: Finanzbericht @de
preferred label: بيان مالي @ar
preferred label: relatório financeiro @pt-pt
preferred label: demonstração financeira @pt-br
preferred label: virksomhedsregnskab @dk
preferred label: 财务报表 @zh-hans
preferred label: finansregnskap @no-nb
preferred label: finansrekneskap @no-nn
definition: Sammanställning av en juridisk persons ekonomiska ställning gällande helår eller delar av året. @se
definition: Formale Aussagen über die Verwertung und den Inhalt von Quartals- oder Halbjahresbilanzen von Firmen @de
definition: Formal statements about the company financials typically delivered annually or quarterly
definition: Relatórios formais sobre o estado financeiro da empresa, apresentados geralmente anual ou trimestralmente. @pt-pt
definition: Regnskab fra en virksomhed. Offentliggøres kvartalsvis, halvårligt eller helårligt. @dk
definition: 关于公司财务状况的正式声明，通常每年或每季度发布一次 @zh-hans
in scheme: Media Topic
created: 2009-10-22T02:00:00+00:00
modified: 2023-03-31T12:00:00+00:00
broader: business reporting and performance

proxy filing
type: Concept
preferred label: Procurations pour assemblées générales @fr
preferred label: Anmeldung von Proxies @de
preferred label: Votación por apoderados @es
preferred label: وكيل ايداع @ar
preferred label: Stämmohandlingar @se
preferred label: declaração de procuração @pt-pt
preferred label: procurações @pt-br
preferred label: generalforsamlingsdokumenter @dk
preferred label: 代理申请 @zh-hans
preferred label: fullmaktsinnsendelse @no-nb
preferred label: fullmaktssinnsending @no-nn
definition: Anmeldungen von Stimmrechtsanteilen von Aktionären bei Aufsichtsbehörden @de
definition: Filings with regulatory agencies of proxy statements for upcoming shareholder votes.
definition: Publicering av handlingar inför en bolagsstämma. @se
definition: Declarações de procurações junto de agências reguladoras para futuras votações de acionistas. @pt-pt
definition: Oversigt over selskabsoplysninger og stemmerettigheder inden en generalforsamling. @dk
definition: 为即将到来的股东投票向监管机构提交代理声明 @zh-hans
in scheme: Media Topic
created: 2009-10-22T02:00:00+00:00
modified: 2023-03-31T12:00:00+00:00
broader: business governance

financially distressed company
type: Concept
preferred label: Finansiella svårigheter @se
preferred label: Empresas con problemas financieros @es
preferred label: Entreprise en difficulté @fr
preferred label: Unternehmenskrise @de
preferred label: شركة منكوبة ماليا @ar
preferred label: empresa com dificuldades financeiras @pt-pt
preferred label: økonomisk nødstedt virksomhed @dk
preferred label: 财务困境 @zh-hans
preferred label: konkurstruet selskap @no-nb
preferred label: konkurstrua selskap @no-nn
definition: Anzeichen dass ein Unternehmen finanziell in Bedrängnis ist, aber noch nicht Insolvenz angemeldet hat @de
definition: Indikationer på att ett företag har det finansiellt svårt, men inte har ansökt om konkurs ännu. @se
definition: Indications that a company is financially distressed but not having filed for bankruptcy yet
definition: Notícias sobre empresas com dificuldades financeiras mas que ainda não declararam falência. @pt-pt
definition: Indikationer om, at et selskab har økonomiske vanskeligheder, men endnu ikke har indgivet konkurs. @dk
definition: 公司财务状况不佳但尚未申请破产 @zh-hans
in scheme: Media Topic
created: 2009-10-22T02:00:00+00:00
modified: 2023-03-31T12:00:00+00:00
broader: business financing

restructuring and recapitalisation
type: Concept
preferred label: Neufinanzierung und Umstrukturierung @de
preferred label: اعادة هيكلة واعادة رسملة @ar
preferred label: Reestructuración, recapitalización @es
preferred label: Restructuration et recapitalisation @fr
preferred label: Omstruktureringar @se
preferred label: reestruturação e recapitalização @pt-pt
preferred label: restrukturering og rekapitalisering @dk
preferred label: 公司重组和资产重组 @zh-hans
preferred label: kapitalinnhenting @no-nb
preferred label: restructuring and recapitalization
definition: Förändring av ett företags struktur, exempelvis genom försäljning eller nedläggning av delar av verksamheten. @se
definition: Verkauf von Unternehmensteilen, Splittung von bestehenden Unternehmen in Teile einer Holding etc. @de
definition: The sale of company units, splits of existing companies into units under a holding company, etc.
definition: Venda de unidades de negócio, separação de empresas existentes em unidades de negócio de holdings, etc. @pt-pt
definition: Venda de unidades de negócio, separação de empresas existentes em unidades de negócio de holdings etc. @pt-br
definition: Ændring i en virksomheds struktur, for eksempel gennem salg eller lukning af dele af virksomheden. @dk
definition: 出售公司单位、将现有公司拆分成控股公司下的单位等 @zh-hans
change note: Use medtop:20001366 business restructuring instead.
in scheme: Media Topic
created: 2009-10-22T02:00:00+00:00
retired: 2023-10-02T12:00:00+00:00
modified: 2023-10-02T12:00:00+00:00
broader: business financing

securities
type: Concept
preferred label: Bourse @fr
preferred label: Valores @es
preferred label: Börse @de
preferred label: سندات مالية @ar
preferred label: Säkerheter @se
preferred label: títulos @pt-pt
preferred label: værdipapir @dk
preferred label: 证券 @zh-hans
preferred label: verdipapir @no-nb
definition: Märkte um festverzinsliche Wertpapiere und Aktien zu handeln @de
definition: Markets for trading types of company paper such as stocks and bonds
definition: Marknad för aktier och obligationer. @se
definition: Mercados para comercializar tipos de documentos como ações e obrigações. @pt-pt
definition: Marked for aktier og obligationer. @dk
definition: 公司股票和债券交易市场 @zh-hans
change note: Retired. Use medtop:20000396 stocks and securities
in scheme: Media Topic
created: 2009-10-22T02:00:00+00:00
retired: 2023-03-31T12:00:00+00:00
modified: 2023-03-31T12:00:00+00:00
broader: business financing
narrower: stock option

crowdfunding
type: Concept
preferred label: Crowfunding @se
preferred label: folkefinansiering @no-nb
preferred label: 众筹 @zh-hans
preferred label: Crowdfunding @de
preferred label: Financement participatif @fr
preferred label: Micromecenazgo @es
preferred label: تمويل تشاركي @ar
definition: The funding of a project or venture by raising small amounts of money from a large number of people, typically via the internet
definition: Metod för att finansiera projekt genom att många personer ställer upp med lite pengar var, ofta i utbyte mot en tidig version av det som ska produceras. @se
definition: Financiamento de um projeto ou empreendimento através da angariação de pequenas quantias de dinheiro de um grande número de pessoas, geralmente pela Internet. @pt-pt
definition: Et projekt, eller virksomhed, der er finansieret igennem små donationer fra en stor mængde mennesker, typisk igennem internettet. @dk
definition: 向大量个人募集小额资金来为项目或企业提供资金，通常通过互联网进行 @zh-hans
definition: Die Finanzierung eines Projekts oder einer Unternehmung durch das Aufbringen kleiner Geldbeträge von einer großen Anzahl von Personen, typischerweise über das Internet @de
in scheme: Media Topic
created: 2020-08-05T12:00:00+00:00
modified: 2023-03-31T12:00:00+00:00
broader: business financing

corporate bond
type: Concept
preferred label: Obligation @se
preferred label: selskapsobligasjoner @no-nb
preferred label: selskapsobligasjonar @no-nn
preferred label: Unternehmensanleihe @de
definition: Corporate paper representing the loan of money at a fixed rate and for a fixed time to that company or government
definition: Ett räntebärande löpande skuldebrev som visar att innehavaren lånat ut pengar till staten, kommuner eller större företag. @se
definition: Unternehmenspapier, das die Ausleihe von Geld zu einem festen Zinssatz und für eine bestimmte Zeit an dieses Unternehmen oder diese Regierung darstellt @de
in scheme: Media Topic
created: 2024-03-28T12:00:00+00:00
modified: 2024-03-28T12:00:00+00:00
broader: business financing

shareholder activity
type: Concept
preferred label: Accionista @es
preferred label: Aktieägare @se
preferred label: Actionnaire @fr
preferred label: مساهم @ar
preferred label: Aktionär @de
preferred label: acionista @pt-pt
preferred label: aktionær @dk
preferred label: 股东 @zh-hans
preferred label: aktivt eierskap @no-nb
preferred label: aktiv eigarskap @no-nn
definition: Inhaber einer oder mehrerer Aktien eines Unternehmens @de
definition: Innehavare av en eller flera aktier i ett företag. @se
definition: Actions taken by owners of one or more shares of a company, including shareholder activism
definition: Qualquer titular de documento emitido por uma empresa, que tem valor variável e que lhe dá direito a dividendos consoante o desempenho da empresa. @pt-pt
definition: Todo titular de documento emitido por uma empresa, que tem valor variável e que lhe dá direito a dividendos consoante o desempenho da empresa. @pt-br
definition: Indehaver af en eller flere aktier i et selskab. @dk
definition: 一个公司的一个或多个股份所有者 @zh-hans
in scheme: Media Topic
created: 2009-10-22T02:00:00+00:00
modified: 2023-03-31T12:00:00+00:00
broader: business governance

stock activity
type: Concept
preferred label: حركة اسهم @ar
preferred label: Aktienbewegung @de
preferred label: Activité du titre @fr
preferred label: Aktiehändelser @se
preferred label: Actividad accionaria @es
preferred label: atividade bolsista @pt-pt
preferred label: aktiebegivenhed @dk
preferred label: 股市动态 @zh-hans
preferred label: børsmeldinger @no-nb
preferred label: børsmeldingar @no-nn
definition: Ankündigung von großen Aktienereignissen: Splits, Blockverkäufe, neue Kurshöhen und Tiefen etc. @de
definition: Kungörelser om stora aktiehändelser, såsom delningar, stoppad handel, nya topp- och bottennoteringar med mera. @se
definition: Announcements of major stock events: splits, block trades, new highs or lows, etc.
definition: Anúncios de eventos bolsistas importantes: divisões, grandes transações, novos máximos e mínimos, etc. @pt-pt
definition: Anúncios de eventos bolsistas importantes: divisões, grandes transações, novos máximos e mínimos etc. @pt-br
definition: Meddelelser om større aktiebegivenheder, såsom opsplitning, ophørte handler, nye top- og bundnoteringer og mere. @dk
definition: 重大股市公告，例如股票拆股、大宗交易、再创新高或新低等 @zh-hans
in scheme: Media Topic
created: 2009-10-22T02:00:00+00:00
modified: 2023-03-31T12:00:00+00:00
broader: stocks and securities

stock flotation
type: Concept
preferred label: Börsengang @de
preferred label: Entrée en Bourse @fr
preferred label: Entrada en bolsa @es
preferred label: Börsnotering @se
preferred label: تعويم اسهم @ar
preferred label: oferta pública inicial @pt-pt
preferred label: børsnotering @dk
preferred label: 募集设立 @zh-hans
definition: Erstmalig öffentliches Angebot von Aktien eines Unternehmens. Wird auch als Initial Public Offering IPO bezeichnet. @de
definition: Ett företag ger ut aktier till allmänheten för första gången, kallas även börsintroduktion. @se
definition: The issuing of stock shares to the public for the first time, also called an Initial Public Offering (IPO)
definition: Uma empresa emite ações ao público pela primeira vez. @pt-pt
definition: Et firma udsteder aktier til offentligheden for første gang. @dk
definition: 公司首次将它的股票卖给一般公众，也称为首次公开募股（IPO） @zh-hans
in scheme: Media Topic
created: 2009-10-22T02:00:00+00:00
modified: 2021-02-18T12:00:00+00:00
broader: stocks and securities
broad match: http://cv.iptc.org/newscodes/subjectcode/04016019

layoffs and downsizing
type: Concept
preferred label: Restructurations et suppressions d'emplois @fr
preferred label: Despidos y reestructuraciones @es
preferred label: Nedskärningar @se
preferred label: Entlassung und Rationalisierung @de
preferred label: تسريح وخفض نفقات @ar
preferred label: redução de efetivos @pt-pt
preferred label: nedskæringer @dk
preferred label: 裁员和缩编 @zh-hans
preferred label: permitteringer og nedbemanning @no-nb
preferred label: permitteringar og nedbemanning @no-nn
definition: Geplante oder aktuell durchgeführte Minimierung von Arbeitskräften @de
definition: Planned or actual reductions in the labour force.
definition: Planerade eller faktiska minskningar av personalstyrkan. @se
definition: Reduções reais ou previstas da força de trabalho de uma empresa. @pt-pt
definition: Planlagt eller faktisk reduktion af personale. @dk
definition: 计划或实际裁减劳动力 @zh-hans
definition: Planned or actual reductions in the labor force.
in scheme: Media Topic
created: 2009-10-22T02:00:00+00:00
modified: 2021-05-05T12:00:00+00:00
broader: human resources

executive officer
type: Concept
preferred label: Dirigeants d'entreprise @fr
preferred label: Vorstand @de
preferred label: Företagsledning @se
preferred label: ادارة @ar
preferred label: Dirección @es
preferred label: administração @pt-pt
preferred label: ledelse @dk
preferred label: 管理层 @zh-hans
preferred label: selskapsledelse @no-nb
preferred label: selskapsleiing @no-nn
definition: Company executive officers including appointments and changes
definition: Nyheter om vd och andra ledande befattningar i ett företag, inklusive nyutnämningar och förändringar. @se
definition: Einstellungen und Veränderungen in den Vorständen der Geschäftsführung @de
definition: Administradores de empresas, incluindo compromissos e mudanças. @pt-pt
definition: Nyheder om administrerende direktør og andre ledende stillinger i en virksomhed, herunder nye ansættelser og ændringer. @dk
definition: 公司行政人员的任命和变动等 @zh-hans
in scheme: Media Topic
created: 2009-10-22T02:00:00+00:00
modified: 2023-03-31T12:00:00+00:00
broader: human resources
broad match: http://cv.iptc.org/newscodes/subjectcode/04016028

stock option
type: Concept
preferred label: Opciones sobre acciones @es
preferred label: خيار شراء اسهم @ar
preferred label: Options sur titres @fr
preferred label: Aktienoption @de
preferred label: Aktieoptioner @se
preferred label: opções de compra de ações @pt-pt
preferred label: aktieoption @dk
preferred label: 股票期权 @zh-hans
preferred label: aksjeopsjon @no-nb
definition: Beiderseitige Vereinbarung Aktien zu kaufen oder zu verkaufen, wenn diese einen bestimmten Preis erreicht haben, ausschließlich angeboten für Angestellte und Beschäftigte dieses Unternehmens @de
definition: An agreement to either buy or sell a stock when it meets a certain price, sometimes used as an incentive for employees and officers of a company
definition: Rätt, men inte skyldighet, för en anställd i ett företag att köpa eller sälja aktier till ett visst pris vid eller före en viss tidpunkt. @se
definition: Acordo para compra ou venda de uma ação quando atinge determinado preço, que se aplica apenas a empregados ou dirigentes dessa companhia. @pt-pt
definition: Retten for en medarbejder i en virksomhed til at købe eller sælge aktier til en bestemt pris på eller inden et bestemt tidspunkt. @dk
definition: 当股票达到一定的价格时，买卖股票的协议，只适用于本公司的员工和管理人员 @zh-hans
change note: Retired. Use derivatives medtop:20000395 instead.
in scheme: Media Topic
created: 2009-10-22T02:00:00+00:00
retired: 2023-03-31T12:00:00+00:00
modified: 2023-03-31T12:00:00+00:00
broader: securities

commercial contract
type: Concept
preferred label: Affärsavtal @se
preferred label: Contrato comercial @es
preferred label: عقد تجاري @ar
preferred label: Vertrag @de
preferred label: Contrat commercial @fr
preferred label: contrato comercial @pt-pt
preferred label: forretningsaftale @dk
preferred label: 商业合同 @zh-hans
preferred label: forretningsavtale @no-nb
definition: Verträge bezüglich Verkaufsaktivitäten @de
definition: Kontrakt avseende kommersiella aktiviteter. @se
definition: Contracts regarding commercial activities
definition: Contratos relativos a atividades comerciais. @pt-pt
definition: Aftale om køb eller salg, af varer, rettigheder eller fast ejendom. @dk
definition: 关于商业活动的合同 @zh-hans
in scheme: Media Topic
created: 2009-10-22T02:00:00+00:00
modified: 2021-02-18T12:00:00+00:00
broader: business strategy and marketing

economic globalisation
type: Concept
preferred label: Globalisierung @de
preferred label: عولمة @ar
preferred label: Globalización @es
preferred label: Mondialisation @fr
preferred label: Global handel @se
preferred label: globalização económica @pt-pt
preferred label: globalização econômica @pt-br
preferred label: økonomisk globalisering @dk
preferred label: 经济全球化 @zh-hans
preferred label: globalisering @no-nb
preferred label: economic globalization
definition: Weltweite Geschäftstätigkeit @de
definition: Affärer som sker mellan parter i olika länder. @se
definition: Doing business around the world
definition: Fazer negócios pelo mundo inteiro. @pt-pt
definition: Handel mellem parter i forskellige lande. @dk
definition: 在世界各地从事生产经营活动 @zh-hans
in scheme: Media Topic
created: 2009-10-22T02:00:00+00:00
modified: 2021-02-18T12:00:00+00:00
broader: business strategy and marketing

licensing agreement
type: Concept
preferred label: اتفاق ترخيص @ar
preferred label: Contratos de concesión de licencia @es
preferred label: Licensavtal @se
preferred label: Lizenz @de
preferred label: Accords de licence @fr
preferred label: contrato de licença @pt-pt
preferred label: licensaftale @dk
preferred label: 许可协议 @zh-hans
preferred label: lisensavtale @no-nb
definition: Ett kontrakt som definierar villkoren för användning av någon annans immateriella egendom. @se
definition: The document defining the terms for licensing intellectual property
definition: Lizenzvereinbarungen zwischen Unternehmen @de
definition: O documento que define os termos para licenciar propriedade intelectual. @pt-pt
definition: En kontrakt, der definerer betingelserne for brug af andres ejendom. @dk
definition: 定义知识产权许可条款的文件 @zh-hans
change note: Retired. Use medtop:20000196 commercial contract instead.
in scheme: Media Topic
created: 2009-10-22T02:00:00+00:00
retired: 2023-03-31T12:00:00+00:00
modified: 2023-03-31T12:00:00+00:00
broader: business strategy and marketing

new product or service
type: Concept
preferred label: Nuevo producto o servicio @es
preferred label: Nouveau produit ou nouveau service @fr
preferred label: Ny produkt eller tjänst @se
preferred label: منتج او خدمة جديدة @ar
preferred label: Neue Produkte @de
preferred label: novo produto ou serviço @pt-pt
preferred label: nyt produkt eller service @dk
preferred label: 新产品或服务 @zh-hans
preferred label: nye produkter eller tjenester @no-nb
preferred label: nye produkt eller tenester @no-nn
definition: The introduction of products or services to the market
definition: En vara eller tjänst som inte tidigare har erbjudits marknaden. @se
definition: Ankündigung neuer Produkte und Dienstleistungen @de
definition: A introdução de novos produtos ou serviços no mercado. @pt-pt
definition: Et produkt eller en tjeneste, der ikke tidligere er blevet tilbudt markedet. @dk
definition: 引入市场的新产品或新服务 @zh-hans
in scheme: Media Topic
created: 2009-10-22T02:00:00+00:00
modified: 2023-03-31T12:00:00+00:00
broader: business strategy and marketing
broad match: http://cv.iptc.org/newscodes/subjectcode/04016030

patent, copyright and trademark
type: Concept
preferred label: Patentes, propiedad intelectual, marcas registradas @es
preferred label: Patent, Copyright und Warenzeichen @de
preferred label: Brevet, droit d'auteur et marque déposée @fr
preferred label: Patent, upphovsrätt och varumärke @se
preferred label: براءة، حقوق نشر وعلامة تجارية @ar
preferred label: patente, direitos de autor e marca registada @pt-pt
preferred label: patente, direitos de autor e marca registrada @pt-br
preferred label: patent, ophavsret og varemærke @dk
preferred label: 专利、版权和商标 @zh-hans
preferred label: patent, opphavsrett og merkevare @no-nb
preferred label: patent, rettar og merkevarer @no-nn
definition: Patente, Copyright und Warenzeichen @de
definition: Ensamrätt att exploatera en uppfinning, laglig rätt för upphovsman att ensam bestämma över användningen av sitt verk och lagligen skyddat namn eller kännetecken på varor och tjänster från en viss näringsidkare. @se
definition: Intellectual properties such as patents, copyright and trademarks
definition: Propriedades intelectuais enquanto patentes, direitos de autor e marcas registadas. @pt-pt
definition: Propriedades intelectuais enquanto patentes, direitos de autor e marcas registradas. @pt-br
definition: Eksklusiv ret til at udnytte en opfindelse, juridisk ret for forfatteren til kun at beslutte brugen af sit arbejde og lovligt beskyttede navn eller karakteristika for varer og tjenester for en bestemt erhvervsdrivende. @dk
definition: 专利、版权和商标等知识产权 @zh-hans
in scheme: Media Topic
created: 2009-10-22T02:00:00+00:00
modified: 2023-03-31T12:00:00+00:00
broader: business strategy and marketing

product recall
type: Concept
preferred label: Reklamation @de
preferred label: Rappel de marchandise @fr
preferred label: Retiro de productos @es
preferred label: سحب منتج @ar
preferred label: Produktåterkallelse @se
preferred label: recolha de produtos @pt-pt
preferred label: produkttilbagekaldelse @dk
preferred label: 产品召回 @zh-hans
preferred label: tilbakekalling av produkt @no-nb
definition: Die Entscheidung eines Unternehmens ein defektes Produkt zurückzunehmen oder zu reparieren @de
definition: A decision by a company to take back or repair a defective product
definition: Ett beslut av ett företag att ta tillbaka eller reparera en defekt produkt. @se
definition: Decisão de uma empresa de recolher ou reparar um produto com defeito. @pt-pt
definition: En virksomheds beslutning om at tage et produkt tilbage eller reparere det. @dk
definition: 企业决定收回或修复有缺陷的产品的行为 @zh-hans
in scheme: Media Topic
created: 2009-10-22T02:00:00+00:00
modified: 2021-02-18T12:00:00+00:00
broader: business strategy and marketing

research and development
type: Concept
preferred label: Recherche et développement @fr
preferred label: Forschung und Entwicklung @de
preferred label: بحث وتنمية @ar
preferred label: Forskning och utveckling @se
preferred label: Investigación y desarrollo @es
preferred label: investigação e desenvolvimento @pt-pt
preferred label: pesquisa e desenvolvimento @pt-br
preferred label: forskning og udvikling @dk
preferred label: 研发 @zh-hans
preferred label: forskning og utvikling @no-nb
preferred label: forsking og utvikling @no-nn
definition: Research and expenditure on new product or service development
definition: Forschung und Ausgaben für die Entwicklung neuer Produkte @de
definition: Process som genom systematiskt arbete kan frambringa nya kunskaper och ökat vetande kring en produkt eller tjänst. @se
definition: Investigação e despesas relativas ao desenvolvimento de novos produtos. @pt-pt
definition: Udvikling af nye produkter og tjenester eller forbedring af eksisterende. @dk
definition: 新产品或服务开发的研究及其费用支出 @zh-hans
in scheme: Media Topic
created: 2009-10-22T02:00:00+00:00
modified: 2021-02-18T12:00:00+00:00
broader: business strategy and marketing

market research
type: Concept
preferred label: Marktforschung @de
preferred label: حركة السوق @ar
preferred label: Étude de marché @fr
preferred label: Marknadsundersökningar @se
preferred label: Investigación de mercado @es
preferred label: estudos de mercado @pt-pt
preferred label: markedsundersøgelse @dk
preferred label: 市场调查研究 @zh-hans
preferred label: markedsundersøkelser @no-nb
preferred label: marknadsundersøking @no-nn
definition: Gathering information about the needs and wants of consumers
definition: Undersökning av möjligheterna att sälja en viss vara eller tjänst. @se
definition: Dienstleister, der versucht Käuferbedürfnisse zu ermitteln @de
definition: Serviço que tenta determinar o que as pessoas pretendem comprar. @pt-pt
definition: Undersøgelse af mulighederne for at sælge et bestemt produkt eller tjeneste. @dk
definition: 试图确定人们想要购买什么的服务 @zh-hans
in scheme: Media Topic
created: 2009-10-22T02:00:00+00:00
modified: 2023-03-31T12:00:00+00:00
broader: business strategy and marketing

market trend
type: Concept
preferred label: Marknadstrender @se
preferred label: Tendencias de mercado @es
preferred label: Marktentwicklung @de
preferred label: Tendance du marché @fr
preferred label: اتجاهات السوق @ar
preferred label: indicadores de consumo @pt-pt
preferred label: markedsudvikling @dk
preferred label: 市场趋势 @zh-hans
preferred label: markedstrend @no-nb
preferred label: marknadstrend @no-nn
definition: Statistisch relevantes Konsumverhalten. @de
definition: Utvecklingsriktning styrd av konsumentbeteende. @se
definition: Statistically significant consumer behaviour.
definition: Comportamento estatisticamente significativo dos consumidores. @pt-pt
definition: Udviklingsretning styret af forbrugeradfærd. @dk
definition: 具有统计学意义的消费者行为 @zh-hans
definition: Statistically significant consumer behavior.
in scheme: Media Topic
created: 2009-10-22T02:00:00+00:00
modified: 2023-03-31T12:00:00+00:00
broader: business strategy and marketing

public contract
type: Concept
preferred label: Offentlig upphandling @se
preferred label: contrato público @pt-pt
preferred label: offentlig kontrakt @dk
preferred label: 公共合同 @zh-hans
preferred label: öffentlicher Auftrag @de
preferred label: Marchés publics @fr
preferred label: Mercados públicos @es
preferred label: عقود عامة @ar
preferred label: offentleg kontrakt @no-nn
definition: Written contracts between companies and public authorities for the execution of works, the supply of products or the provision of services.
definition: Ett avtal, ingått efter ett formaliserat förfarande, om förvärv av varor eller nyttigheter där det allmänna (stat, landsting, kommun eller annan offentlig myndighet) står som beställare. @se
definition: Contratos escritos feitos entre empresas e autoridades públicas para a execução de obras, o fornecimento de produtos ou a prestação de serviços. @pt-pt
definition: En aftale, der blev indgået efter en formaliseret procedure, om erhvervelse af varer eller varer, hvor offentligheden (stat, regionsråd, kommune eller anden offentlig myndighed) står som klient. @dk
definition: 企业与公共机构之间为执行工程、提供产品或提供服务而签订的书面合同 @zh-hans
definition: Schriftliche Verträge zwischen Unternehmen und öffentlichen Behörden über die Ausführung von Arbeiten, die Lieferung von Produkten oder die Erbringung von Dienstleistungen @de
definition: Offentleg anbod. @no-nn
in scheme: Media Topic
created: 2016-04-04T12:00:00+00:00
modified: 2021-07-12T12:00:00+00:00
broader: business strategy and marketing

client relationship management
type: Concept
preferred label: Kundvård @se
preferred label: gestão de relacionamento com o cliente @pt-pt
preferred label: kunderelation @dk
preferred label: 客户关系管理 @zh-hans
preferred label: kundebehandling @no-nb
preferred label: Kundenmanagement @de
preferred label: Relation client @fr
preferred label: Gestión de relaciones con clientes @es
preferred label: ادارة العلاقات مع الزبائن @ar
definition: Creating and maintaining a relationship with the customers to increase sales.
definition: Skapandet och upprätthållandet av relationer till kunder för att öka försäljningen. @se
definition: Criação e manutenção de uma relação com os clientes para aumentar as vendas. @pt-pt
definition: Oprettelse og vedligeholdelse af forhold til kunder for at øge salget. @dk
definition: 建立并维持与客户的关系以增加销售额 @zh-hans
definition: Aufbau und Pflege einer Beziehung zu den Kunden, um den Umsatz zu steigern. @de
in scheme: Media Topic
created: 2016-04-04T12:00:00+00:00
modified: 2023-03-31T12:00:00+00:00
broader: business strategy and marketing

outsourcing
type: Concept
preferred label: Outsourcing @se
preferred label: utsetting (outsourcing) @no-nb
preferred label: terceirização @pt-br
preferred label: 外包 @zh-hans
preferred label: Externalisation @fr
preferred label: Subcontratación @es
preferred label: اسناد خارجي @ar
preferred label: utsetjing (outsourcing) @no-nn
definition: Business practice in which services or job functions are farmed out to a third party
definition: Metod där företag eller organisationer anlitar ett annat företag för att sköta vissa delar av den egna verksamheten. @se
definition: Prática de negócios que consiste na transferência de serviços ou funções a terceiros. @pt-pt
definition: En forretningsstrategi hvor tjenester eller arbejdspladser flyttes ud til en tredjepart @dk
definition: 将服务或工作职能分包给第三方的商业实践 @zh-hans
definition: Geschäftspraxis, bei der Dienstleistungen oder Arbeitsfunktionen an Dritte ausgelagert werde @de
in scheme: Media Topic
created: 2020-08-05T12:00:00+00:00
modified: 2021-07-12T12:00:00+00:00
broader: business strategy and marketing

annual and special corporate meeting
type: Concept
preferred label: Bolagsstämma @se
preferred label: Assemblée générale @fr
preferred label: Hauptversammlung @de
preferred label: اجتماع شركة سنوي @ar
preferred label: Asambleas corporativas anuales y especiales @es
preferred label: reuniões corporativas anuais e especiais @pt-pt
preferred label: ordinær og ekstraordinær generalforsamling @dk
preferred label: 公司年会和特别会议 @zh-hans
preferred label: generalforsamling @no-nb
definition: Ankündigungen und Berichte von Versammlungen @de
definition: Sammanträde med bolagets aktieägare, högsta beslutande organ i ett aktiebolag. @se
definition: News surrounding company reports and annual or special corporate meetings
definition: Anúncios de reuniões agendadas. Relatórios das reuniões. @pt-pt
definition: Møde med selskabets aktionærer, et aktieselskabs højeste beslutningsorgan. @dk
definition: 有关公司报告、年会或特别会议的消息 @zh-hans
in scheme: Media Topic
created: 2009-10-22T02:00:00+00:00
modified: 2023-03-31T12:00:00+00:00
broader: business governance

annual report
type: Concept
preferred label: Rapport annuel @fr
preferred label: Geschäftsbericht @de
preferred label: Årsredovisning @se
preferred label: Memorias anuales @es
preferred label: تقرير سنوي @ar
preferred label: relatório anual @pt-pt
preferred label: årsrapport @dk
preferred label: 公司年报 @zh-hans
preferred label: årsmelding @no-nn
definition: Availability or contents of annual company reports.
definition: Sammanställning av ett företags räkenskaper och information om dess förvaltning under ett räkenskapsår. @se
definition: Verfügbarkeit oder Inhalte von Jahresabschlussberichten von Firmen @de
definition: Disponibilidade ou conteúdos de relatórios anuais de empresas. @pt-pt
definition: Udarbejdelse af et selskabs årsregnskab og information om dets ledelse i løbet af et regnskabsår. @dk
definition: 公司年报内容 @zh-hans
in scheme: Media Topic
created: 2009-10-22T02:00:00+00:00
modified: 2023-03-31T12:00:00+00:00
broader: business governance

board of directors
type: Concept
preferred label: Geschäftsführung @de
preferred label: مجلس مدراء @ar
preferred label: Bolagsstyrelse @se
preferred label: Junta directiva @es
preferred label: Conseil d'administration @fr
preferred label: conselho de administração @pt-pt
preferred label: bestyrelse @dk
preferred label: 董事会 @zh-hans
preferred label: styre @no-nb
definition: Appointments to or changes in the board of directors for a company.
definition: Utnämningar till eller förändringar i den grupp som tar de övergripande besluten i ett företag. @se
definition: Absprachen oder Wechsel in der Geschäftsführung eines Unternehmens @de
definition: Nomeações ou mudanças no conselho de administração de uma companhia. @pt-pt
definition: Valg af eller ændringer i bestyrelsen for et selskab. @dk
definition: 公司董事会成员的任命或变动 @zh-hans
in scheme: Media Topic
created: 2009-10-22T02:00:00+00:00
modified: 2023-03-31T12:00:00+00:00
broader: business governance

company spin-off
type: Concept
preferred label: Företagsavknoppning @se
preferred label: Scission @fr
preferred label: Firmenausgründung @de
preferred label: Escisión de sociedades @es
preferred label: تحويل اصول @ar
preferred label: spin-off @pt-pt
preferred label: spin-off virksomhed @dk
preferred label: 公司分拆 @zh-hans
preferred label: spin-off-selskap @no-nb
definition: The creation of new companies being spun off from existing companies
definition: Skapandet av nya företag genom avknoppningar från befintliga företag. @se
definition: Gründung neuer Firmen, die sich aus bestehenden Firmen ausgegliedert haben @de
definition: Criação de empresas novas a partir de divisões de empresas existentes. @pt-pt
definition: Oprettelse af nye virksomheder gennem spinoffs fra eksisterende virksomheder. @dk
definition: 从现有公司分离出来的新公司 @zh-hans
definition: The creation of new companies being spun off from existing companies.
definition: Når delar av eit selskap blir skilt ut i ei separat verksemd. @no-nn
definition: Når deler av et selskap skilles ut i en separat virksomhet. @no-nb
in scheme: Media Topic
created: 2009-10-22T02:00:00+00:00
modified: 2023-03-31T12:00:00+00:00
broader: business restructuring

environmental, social and governance policy (ESG)
type: Concept
preferred label: CSR (virksomheds sociale ansvar) @dk
preferred label: bedriftens samfunnsansvar @no-nb
preferred label: responsabilidade social corporativa @pt-pt
preferred label: Hållbarhet @se
preferred label: 企业社会责任 @zh-hans
preferred label: Soziale Verantwortung von Unternehmen @de
preferred label: Responsabilité sociétale des entreprises @fr
preferred label: Responsabilidad social corporativa @es
preferred label: المسؤولية الاجتماعية للشركات @ar
preferred label: verksemdens samfunnsansvar @no-nn
definition: En virksomheds forretningspraksis, der afspejler ansvarlige sociale, etiske og miljømæssige politikker. @dk
definition: A company's business practices reflecting responsible social, ethical and environmental policies, sometimes known as corporate social responsibility
definition: Práticas comerciais de uma empresa que refletem políticas sociais, éticas e ambientais responsáveis. @pt-pt
definition: Ett företags riktlinjer för ansvarsfullt arbete mot samhälle, etik och miljö. @se
definition: 反映公司承担社会、道德和环境责任的行为 @zh-hans
definition: Die Geschäftspraktiken eines Unternehmens spiegeln eine verantwortungsvolle Sozial-, Ethik- und Umweltpolitik wider @de
definition: Corporate Social Responsibility (CSR) @no-nn
in scheme: Media Topic
created: 2019-04-06T12:00:00+00:00
modified: 2023-03-31T12:00:00+00:00
broader: business governance

joint venture
type: Concept
preferred label: Samriskföretag @se
preferred label: Joint Venture @de
preferred label: Empresa conjunta @es
preferred label: شركة مختلطة @ar
preferred label: Joint venture @fr
preferred label: 合资企业 @zh-hans
preferred label: fellesforetak (joint venture) @no-nb
preferred label: fellesføretak (joint venture) @no-nn
definition: Two or more companies agreeing on a venture.
definition: Ett bolag som samägs av två eller fler företag. @se
definition: Zwei oder mehr Unternehmen, die eine Kooperation vereinbaren @de
definition: Notícias sobre joint ventures entre companhias. @pt-pt
definition: Et selskab ejet af to eller flere virksomheder. @dk
definition: 两家或两家以上的公司同意合资经营 @zh-hans
in scheme: Media Topic
created: 2009-10-22T02:00:00+00:00
modified: 2023-03-31T12:00:00+00:00
broader: business restructuring

leveraged buyout
type: Concept
preferred label: Rachat d'entreprise par endettement @fr
preferred label: Compras apalancadas @es
preferred label: Företagsuppköp genom lån @se
preferred label: Übernahme @de
preferred label: بيع اصول @ar
preferred label: aquisição alavancada @pt-pt
preferred label: finansielt gearet opkøb @dk
preferred label: 杠杆收购 @zh-hans
preferred label: lånefinansiert oppkjøp @no-nb
definition: Att ta kontrollen över ett företag genom att köpa dess aktier för lånade pengar. @se
definition: Acquiring control over a company by buying its shares with borrowed money.
definition: Erlangung der Kontrolle über ein Unternehmen durch Anteilseinkäufe mit geliehenem Geld @de
definition: Operações de compra de ações de uma empresa, financiadas por empréstimos. @pt-pt
definition: At tage kontrol over et selskab ved at købe dets aktier for lånte penge. @dk
definition: 通过借入资金购买股票来获得对公司的控制权 @zh-hans
in scheme: Media Topic
created: 2009-10-22T02:00:00+00:00
modified: 2023-03-31T12:00:00+00:00
broader: business restructuring

management buyout
type: Concept
preferred label: Rachat par la direction @fr
preferred label: Företagsuppköp av ledningen @se
preferred label: Übernahme des Management @de
preferred label: ادارة شراء @ar
preferred label: MBO - Compra de una empresa por sus propios directivos @es
preferred label: operação de compra @pt-pt
preferred label: ledelsesopkøb @dk
preferred label: 管理层收购 @zh-hans
preferred label: ledelsesoppkjøp @no-nb
preferred label: leiingsoppkjøp @no-nn
definition: Att företagsledningen tar kontrollen över ett företag genom att köpa aktierna i företaget. @se
definition: Erlangung von Kontrolle über ein Unternehmen durch den Kauf von Anteilen durch das Management @de
definition: Acquiring control over a company by the management buying its shares.
definition: Adquirir controlo sobre uma empresa através da compra das suas ações. @pt-pt
definition: Adquirir controle sobre uma empresa através da compra das suas ações. @pt-br
definition: At ledelsen tager kontrol over et selskab ved at købe aktierne i virksomheden. @dk
definition: 管理层购通过购买本公司股份以获得对公司的控制权 @zh-hans
in scheme: Media Topic
created: 2009-10-22T02:00:00+00:00
modified: 2023-03-31T12:00:00+00:00
broader: business restructuring
broad match: http://cv.iptc.org/newscodes/subjectcode/04000000

merger or acquisition
type: Concept
preferred label: Fusiones, adquisiciones @es
preferred label: Fusion ou acquisition @fr
preferred label: اندماج او استحواذ @ar
preferred label: Fusion @de
preferred label: Fusioner och förvärv @se
preferred label: fusão e aquisição @pt-pt
preferred label: fusion eller opkøb @dk
preferred label: 合并或收购 @zh-hans
preferred label: fusjoner og overtakelser @no-nb
preferred label: fusjonar og overtakingar @no-nn
definition: Two or more companies forming a new company mergers, takeovers or acquisitions.
definition: Två eller fler företag som bildar ett nytt företag genom fusion, övertagande eller förvärv. @se
definition: Zwei oder mehr Unternehmen bilden ein neues, Fusion, Übernahme oder Akquisition @de
definition: Duas ou mais empresas que formam uma nova empresa. @pt-pt
definition: En virksomhed slår sig sammen med en anden, enten i form af en fusion eller ved opkøb. @dk
definition: 两家或多家公司通过合并或收购组成新公司 @zh-hans
definition: Når to eller fleire selskap blir slått saman eller eit selskap overtek eitt eller fleire andre. @no-nn
definition: Når to eller flere selskaper slås sammen eller et selskap overtar ett eller flere andre. @no-nb
in scheme: Media Topic
created: 2009-10-22T02:00:00+00:00
modified: 2023-03-31T12:00:00+00:00
broader: business restructuring

agriculture
type: Concept
preferred label: Naturbruk @se
preferred label: زراعة @ar
preferred label: Agriculture @fr
preferred label: Agrar @de
preferred label: Agricultura @es
preferred label: agricultura e pescas @pt-pt
preferred label: landbrug @dk
preferred label: 农业 @zh-hans
preferred label: landbruk @no-nb
definition: The growing and raising of plants and animals for consumption and the processing, cleaning, packing or storage of these products
definition: Processer kring att framställa naturliga material för konsumtion. @se
definition: Prozess zur Produktion von natürlichen Konsumgütern @de
definition: Produção de bens naturais para consumo. @pt-pt
definition: Processer til produktion af naturlige materialer til forbrug. @dk
definition: 生产用于消费的天然材料的过程 @zh-hans
in scheme: Media Topic
created: 2009-10-22T02:00:00+00:00
modified: 2023-03-31T12:00:00+00:00
broader: products and services
narrower: aquaculture
narrower: arable farming
narrower: livestock farming
narrower: viniculture

commercial fishing
type: Concept
preferred label: Fiskerinäring @se
preferred label: Fischindustrie @de
preferred label: Industria pesquera @es
preferred label: صناعة سمكية @ar
preferred label: Pêche @fr
preferred label: pesca @pt-pt
preferred label: fiskeindustri @dk
preferred label: 渔业 @zh-hans
preferred label: fiskeri og havbruk @no-nb
definition: Fish farming and commercial activity around the catching of fish and seafood for consumption
definition: Uppfödning eller insamlande av fisk. @se
definition: Züchten und Fangen von Fisch @de
definition: Criação ou recolha de peixe. @pt-pt
definition: Opdræt eller fangst af fisk. @dk
definition: 鱼类养殖和捕捞 @zh-hans
in scheme: Media Topic
created: 2009-10-22T02:00:00+00:00
modified: 2023-03-31T12:00:00+00:00
broader: products and services

forestry and timber
type: Concept
preferred label: احراج واخشاب @ar
preferred label: Exploitation forestière @fr
preferred label: Forstwirtschaft @de
preferred label: Skogsbruk @se
preferred label: Silvicultura y explotación forestal @es
preferred label: exploração florestal e silvicultura @pt-pt
preferred label: skovbrug og træ @dk
preferred label: 林业和木材 @zh-hans
preferred label: skogbruk @no-nb
definition: Herstellung, Sammlung und Verarbeitung von Baumbeständen für die zukünftige Nutzung @de
definition: Verksamhet där skog utnyttjas för produktion av virke för efterföljande bearbetning och användning. @se
definition: The production, collection and preparation of wood products
definition: Produção, recolha e preparação de produtos de madeira para uso futuro. @pt-pt
definition: Skovbrugsvirksomheder, der anvendes til produktion af træ til efterfølgende forarbejdning og brug. @dk
definition: 生产、收集和制备木材 @zh-hans
in scheme: Media Topic
created: 2009-10-22T02:00:00+00:00
modified: 2023-03-31T12:00:00+00:00
broader: products and services

chemicals
type: Concept
preferred label: مواد كيميائية @ar
preferred label: Kemisk industri @se
preferred label: Productos químicos @es
preferred label: Chemie @de
preferred label: Chimie @fr
preferred label: produtos químicos @pt-pt
preferred label: kemikalie @dk
preferred label: 化工产品 @zh-hans
preferred label: kjemikalier @no-nb
preferred label: kjemikaliar @no-nn
definition: Natürliche oder künstliche Stoffe, um andere Materialien zu erzeugen @de
definition: Natural or manmade materials used to produce other materials
definition: Naturliga eller skapade ämnen som används för att producera annat material. @se
definition: Materiais naturais ou feitos pelo homem para produzir outros materiais. @pt-pt
definition: Naturlige eller kunstige stoffer, der bruges til at fremstille andre materialer. @dk
definition: 用于生产其他材料的天然或人造材料 @zh-hans
in scheme: Media Topic
created: 2009-10-22T02:00:00+00:00
modified: 2021-02-18T12:00:00+00:00
broader: products and services
narrower: fertiliser
narrower: health and beauty product
narrower: inorganic chemical
narrower: organic chemical
narrower: pesticide and herbicide

plastic
type: Concept
preferred label: Productos sintéticos y plásticos @es
preferred label: Kunststoff @de
preferred label: Plastiques et matières synthétiques @fr
preferred label: Plaster och syntetiska kemikalier @se
preferred label: بلاستيك ومواد صناعية @ar
preferred label: químicos sintéticos e plásticos @pt-pt
preferred label: plast og syntetisk kemikalie @dk
preferred label: 合成和塑料化学品 @zh-hans
preferred label: plast @no-nb
definition: Naturliga eller skapade ämnen som används för att framställa plast och andra konstgjorda substanser som används inom tillverkningsindustrin. @se
definition: The production of plastics and issues around plastic consumption, including bans, recycling, using less plastics and plastic alternatives
definition: Chemikalien, die genutzt werden um Plastik und andere künstliche Stoffe für die Industrie zu produzieren @de
definition: Químicos usados para produzir plásticos e outras substâncias artificiais. @pt-pt
definition: Naturlige eller fremstillede stoffer, der bruges til fremstilling af plast og andre kunstige stoffer, der bruges i fremstillingsindustrien. @dk
definition: 用于生产塑料和其他人造物质的化学品 @zh-hans
in scheme: Media Topic
created: 2009-10-22T02:00:00+00:00
modified: 2023-03-31T12:00:00+00:00
broader: products and services

computing and information technology
type: Concept
preferred label: Informationsteknologi @se
preferred label: Informatique et télécommunications @fr
preferred label: Computación e informática @es
preferred label: Computer und Informationstechnologie @de
preferred label: تكنولوجيا كمبيوتر ومعلوماتية @ar
preferred label: informática e tecnologias de informação @pt-pt
preferred label: informationsteknologi @dk
preferred label: 计算和信息技术 @zh-hans
preferred label: informasjonsteknologi @no-nb
definition: Saker som handlar om databearbetning eller överföring av information mellan datorer. @se
definition: Alles was die elektronische Verarbeitung und Übertragung von Information von einem Punkt zu einem anderen @de
definition: Computers and the transmission of information
definition: Tudo o que diz respeito à computação e à transmissão de informação de um ponto para outro. @pt-pt
definition: Databehandling eller overførsel af information mellem computere. @dk
definition: 有关信息的计算和传输 @zh-hans
in scheme: Media Topic
created: 2009-10-22T02:00:00+00:00
modified: 2023-03-31T12:00:00+00:00
broader: products and services
narrower: computer and telecommunications hardware
narrower: computer networking
narrower: satellite technology
narrower: computer security
narrower: semiconductor and electronic component
narrower: software and applications
narrower: telecommunication equipment
narrower: telecommunication service
narrower: wireless technology
narrower: Internet of Things

construction and property
type: Concept
preferred label: Bau @de
preferred label: بناء وملكية @ar
preferred label: Fastighets- och byggnadsindustri @se
preferred label: Construction et immobilier @fr
preferred label: Construcción e inmobiliaria @es
preferred label: construção e propriedades @pt-pt
preferred label: byggeri og ejendom @dk
preferred label: 建筑和房地产 @zh-hans
preferred label: bygg og eiendom @no-nb
preferred label: bygg og eigedom @no-nn
definition: All items pertaining to the construction and sale of property
definition: Allt som handlar om byggnader samt bygge, underhåll, förvaltning, uthyrning och försäljning av dem. @se
definition: Alle Inhalte, die den Erbau und Verkauf von baulichem Eigentum betreffen @de
definition: Elementos relativos à construção e venda de propriedades. @pt-pt
definition: Alt om bygninger og opførelse, vedligeholdelse, styring, leje og salg af dem. @dk
definition: 与房地产建造和销售有关的所有内容 @zh-hans
in scheme: Media Topic
created: 2009-10-22T02:00:00+00:00
modified: 2021-02-18T12:00:00+00:00
broader: products and services
narrower: design and engineering
narrower: farms
narrower: heavy construction
narrower: house building
narrower: land price
narrower: real estate
narrower: building material
narrower: infrastructure projects
narrower: commercial building
narrower: commercial real estate
narrower: residential real estate

consumer goods
type: Concept
preferred label: Bienes de consumo @es
preferred label: سلع استهلاكية @ar
preferred label: Konsumgüter @de
preferred label: Konsumentvaror @se
preferred label: Distribution @fr
preferred label: bens de consumo @pt-pt
preferred label: forbrugsvare @dk
preferred label: 消费品 @zh-hans
preferred label: forbruksvarer @no-nb
definition: Waren, die für Individuen produziert und an sie verkauft werden @de
definition: Varor som produceras för och säljs till individer. @se
definition: Items produced for and sold to individuals
definition: Artigos produzidos para serem vendidos. @pt-pt
definition: Varer, der er produceret til og solgt til enkeltpersoner. @dk
definition: 生产和销售给个人的物品 @zh-hans
definition: Varer som blir produserte og selde til enkeltpersonar. @no-nn
definition: Varer som produseres for og selges til enkeltpersoner. @no-nb
in scheme: Media Topic
created: 2009-10-22T02:00:00+00:00
modified: 2021-02-18T12:00:00+00:00
broader: products and services
narrower: beverage
narrower: clothing
narrower: grocery
narrower: luxury good
narrower: non-durable good
narrower: toy and game
narrower: beverage and grocery
narrower: furnishings and furniture
narrower: tobacco and nicotine
narrower: handicrafts
narrower: pet product and service
narrower: consumer electronics

energy and resource
type: Concept
preferred label: طاقة وموارد @ar
preferred label: Energía y recursos naturales @es
preferred label: Energie @de
preferred label: Énergie et ressources @fr
preferred label: Energi och naturtillgångar @se
preferred label: energia e recursos @pt-pt
preferred label: energi og ressourcer @dk
preferred label: 能源和资源 @zh-hans
preferred label: energi og kraftressurser @no-nb
preferred label: energi og kraftressursar @no-nn
definition: Produktion von elektrischer Energie, Wasser, Wind, Sonnenenergie und Kraftstoffe, die genutzt werden, um sie zu produzieren @de
definition: The use of natural resources to generate energy
definition: Användning av naturtillgångar för affärsändamål som produktion och energiutvinning. @se
definition: O uso de recursos naturais para gerar energia para fins comerciais. @pt-pt
definition: Brug af naturlige ressourcer til plandt andet produktion og energiudvinding. @dk
definition: 将自然资源用于商业目的的能源生产 @zh-hans
in scheme: Media Topic
created: 2009-10-22T02:00:00+00:00
modified: 2023-03-31T12:00:00+00:00
broader: products and services
narrower: renewable energy
narrower: coal
narrower: energy industry
narrower: nuclear power
narrower: oil and gas - downstream activities
narrower: oil and gas - upstream activities
narrower: biofuel
narrower: oil and gas

financial and business service
type: Concept
preferred label: Dienstleistung @de
preferred label: Finans- och affärstjänster @se
preferred label: Servicios financieros y comerciales @es
preferred label: خدمات مال واعمال @ar
preferred label: Services @fr
preferred label: serviços financeiros @pt-pt
preferred label: finans- og servicesektor @dk
preferred label: 金融及商业服务 @zh-hans
preferred label: finanstjenester @no-nb
preferred label: finanstenester @no-nn
definition: Services that transmit, safeguard, keep track of money or provide backup to commercial enterprises
definition: Unternehmen die vermitteln, beschützen Geldgeschäfte begleiten, oder Unterstützung anbieten für kommerzielle Unternehmen @de
definition: Tjänster som överför, vaktar eller håller koll på pengar och andra finansiella instrument eller utgör backup för kommersiella företag. @se
definition: Serviços que transmitem, protegem, acompanham o dinheiro ou fornecem apoio a empresas comerciais. @pt-pt
definition: Tjenester, der overfører, beskytter eller holder styr på penge og andre finansielle instrumenter eller leverer backup til kommercielle virksomheder. @dk
definition: 为商业企业传输、保管、跟踪资金或提供支援的服务 @zh-hans
change note: Retired. Use medtop:20001370 financial service or medtop:20001371 business service instead.
in scheme: Media Topic
created: 2009-10-22T02:00:00+00:00
retired: 2023-03-31T12:00:00+00:00
modified: 2023-03-31T12:00:00+00:00
broader: products and services
narrower: funeral parlour and crematorium
narrower: personal finance
narrower: personal income
narrower: printing service

manufacturing and engineering
type: Concept
preferred label: Industrie manufacturière @fr
preferred label: Fabricación e ingeniería @es
preferred label: Metall- und Technische Industrie @de
preferred label: تصنيع وهندسة @ar
preferred label: Verkstadsindustri @se
preferred label: indústria metalomecânica e engenharia @pt-pt
preferred label: fremstilling og teknik @dk
preferred label: 制造业和工程 @zh-hans
preferred label: verkstedindustri @no-nb
preferred label: verkstadindustri @no-nn
definition: Manufacturers of electrical, electronic and mechanical equipment but does not cover civil engineering.
definition: Tillverkare av elektrisk, elektronisk och mekanisk utrustning. @se
definition: Hersteller von elektrischer, elektronischer und mechanischer Ausrüstung, umfasst nicht das Ingenieurwesen @de
definition: Fabricantes de equipamento elétrico, eletrónico ou mecânico; não inclui engenharia civil. @pt-pt
definition: Fabricantes de equipamento elétrico, eletrônico ou mecânico; não inclui engenharia civil. @pt-br
definition: Producent af elektronisk og mekanisk udstyr. @dk
definition: 电气，电子和机械设备制造但不包括土木工程 @zh-hans
in scheme: Media Topic
created: 2009-10-22T02:00:00+00:00
modified: 2021-02-18T12:00:00+00:00
broader: products and services
narrower: aerospace
narrower: automotive
narrower: defence equipment
narrower: electrical appliance
narrower: heavy engineering
narrower: industrial component
narrower: instrument engineering
narrower: machine manufacturing
narrower: shipbuilding
narrower: capital goods
narrower: railway manufacturing

media and entertainment industry
type: Concept
preferred label: اعلام @ar
preferred label: Medios de comunicación @es
preferred label: Medier @se
preferred label: Médias @fr
preferred label: Medien @de
preferred label: média @pt-pt
preferred label: mídia @pt-br
preferred label: medie @dk
preferred label: 媒体 @zh-hans
preferred label: medie- og underholdningsbransjen @no-nb
preferred label: medie- og underhaldningsbransjen @no-nn
definition: Verschiedene Mittel für die Verbreitung von Informationen und Nachrichten in der Öffentlichkeit @de
definition: The various means of disseminating news, information and entertainment to the public
definition: Olika sätt att distribuera och presentera nyheter för allmänheten. @se
definition: Os vários meios que transmitem notícias e informações ao público. @pt-pt
definition: Forskellige måder at distribuere og præsentere nyheder til offentligheden. @dk
definition: 向公众传播新闻和信息的各种方式 @zh-hans
in scheme: Media Topic
created: 2009-10-22T02:00:00+00:00
modified: 2023-03-31T12:00:00+00:00
broader: products and services
narrower: advertising
narrower: books and publishing
narrower: film industry
narrower: music industry
narrower: news agency
narrower: newspaper and magazine
narrower: online media industry
narrower: public relations
narrower: radio industry
narrower: satellite and cable service
narrower: television industry
narrower: streaming service
narrower: podcast
narrower: news industry

metal and mineral mining and refining
type: Concept
preferred label: Metales y minerales @es
preferred label: معادن وثروات معدنية @ar
preferred label: Metaller och mineraler @se
preferred label: Metall und Mineralien @de
preferred label: Métaux et minéraux @fr
preferred label: minérios e metais @pt-pt
preferred label: metal og mineral @dk
preferred label: 金属和矿产 @zh-hans
preferred label: gruvedrift og metallurgisk industri @no-nb
definition: Anrikning av malm för att producera metaller @se
definition: The extractive businesses that remove raw materials, including coal, gold iron and copper, from the earth by drilling and pumping, quarrying or mining
definition: Produktion und Raffinieren von Erzen in Metalle @de
definition: Produção e refinação de minerais em metais. @pt-pt
definition: Berigelse af malm til produktion af metaller. @dk
definition: 将矿石生产和提炼成金属 @zh-hans
in scheme: Media Topic
created: 2009-10-22T02:00:00+00:00
modified: 2023-03-31T12:00:00+00:00
broader: products and services
narrower: precious material
narrower: iron and steel
narrower: mining
narrower: non-ferrous metal

process industry
type: Concept
preferred label: صناعة تحويلية @ar
preferred label: Industrie de transformation @fr
preferred label: Processindustri @se
preferred label: Industrias de procesamiento @es
preferred label: Verarbeitende Industrie @de
preferred label: indústria transformadora @pt-pt
preferred label: procesindustri @dk
preferred label: 流程工业 @zh-hans
preferred label: prosessindustri @no-nb
definition: Das Geschäft aus Rohstoffen nützliche Produkte herzustellen @de
definition: The business of turning raw materials into useable products
definition: Den kommersiella verksamhet som omvandlar råmaterial till användbara produkter. @se
definition: Negócio da transformação de matéria-prima em produtos utilizáveis. @pt-pt
definition: Kommercielle virksomheder, der omdanner råvarer til nyttige produkter. Det drejer sig blandt andet om kemisk industri og medicinalbranchen. @dk
definition: 加工制造业：将原材料转化为可用产品的产业 @zh-hans
change note: Retired. Use more specific terms instead.
in scheme: Media Topic
created: 2009-10-22T02:00:00+00:00
retired: 2023-03-31T12:00:00+00:00
modified: 2023-03-31T12:00:00+00:00
broader: products and services
narrower: distiller and brewer
narrower: paper and packaging product
narrower: rubber product
narrower: soft drinks
narrower: textile and clothing
narrower: e-cigarette

tourism and leisure industry
type: Concept
preferred label: Turistindustri @se
preferred label: Tourisme et loisirs @fr
preferred label: Turismo y tiempo libre @es
preferred label: سياحة وترفيه @ar
preferred label: Tourismus und Freizeit @de
preferred label: indústria do turismo e lazer @pt-pt
preferred label: turisme og fritid @dk
preferred label: 旅游和休闲娱乐业 @zh-hans
preferred label: reiselivsbransjen @no-nb
definition: Commercial organisations and operations dealing with travel and the pursuit of recreational activities
definition: Tourismus und Freizeitindustrie @de
definition: Industrin kring turism och fritidssysselsättningar. @se
definition: Organizações e operações comerciais que lidam com férias, visitas a locais de interesse e atividades recreativas. @pt-pt
definition: Industrien for turisme og fritid. @dk
definition: 为人们度假、游览名胜古迹及休闲娱乐提供服务 @zh-hans
definition: Commercial organizations and operations dealing with travel and the pursuit of recreational activities
in scheme: Media Topic
created: 2009-10-22T02:00:00+00:00
modified: 2023-03-31T12:00:00+00:00
broader: products and services
narrower: casinos and gambling
narrower: hotel and accommodation
narrower: recreational and sporting goods
narrower: restaurant and catering
narrower: tour operator

transport
type: Concept
preferred label: Transports @fr
preferred label: Transport @de
preferred label: Transporte @es
preferred label: نقل @ar
preferred label: transportes @pt-pt
preferred label: 运输 @zh-hans
definition: Olika sätt att förflytta folk och varor från en plats till en annan. @se
definition: The means of getting people or goods from one place to another
definition: Mittel von einem Ort zum anderen zu gelangen, ohne zu laufen @de
definition: Meios que permitem chegar de um lugar a outro sem caminhar. @pt-pt
definition: Forskellige måder at flytte mennesker og varer på fra et sted til et andet. @dk
definition: 不用步行就能把人或货物从一个地方运到另一个地方的方法 @zh-hans
change note: 2016-04-05: definition slightly changed
in scheme: Media Topic
created: 2009-10-22T02:00:00+00:00
modified: 2023-03-31T12:00:00+00:00
broader: products and services
narrower: air transport
narrower: railway transport
narrower: road transport
narrower: traffic
narrower: waterway and maritime transport
narrower: logistics
narrower: public transport
narrower: taxi and ride-hailing
narrower: shared transport

utilities
type: Concept
preferred label: forsyningsvirksomheder @dk
preferred label: serviços públicos @pt-br
preferred label: offentlige tjenester @no-nb
preferred label: Samhällsservice @se
preferred label: 公用事业 @zh-hans
preferred label: Versorgungsunternehmen @de
preferred label: Services des collectivités (eau, gaz, électricité) @fr
preferred label: Servicios comunitarios @es
preferred label: خدمات عامة @ar
preferred label: offentlege tenester @no-nn
definition: Virksomhed, der leverer offentlig forsyning i form af el, vand og varme eller som sørger for renovation og kloak. @dk
definition: The providing of basic services to the public, such as supplying water, waste removal, heating and cooling
definition: Prestação de serviços básicos, como fornecimento de água e remoção de resíduos ao público. @pt-br
definition: Grundläggande service från det offentliga mot innevånarna, exempelvis vatten, sophämtning mm. @se
definition: 为市民提供基本服务，包括供水及清除废物 @zh-hans
definition: Die Bereitstellung grundlegender Dienstleistungen, einschließlich der Wasserversorgung und Abfallentsorgung für die Öffentlichkeit. @de
in scheme: Media Topic
created: 2019-07-25T12:00:00+00:00
modified: 2023-03-31T12:00:00+00:00
broader: products and services
narrower: electricity
narrower: waste management
narrower: water supply
narrower: heating and cooling

sales channel
type: Concept
preferred label: salgskanaler @dk
preferred label: Försäljningskanaler @se
preferred label: 销售渠道 @zh-hans
preferred label: canais de vendas @pt-pt
preferred label: Vertriebskanäle @de
preferred label: Canaux de distribution @fr
preferred label: Canales de venta @es
preferred label: قنوات التوزي @ar
preferred label: salskanalar @no-nn
definition: Måder, hvormed man sikrer, at ens varer kan købes af interesserede kunder. @dk
definition: Indirect or direct ways of bringing products or services to market so that they can be purchased by consumers
definition: Olika sätt för säljare och leverantörer av varor att nå konsumenterna. @se
definition: 将产品或服务推向市场的方式，以便消费者可以间接或直接购买产品 @zh-hans
definition: Formas indiretas ou diretas de levar produtos ou serviços ao mercado para que possam ser adquiridos pelos consumidores. @pt-pt
definition: Indirekte oder direkte Wege, Produkte oder Dienstleistungen auf den Markt zu bringen, damit sie von den Verbrauchern gekauft werden können @de
in scheme: Media Topic
created: 2019-11-25T12:00:00+00:00
modified: 2023-03-31T12:00:00+00:00
broader: products and services
narrower: retail
narrower: wholesale
narrower: auction

healthcare industry
type: Concept
preferred label: Industria de la salud @es
preferred label: Industrie des soins de santé @fr
preferred label: قطاع الرعاية الصحية @ar
preferred label: helseleverandørar @no-nn
preferred label: helseleverandører @no-nb
preferred label: Gesundheitsindustrie @de
preferred label: Hälsovårdsproduktion @se
definition: Goods and services to treat patients through curative, preventive, rehabilitative and palliative care
definition: Tillverkning av hjälpmedel och tjänster för att behandla patienter förebyggande, läkande och palliativt. @se
definition: Waren und Dienstleistungen zur Behandlung von Patienten durch kurative, präventive, rehabilitative und palliative Pflege @de
in scheme: Media Topic
created: 2022-06-14T12:00:00+00:00
modified: 2022-06-14T12:00:00+00:00
broader: products and services
narrower: biotechnology business
narrower: pharmaceutical
narrower: health care provider
narrower: medical equipment

financial service
type: Concept
preferred label: finanstjenester @no-nb
preferred label: finanstenester @no-nn
preferred label: Finansiella tjänster @se
preferred label: Finanzdienstleistung @de
definition: Professional services involving the investment, lending or management of money and other assets
definition: Professionella tjänster för att hjälpa till med investeringar, lån och ekonomisk rådgivning. @se
definition: Professionelle Dienstleistungen im Zusammenhang mit der Anlage, Ausleihe oder Verwaltung von Geld und anderen Vermögenswerten @de
in scheme: Media Topic
created: 2023-03-31T12:00:00+00:00
modified: 2023-03-31T12:00:00+00:00
broader: products and services
narrower: accountancy and auditing
narrower: banking
narrower: insurance
narrower: financial advisory service
narrower: personal finance and investment
narrower: stock broking
narrower: loans and lending
narrower: asset management

business service
type: Concept
preferred label: selskapstjenester @no-nb
preferred label: selskapstenester @no-nn
preferred label: Företagsservice @se
preferred label: Unternehmensdienstleistung @de
definition: Services provided to business operations and for individuals, such as consulting, legal representation and job placement
definition: Tjänster som erbjuds i första hand företag som exempelvis konsulttjänster, juridisk representation och bemanning. @se
definition: Dienstleistungen für Unternehmen und Privatpersonen, wie Beratung, Rechtsvertretung und Arbeitsvermittlung @de
in scheme: Media Topic
created: 2023-03-31T12:00:00+00:00
modified: 2023-03-31T12:00:00+00:00
broader: products and services
narrower: consultancy
narrower: employment agency
narrower: janitorial service
narrower: legal service
narrower: personal service
narrower: rental service
narrower: shipping and postal service
narrower: wedding service
narrower: trade show or expo
narrower: payment service
narrower: physical security

aquaculture
type: Concept
preferred label: Acuicultura @es
preferred label: Aquaculture @fr
preferred label: مزارع سمك @ar
preferred label: Vattenodling @se
preferred label: Aquakultur @de
preferred label: aquacultura @pt-pt
preferred label: akvakultur @dk
preferred label: 水产养殖 @zh-hans
definition: Growing plants or animals in water for human consumption
definition: Zucht von Wasserpflanzen und -tieren zum Gebrauch unter kontrollierten Bedingungen @de
definition: Odling i vatten av fisk, skaldjur och alger. @se
definition: Produção de plantas ou animais em água para consumo humano. @pt-pt
definition: Dyrkning i vand af fisk, skaldyr og alger. @dk
definition: 供人类消费的水生植物或动物 @zh-hans
change note: Retired. Use medtop:20000210 agriculture instead.
in scheme: Media Topic
created: 2009-10-22T02:00:00+00:00
retired: 2023-03-31T12:00:00+00:00
modified: 2023-03-31T12:00:00+00:00
broader: agriculture

arable farming
type: Concept
preferred label: Cultures @fr
preferred label: Ackerbau @de
preferred label: Cultivos agrícolas @es
preferred label: زراعة @ar
preferred label: Jordbruk @se
preferred label: agricultura @pt-pt
preferred label: agerlandbrug @dk
preferred label: 种植业 @zh-hans
preferred label: åkerbruk @no-nb
definition: Utnyttjande av mark till åkerbruk eller bete för produktion av livsmedel, fodermedel och råvaror till energiändamål eller till vidare industriell förädling eller beredning. @se
definition: The growing of plants on a large scale commercially, especially a cereal, fruit, grain or vegetable
definition: Gewinnung von Nahrungsmittel aus dem Boden @de
definition: Produção de alimentos no solo. @pt-pt
definition: Udnyttelse af jord til agerbrug eller græsning til produktion af fødevarer, foder og råvarer til energiformål eller til videre industriel forarbejdning eller forarbejdning. @dk
definition: 利用土地栽培各种农作物 @zh-hans
change note: Retired. Use medtop:20000210 agriculture instead.
in scheme: Media Topic
created: 2009-10-22T02:00:00+00:00
retired: 2023-03-31T12:00:00+00:00
modified: 2023-03-31T12:00:00+00:00
broader: agriculture

livestock farming
type: Concept
preferred label: Tierhaltung @de
preferred label: Élevage @fr
preferred label: Ganadería y avicultura @es
preferred label: تربية الماشية @ar
preferred label: Djurhållning @se
preferred label: pecuária @pt-pt
preferred label: husdyrbrug @dk
preferred label: 畜牧业 @zh-hans
preferred label: husdyrhold @no-nb
preferred label: husdyrhald @no-nn
definition: Züchtung von Tieren als Nahrungsmittel @de
definition: Raising of animals for their by-products, such as meat, eggs, milk, fur and wool
definition: Uppfödning av djur för framställning av mat. @se
definition: Criação de animais para consumo alimentar. @pt-pt
definition: Avl af dyr til produktion af mad eller pels. @dk
definition: 饲养动物获取食物 @zh-hans
change note: Retired. Use medtop:20000210 agriculture instead.
in scheme: Media Topic
created: 2009-10-22T02:00:00+00:00
retired: 2023-03-31T12:00:00+00:00
modified: 2023-03-31T12:00:00+00:00
broader: agriculture

viniculture
type: Concept
preferred label: Weinbau @de
preferred label: Viticulture @fr
preferred label: Vinodling @se
preferred label: Vinicultura @es
preferred label: زراعة كروم @ar
preferred label: vinicultura @pt-pt
preferred label: vinavl @dk
preferred label: 葡萄栽培 @zh-hans
preferred label: vinproduksjon @no-nb
definition: Herstellung von Weinen von der Weinrebe bis zum Endprodukt @de
definition: Framställandet av vin, från vinrankan till den färdiga produkten. @se
definition: Production of wines from the vines to the finished products
definition: Produção de vinhos, desde as vinhas até ao produto final. @pt-pt
definition: Produktionen af vin, fra druer til det færdige produkt. @dk
definition: 从葡萄栽培到葡萄酒酿造的全过程 @zh-hans
change note: Retired. Use medtop:20000324 beverage and grocery instead.
in scheme: Media Topic
created: 2009-10-22T02:00:00+00:00
retired: 2023-03-31T12:00:00+00:00
modified: 2023-03-31T12:00:00+00:00
broader: agriculture

fertiliser
type: Concept
preferred label: Fertilizantes @es
preferred label: اسمدة @ar
preferred label: Gödningsmedel @se
preferred label: Engrais @fr
preferred label: Düngemitel @de
preferred label: fertilizantes @pt-pt
preferred label: gødning @dk
preferred label: 化肥 @zh-hans
preferred label: gjødsel @no-nb
preferred label: fertilizer
definition: Naturligt eller tillverkat material som på olika sätt och i olika former tillförs jorden för att öka dess avkastning. @se
definition: Natürliche oder künstliche Stoffe, um das Wachstum von Pflanzen zu fördern @de
definition: Natural or manmade materials used to encourage the growth of plants
definition: Materiais naturais ou feitos pelo homem para estimular o crescimento de plantas. @pt-pt
definition: Naturligt eller fremstillet materiale, der tilføres jorden for at øge udbyttet. @dk
definition: 用于促进植物生长的天然或人造材料 @zh-hans
change note: Retired. Use medtop:20000217 chemicals instead.
in scheme: Media Topic
created: 2009-10-22T02:00:00+00:00
retired: 2023-03-31T12:00:00+00:00
modified: 2023-03-31T12:00:00+00:00
broader: chemicals

health and beauty product
type: Concept
preferred label: Productos de salud y belleza @es
preferred label: Hygiène et Cosmétiques @fr
preferred label: Kosmetik @de
preferred label: صحة ومواد تجميل @ar
preferred label: Hälso- och skönhetsprodukter @se
preferred label: produtos de saúde e beleza @pt-pt
preferred label: sundhed og skønhedsprodukter @dk
preferred label: 保健和美容产品 @zh-hans
preferred label: helse- og skjønnhetsprodukter @no-nb
preferred label: helse- og skjønnheitsprodukt @no-nn
definition: Kemikalier och andra substanser som använd för att framhäva en persons utssende eller doft. @se
definition: Compilation of chemicals and other substances for use in enhancing ones looks or smell
definition: Zusammenstellung von chemischen und anderen Stoffen um Aussehen und Geruch zu verbessern. @de
definition: Produtos químicos e outras substâncias usados para embelezamento físico. @pt-pt
definition: Produkter, der bruges til at fremhæve en persons udseende eller duft. @dk
definition: 合成化学物质和其他物质用于美化外貌或改善气味 @zh-hans
change note: Retired. Use medtop:20001248 cosmetics instead.
in scheme: Media Topic
created: 2009-10-22T02:00:00+00:00
retired: 2023-03-31T12:00:00+00:00
modified: 2023-03-31T12:00:00+00:00
broader: chemicals

inorganic chemical
type: Concept
preferred label: Chimie inorganique @fr
preferred label: مواد كيميائية لا عضوية @ar
preferred label: Productos químicos inorgánicos @es
preferred label: Anorganische Chemie @de
preferred label: Mineraler & metaller @se
preferred label: químicos inorgânicos @pt-pt
preferred label: uorganisk kemi @dk
preferred label: 无机化学 @zh-hans
preferred label: uorganisk kjemi @no-nb
definition: Den del av kemin som handlar om mineraler och metaller. @se
definition: The branch of chemistry dealing with minerals and metals
definition: Zweig der Chemie, der von Mineralien und Metallen handelt @de
definition: Ramo da química que estuda minerais e metais. @pt-pt
definition: Den del af kemi, der beskæftiger sig med mineraler og metaller. @dk
definition: 化学分支，研究矿物和金属 @zh-hans
definition: Grein innan kjemien som omhandlar mineral og metall - forbindelsar utan karbon. @no-nn
definition: Gren innen kjemien som omhandler mineraler og metaller - forbindelser uten karbon @no-nb
change note: Retired. Use medtop:20000217 chemicals instead.
in scheme: Media Topic
created: 2009-10-22T02:00:00+00:00
retired: 2023-03-31T12:00:00+00:00
modified: 2023-03-31T12:00:00+00:00
broader: chemicals

organic chemical
type: Concept
preferred label: مواد كيميائية عضوية @ar
preferred label: Productos químicos orgánicos @es
preferred label: Chimie organique @fr
preferred label: Organisk kemi @se
preferred label: Organische Chemie @de
preferred label: químicos orgânicos @pt-pt
preferred label: organisk kemi @dk
preferred label: 有机化学 @zh-hans
preferred label: organisk kjemi @no-nb
definition: The branch of chemistry dealing with human, animal or carbon-based substances
definition: Den del av kemin som handlar om människor, djur och kolbaserade substanser. @se
definition: Zweig der Chemie, der von menschlichen, tierischen oder kohlenstoffbasierten Stoffen handelt @de
definition: Ramo da química que estuda substâncias humanas, animais ou à base de carbono. @pt-pt
definition: Den del af kemi, der beskæftiger sig med mennesker, dyr og kulstofbaserede stoffer. @dk
definition: 化学分支，研究人类、动物或碳基物质 @zh-hans
definition: Grein innan kjemien som omhandlar menneske, dyr og karbonbaserte stoff. @no-nn
definition: Gren innen kjemien som angår, mennesker, dyr og karbonbaserte stoffer. @no-nb
change note: Retired. Use medtop:20000217 chemicals instead.
in scheme: Media Topic
created: 2009-10-22T02:00:00+00:00
retired: 2023-03-31T12:00:00+00:00
modified: 2023-03-31T12:00:00+00:00
broader: chemicals

pesticide and herbicide
type: Concept
definition: Chemicals used to eliminate weeds and pests
in scheme: Media Topic
created: 2025-10-09T12:00:00+00:00
modified: 2025-10-09T12:00:00+00:00
broader: chemicals

biotechnology business
type: Concept
preferred label: Biotecnología @es
preferred label: Biotechnologie @de
preferred label: تجارة تكنولوجيا حيوية @ar
preferred label: Entreprise de biotechnologie @fr
preferred label: Bioteknik @se
preferred label: biotecnologia @pt-pt
preferred label: bioteknologisk virksomhed @dk
preferred label: 生物技术 @zh-hans
preferred label: bioteknologibransjen @no-nb
definition: The business of using engineering technology to study and solve problems of living organisms
definition: Tätigkeiten, die Technologien verwenden, um Probleme und Lösungen von lebenden Organismen zu erforschen @de
definition: Det tekniska utnyttjandet av celler och cellbeståndsdelar för att framställa eller modifiera produkter, som används inom samhällssektorer som hälsovård, livsmedelshantering och jordbruk. @se
definition: Uso de engenharia tecnológica para estudar e resolver problemas dos organismos vivos. @pt-pt
definition: Den tekniske udnyttelse af celler og cellulære komponenter til at producere eller ændre produkter, der bruges i blandt andet sundhedspleje, fødevarestyring og landbrug. @dk
definition: 利用工程技术研究和解决生物问题的业务 @zh-hans
in scheme: Media Topic
created: 2009-10-22T02:00:00+00:00
modified: 2022-06-14T12:00:00+00:00
broader: healthcare industry

pharmaceutical
type: Concept
preferred label: صيدلي @ar
preferred label: Läkemedelsproduktion @se
preferred label: Pharmacie @fr
preferred label: Productos farmacéuticos @es
preferred label: Pharmaindustrie @de
preferred label: indústria farmacêutica @pt-pt
preferred label: medicinalvirksomhed @dk
preferred label: 制药 @zh-hans
preferred label: farmasøytisk industri @no-nb
definition: The production of medicines from various chemicals and natural substances and the research and discovery around new medications
definition: Die Herstellung von Medizin aus verschiedenen Chemikalien und natürlichen Stoffen @de
definition: Framställandet av mediciner ur diverse kemikalier och naturliga substanser. @se
definition: Produção de medicamentos a partir de substâncias químicas ou naturais. @pt-pt
definition: Fremstilling af medicin fra forskellige kemikalier og naturlige stoffer. @dk
definition: 利用各种化学物质和天然物质生产药品 @zh-hans
in scheme: Media Topic
created: 2009-10-22T02:00:00+00:00
modified: 2023-03-31T12:00:00+00:00
broader: healthcare industry

computer and telecommunications hardware
type: Concept
preferred label: Hardware @de
preferred label: مكونات صلبة (كمبيوتر) @ar
preferred label: Hårdvara @se
preferred label: Ordinateurs @fr
preferred label: hardware @pt-pt
preferred label: 硬件 @zh-hans
preferred label: maskinvare @no-nb
definition: Physical devices used to provide computer and telecommunication service, such as modems, keyboards, hard drives, telephones, routers and monitors
definition: Maskinell utrustning i dataanläggning, det vill säga själva maskinen, skivminnen, terminaler med mera. @se
definition: Physikalisches Gerät zur Unterstützung der Dienstleistung eines Computers, wie Monitor, Festplatten, Tastatur etc. kann auch benutzt werden für Ausrüstung wie Router, Server und andere Netzwerkgeräte @de
definition: Componentes físicos usados para fornecer serviços computacionais, tais como monitor, disco rígido, teclado, etc. e que também incluem routers, servidores e outros dispositivos de rede. @pt-pt
definition: Componentes físicos usados para fornecer serviços computacionais, tais como tela, disco rígido, teclado etc. e que também incluem roteadores, servidores e outros dispositivos de rede. @pt-br
definition: Computerudstyr. @dk
definition: 用于提供计算机服务的物理设备，如显示器、硬盘、键盘等，也可用于路由器、服务器等网络设备 @zh-hans
in scheme: Media Topic
created: 2009-10-22T02:00:00+00:00
modified: 2023-03-31T12:00:00+00:00
broader: computing and information technology

computer networking
type: Concept
preferred label: Netzwerk @de
preferred label: Interconexión @es
preferred label: ربط شبكات @ar
preferred label: Réseaux de communication @fr
preferred label: Datanätverk @se
preferred label: ligação em rede @pt-pt
preferred label: conexão em rede @pt-br
preferred label: datanetværk @dk
preferred label: 计算机网络 @zh-hans
preferred label: datanettverk @no-nb
definition: The interconnectivity between hardware that provides the medium for the transmission of data.
definition: Verbindung zwischen Computern, die den Austausch von Daten ermöglichen @de
definition: Kommunikations @se
definition: Interconexão entre os componentes de hardware que estabelece um meio de transmissão de dados. @pt-pt
definition: Kommunikationsnetværk specielt designet til datatransmission. @dk
definition: 提供数据传输媒介的硬件之间的互连 @zh-hans
in scheme: Media Topic
created: 2009-10-22T02:00:00+00:00
retired: 2023-03-31T12:00:00+00:00
modified: 2023-03-31T12:00:00+00:00
broader: computing and information technology

satellite technology
type: Concept
preferred label: تقنيات اقمار اصطناعية @ar
preferred label: Satellites @fr
preferred label: Tecnología satelital @es
preferred label: Satellitteknik @se
preferred label: Satellitentechnologie @de
preferred label: tecnologia de satélite @pt-pt
preferred label: satellitteknologi @dk
preferred label: 卫星技术 @zh-hans
definition: Hardware and software that enables ground-based devices to send signals to each other via an orbiting satellite.
definition: Hardware und Software, die Geräte unterstützt um Signale hin und her zusenden via Satellit im Weltraum @de
definition: Hårdvara och mjukvara som möjliggör kommunikation mellan apparater placerade på jorden och satelliter i omloppsbana runt jorden. @se
definition: Hardware e software que permite que aparelhos em terra enviem sinais entre si, através de satélites em órbita. @pt-pt
definition: Hardware og software, der muliggør kommunikation mellem enheder placeret på Jorden og satellitter i kredsløb omkring Jorden. @dk
definition: 使地面设备能够通过轨道卫星互相发送信号的硬件和软件 @zh-hans
in scheme: Media Topic
created: 2009-10-22T02:00:00+00:00
modified: 2021-05-05T12:00:00+00:00
broader: computing and information technology

computer security
type: Concept
preferred label: Sécurité informatique @fr
preferred label: Sicherheitstechnologie @de
preferred label: Seguridad @es
preferred label: Datasäkerhet @se
preferred label: امن @ar
preferred label: segurança informática @pt-pt
preferred label: datasikkerhed @dk
preferred label: 计算机安全 @zh-hans
preferred label: datasikkerhet @no-nb
preferred label: datatryggleik @no-nn
definition: Allt som rör säkerhet för it-system. @se
definition: To encompass technical developments in hardware and software, basic research and related areas such as cyber security
definition: Umfasst technische Entwicklungen in Hardware und Software, Forschung und verwandte Gebiete wie Cyber-Sicherheit @de
definition: Tudo o que diz respeito a desenvolvimentos técnicos em hardware e software, investigação básica e áreas relacionadas, como cibersegurança. @pt-pt
definition: Alt om sikkerhed for datasystemer. @dk
definition: 基础研究和网络安全等相关领域的软硬件技术发展 @zh-hans
change note: Retired. Use medtop:20000086 cyber crime or medtop:20001361 cyber warfare instead.
in scheme: Media Topic
created: 2009-10-22T02:00:00+00:00
retired: 2023-03-31T12:00:00+00:00
modified: 2023-03-31T12:00:00+00:00
broader: computing and information technology

semiconductor and electronic component
type: Concept
preferred label: Semiconductores @es
preferred label: Semi-conducteurs et composants électroniques @fr
preferred label: موصل احادي وعنصر نشيط @ar
preferred label: Elektronik @de
preferred label: Kretskort och datorkomponenter @se
preferred label: semicondutores e componentes ativos @pt-pt
preferred label: halvleder og aktiv komponent @dk
preferred label: 半导体和有源元件 @zh-hans
preferred label: halvledere og elektriske komponenter @no-nb
preferred label: halvleiarar og elektriske komponent @no-nn
definition: Grundläggande komponenter som tillsammans blir fungerande elektriska apparater som t ex datorer. @se
definition: Grundlegende Komponenten die das Funktionieren elektronischer Geräte ermöglichen, wie beispielsweise Computer @de
definition: The basic components that together create working electronic devices such as computer chips, transistors, diodes and integrated circuits
definition: Os componentes básicos que, juntos, permitem o funcionamento de dispositivos eletrónicos, como os computadores. @pt-pt
definition: Os componentes básicos que, juntos, permitem o funcionamento de dispositivos eletrônicos, como os computadores. @pt-br
definition: Grundlæggende komponenter, der sammen bliver fungerende elektriske apparater, såsom computere. @dk
definition: 用于制造工作电子设备，如电脑的基本元器件 @zh-hans
in scheme: Media Topic
created: 2009-10-22T02:00:00+00:00
modified: 2023-03-31T12:00:00+00:00
broader: computing and information technology

software and applications
type: Concept
preferred label: برامج معلوماتية @ar
preferred label: Software @de
preferred label: Mjukvara @se
preferred label: Logiciel @fr
preferred label: software @pt-pt
preferred label: software og apps @dk
preferred label: 软件 @zh-hans
preferred label: programvare @no-nb
definition: Computer programs including mobile or web apps and operating systems
definition: Programme, die bei Installation auf der Hardware bestimmte Funktionen ausführen @de
definition: Datorprogram som, vid installation i hårdvara, utför specificerade funktioner. @se
definition: Conjunto de programas que, quando instalados em computadores, realizam funções específicas. @pt-pt
definition: Elektroniske programmer , der installeres på blandt andet computere eller mobiltelefoner. @dk
definition: 安装在硬件上来执行特定功能的程序集 @zh-hans
in scheme: Media Topic
created: 2009-10-22T02:00:00+00:00
modified: 2023-03-31T12:00:00+00:00
broader: computing and information technology

telecommunication equipment
type: Concept
preferred label: Équipement de télécommunication @fr
preferred label: Equipos de telecomunicaciones @es
preferred label: Telekommunikation Ausrüstung @de
preferred label: معدات اتصالات @ar
preferred label: Telekomutrustning @se
preferred label: equipamentos de telecomunicação @pt-pt
preferred label: telekommunikationsudstyr @dk
preferred label: 电信设备 @zh-hans
preferred label: telekommunikasjonsutstyr @no-nb
definition: Geräte wie Telefonanlagen, Modems, Fax etc. die den Austausch von Sprache/Daten erleichtern @de
definition: Varor som underlättar överföring av data eller röstmeddelanden, t ex telefoner, växlar och modem. @se
definition: Devices such as telephone sets, voice/data switches, modems etc that facilitate point-to-point voice/data transmissions
definition: Aparelhos como telefones, comutadores de integração voz/dados, modems, etc., que facilitam a transmissão voz/dados de um ponto para outro. @pt-pt
definition: Aparelhos como telefones, comutadores de integração voz/dados, modems etc., que facilitam a transmissão voz/dados de um ponto para outro. @pt-br
definition: Varer, der letter transmissionen af data eller stemmemeddelelser, såsom telefoner, switches og modemmer. @dk
definition: 实现点对点语音或数据传输的设备，如电话机、语音数据交换机、调制解调器等 @zh-hans
change note: Retired. Use medtop:20000226 computer and telecommuncations hardware instead.
in scheme: Media Topic
created: 2009-10-22T02:00:00+00:00
retired: 2023-03-31T12:00:00+00:00
modified: 2023-03-31T12:00:00+00:00
broader: computing and information technology

telecommunication service
type: Concept
preferred label: Servicio de telecomunicaciones @es
preferred label: خدمات اتصالات @ar
preferred label: Service de télécommunication @fr
preferred label: Telekommunikation Service @de
preferred label: Telekomtjänster @se
preferred label: serviços de telecomunicações @pt-pt
preferred label: telekommunikationstjeneste @dk
preferred label: 电信服务 @zh-hans
preferred label: telekommunikasjonstjenester @no-nb
preferred label: telekommunikasjonstenester @no-nn
definition: Dienstleistung, die von kommerziellen Firmen angeboten wird, die die Verbindung zwischen Telefonen, Fax und Computern erleichtern. @de
definition: Tjänster som tillhandahålls av kommersiella företag för att underlätta kommunikationen mellan telefoner eller datorer. @se
definition: Services provided by commercial companies that facilitate connections between telephones and computers
definition: Serviços fornecidos por empresas que facilitam ligações entre telefones, pagers ou computadores. @pt-pt
definition: Tjeneste leveret af kommercielle virksomheder for at lette kommunikationen mellem telefoner eller computere. @dk
definition: 商业公司提供的电话、寻呼机、计算机之间连接的服务 @zh-hans
in scheme: Media Topic
created: 2009-10-22T02:00:00+00:00
modified: 2023-03-31T12:00:00+00:00
broader: computing and information technology

wireless technology
type: Concept
preferred label: Technologies mobiles @fr
preferred label: Wireless-Technologie @de
preferred label: Trådlös teknik @se
preferred label: Tecnología inalámbrica @es
preferred label: تكنولوجيا اتصالات لاسلكية @ar
preferred label: tecnologia sem fios @pt-pt
preferred label: tecnologia sem fio @pt-br
preferred label: trådløs teknologi @dk
preferred label: 无线技术 @zh-hans
preferred label: trådløs kommunikasjon @no-nb
preferred label: trådlaus kommunikasjon @no-nn
definition: Technology and services that permit the transfer of information between separated points without physical connection, including Bluetooth and Wi-Fi networks
definition: Austausch von Informationen mit Mitteln außerhalb der direkten verdrahteten Schaltung @de
definition: Överföring av information på andra sätt än genom kablar. @se
definition: Transmissão de informação sem utilizar fios ou cabos conectados. @pt-pt
definition: Overførsel af information på andre måder end via kabler. @dk
definition: 除点对点有线连接以外的其他传输信息方式 @zh-hans
in scheme: Media Topic
created: 2009-10-22T02:00:00+00:00
modified: 2024-07-01T12:00:00+00:00
broader: computing and information technology

Internet of Things
type: Concept
preferred label: internet das coisas @pt-pt
preferred label: tingenes internet @dk
preferred label: 物联网 @zh-hans
preferred label: tingenes internett @no-nb
preferred label: Internet der Dinge @de
preferred label: Objets connectés @fr
preferred label: Objetos conectados @es
preferred label: انترنت الاشياء @ar
preferred label: nett-tilkopla ting @no-nn
definition: Vardagsföremål som hushållsapparater, kläder och accessoarer, men även maskiner, fordon och byggnader, med inbyggd elektronik och internetuppkoppling, vilket gör att de kan styras eller utbyta data över nätet. @se
definition: A network of devices using microchips, electronic sensors and communication by the Internet
definition: Rede de objetos e utensílios interligados por protocolos de comunicação, usando microchips, sensores eletrónicos e comunicação pela Internet. @pt-pt
definition: Rede de objetos e utensílios interligados por protocolos de comunicação, usando microchips, sensores eletrônicos e comunicação pela Internet. @pt-br
definition: Produkter med indbygget elektronik og internetforbindelse, der gør det muligt for dem at kontrollere eller udveksle data over netværket. @dk
definition: 由使用微芯片、电子传感器和因特网通信的设备组成的网络 @zh-hans
definition: Ein Netzwerk von Geräten mit Mikrochips, elektronischen Sensoren und Kommunikation über das Interne @de
change note: Retired. Use medtop:20000226 hardware, or generic medtop:20000225 computing and information technology as appropriate.
in scheme: Media Topic
created: 2016-04-04T12:00:00+00:00
retired: 2023-03-31T12:00:00+00:00
modified: 2023-03-31T12:00:00+00:00
broader: computing and information technology

design and engineering
type: Concept
preferred label: Architecture et ingénierie industrielles @fr
preferred label: تصميم وهندسة @ar
preferred label: Deseño e ingeniería @es
preferred label: Design und Technik @de
preferred label: Stadsbyggnad @se
preferred label: design e engenharia @pt-pt
preferred label: bygningskonstruktion @dk
preferred label: 设计与工程 @zh-hans
preferred label: prosjektering @no-nb
definition: Utredning genomförd av ingenjörer och arkitekter som beskriver var och hur något ska byggas, t ex vägar, kontorsbyggnader och fabriker. @se
definition: Design and planning by engineers, architects etc. of roads, offices, factories, dams , offshore structures.
definition: Design und Planung durch Ingenieure, Architekten etc. von Straßen, Büros, Fabriken, Dämmen, Bauwerken in Gewässern @de
definition: Conceção e planeamento, por engenheiros e arquitetos, de estradas, escritórios, fábricas, barragens, etc. @pt-pt
definition: Concepção e planejamento, por engenheiros, arquitetos, de estradas, escritórios, fábricas, represas etc. @pt-br
definition: Undersøgelse foretaget af ingeniører og arkitekter, der beskriver, hvor og hvordan noget skal bygges. @dk
definition: 由工程师、建筑师等设计和规划道路、办公室、工厂、大坝、海上构筑物 @zh-hans
change note: Retired. Use medtop:20001245 infrastructure projects instead.
in scheme: Media Topic
created: 2009-10-22T02:00:00+00:00
retired: 2023-03-31T12:00:00+00:00
modified: 2023-03-31T12:00:00+00:00
broader: construction and property

farms
type: Concept
preferred label: Landwirtschaftsbau @de
preferred label: Granjas @es
preferred label: Terres agricoles @fr
preferred label: Jordbruksfastigheter @se
preferred label: مزارع @ar
preferred label: propriedade agrícola @pt-pt
preferred label: landbrugsejendom @dk
preferred label: 农场 @zh-hans
preferred label: gårdsbruk @no-nb
preferred label: gardsbruk @no-nn
definition: Agricultural areas for the production of foodstuffs, including dairy products, fruits and livestock, such as cattle and fish
definition: Jordbruksområden för produktion av livsmedel, inklusive mjölkprodukter, frukt, boskap och fisk. @se
definition: Landwirtschaftliche Areale zur Nahrungsmittelproduktion wie Milch, Obst und Tierbestand wie Vieh und Fisch @de
definition: Áreas agrícolas para a produção alimentar, incluindo laticínios, frutos, gado e peixe. @pt-pt
definition: Landbrugsområder til fødevareproduktion, herunder mejeriprodukter, frugt, husdyr og fisk. @dk
definition: 用于生产食品的农业区，包括乳制品、水果和牲畜，如牛和鱼 @zh-hans
change note: Retired. Use medtop:20000210 agriculture instead.
in scheme: Media Topic
created: 2009-10-22T02:00:00+00:00
retired: 2019-10-07T12:00:00+00:00
modified: 2023-03-31T12:00:00+00:00
broader: construction and property

heavy construction
type: Concept
preferred label: Construcción pesada @es
preferred label: Infrastrukturbyggnad @se
preferred label: Tiefbau @de
preferred label: Travaux publics @fr
preferred label: منشآت ثقيلة @ar
preferred label: obras públicas @pt-pt
preferred label: anlægsbyggeri @dk
preferred label: 大型建筑 @zh-hans
preferred label: store byggeprosjekter @no-nb
preferred label: store byggjeprosjekt @no-nn
definition: Bau von Straßen, Dämmen, Büro- und anderen Großbauten @de
definition: Large scale construction projects, construction of roads, dams, office/factory buildings, offshore and onshore structures, large sport stadiums
definition: Storskaliga konstruktionsprojekt, t ex vägar, dammar, kontors- och fabriksbyggnader och arenor. @se
definition: Projetos de construção de grande escala: estradas, barragens, edifícios de escritórios, fábricas, estádios, etc. @pt-pt
definition: Projetos de construção de grande escala: estradas, represas, edifícios de escritórios, fábricas, estádios etc. @pt-br
definition: Store byggeprojekter som veje, dæmninger, kontor- og fabriksbygninger og arenaer. @dk
definition: 大型建设项目、公路、大坝、厂房、近海及陆上建筑、大型体育场馆建设 @zh-hans
change note: Retired. Use medtop:20000235 construction and property instead.
in scheme: Media Topic
created: 2009-10-22T02:00:00+00:00
retired: 2019-07-25T12:00:00+00:00
modified: 2023-03-31T12:00:00+00:00
broader: construction and property

house building
type: Concept
preferred label: Wohnungsbau @de
preferred label: بناء مساكن @ar
preferred label: Bâtiment @fr
preferred label: Construcción de viviendas @es
preferred label: Husbyggnad @se
preferred label: construção civil @pt-pt
preferred label: boligbyggeri @dk
preferred label: 住房建设 @zh-hans
preferred label: husbygging @no-nb
definition: Construction of residences, for private use
definition: Bau von Wohnraum zur privaten Nutzung @de
definition: Bygge av bostäder för privat bruk. @se
definition: Construção de residências, para uso privado. @pt-pt
definition: Opførelse af boliger til privat brug. @dk
definition: 建设住宅供私人使用 @zh-hans
definition: Bygging av bustader til privat bruk. @no-nn
definition: Bygging av boliger til privat bruk @no-nb
change note: Retired. Use medtop:20001368 residential real estate instead.
in scheme: Media Topic
created: 2009-10-22T02:00:00+00:00
retired: 2023-03-31T12:00:00+00:00
modified: 2023-03-31T12:00:00+00:00
broader: construction and property

land price
type: Concept
preferred label: Prix foncier @fr
preferred label: Grundstückspreis @de
preferred label: Costo de tierras @es
preferred label: اسعار اراضي @ar
preferred label: Markpriser @se
preferred label: preço do terreno @pt-pt
preferred label: jordpris @dk
preferred label: 土地价格 @zh-hans
preferred label: tomtepris @no-nb
definition: The price of land in specific zoned areas such as commercial, residential or arable as provided by a responsible body
definition: Priset på land för specifik användning (kommersiellt, bostäder, jordbruk). @se
definition: Preis eines Grundstücks in speziellen Gebieten, z.B. für die kommerzielle Nutzung, als Bauland oder als Ackerland nutzbar @de
definition: Preço da terra em áreas específicas como zonas comerciais, residenciais ou cultiváveis e que é determinado por uma entidade responsável. @pt-pt
definition: Prisen på jord til specifik brug (kommerciel, bolig, landbrug). @dk
definition: 有关机构提供的特定区域的土地价格，如商业区、住宅区或耕地 @zh-hans
change note: Retired. Use medtop:20001368 residential real estate instead.
in scheme: Media Topic
created: 2009-10-22T02:00:00+00:00
retired: 2023-03-31T12:00:00+00:00
modified: 2023-03-31T12:00:00+00:00
broader: construction and property

real estate
type: Concept
preferred label: عقارات @ar
preferred label: Immobilien @de
preferred label: fast ejendom @dk
preferred label: Bienes raíces @es
preferred label: Immobilier @fr
preferred label: fast eiendom @no-nb
preferred label: imobiliário @pt-br
preferred label: Fastigheter @se
preferred label: 房地产 @zh-hans
preferred label: fast eigedom @no-nn
definition: Kaufen und Verkaufen von baulichem Eigentum aller Art @de
definition: Køb, salg og udlejning af ejendomme. @dk
definition: The buying, selling, renting and leasing of properties of all types
definition: Compra, venda e arrendamento de todo tipo de propriedades. @pt-br
definition: Compra, venda e arrendamento de todo o tipo de propriedades. @pt-pt
definition: Köp, försäljning och uthyrning av egendom av alla dess slag. @se
definition: 买卖、租赁各类不动产业务 @zh-hans
change note: Retired. Use medtop:20001368 residential real estate or medtop:20001367 commercial real estate instead.
in scheme: Media Topic
created: 2009-10-22T02:00:00+00:00
retired: 2023-03-31T12:00:00+00:00
modified: 2023-03-31T12:00:00+00:00
broader: construction and property

building material
type: Concept
preferred label: مواد بناء @ar
preferred label: Matériaux de construction @fr
preferred label: Byggmaterial @se
preferred label: Materiales de construcción @es
preferred label: Baustoff @de
preferred label: material de construção @pt-pt
preferred label: byggematerialer @dk
preferred label: 建筑材料 @zh-hans
preferred label: byggevarebransjen @no-nb
preferred label: byggjevarebransjen @no-nn
definition: Fertigung von Materialien wie Bauplatten, Holzbefestigungen für die Bauindustrie @de
definition: Tillverkning av material som används i byggindustrin, såsom väggskivor. @se
definition: Manufacturing of the materials used in construction, such as wallboard, lumber and wire
definition: Fabrico de materiais para a indústria da construção. @pt-pt
definition: Fremstilling af materialer, der bruges i byggebranchen. @dk
definition: 如墙板、木材等与建筑业相关的材料加工 @zh-hans
in scheme: Media Topic
created: 2009-10-22T02:00:00+00:00
modified: 2023-03-31T12:00:00+00:00
broader: construction and property

infrastructure projects
type: Concept
preferred label: infrastrukturprojekter @dk
preferred label: samferdselsprosjekter @no-nb
preferred label: projetos de infraestrutura @pt-br
preferred label: Infrastruktur @se
preferred label: 基础设施项目 @zh-hans
preferred label: Infrastruktuprojekte @de
preferred label: Projets d'infrastructure @fr
preferred label: Proyectos de infraestructura @es
preferred label: مشاريع بنى تحتية @ar
preferred label: samferdselsprosjekt @no-nn
definition: Byggeri af grundlæggende faciliteter som veje, broer, tunneller, telekommunikation og el-net. @dk
definition: The construction of the fundamental facilities and systems serving a country, city, or other area, including roads, bridges, dams, tunnels, telecommunications and electrical grids
definition: Construção das instalações e dos sistemas básicos que servem um país, cidade ou outra área, como estradas, pontes, represas, túneis, telecomunicações e redes elétricas. @pt-br
definition: Planering, anläggning och underhåll av grundläggande saker som vägar, broar, järnvägar, elnät osv. @se
definition: 为国家、城市或其他地区服务的基础设施和系统的建设，包括道路、桥梁、大坝、隧道、电信和电网 @zh-hans
definition: Der Bau der grundlegenden Einrichtungen und Systeme, die ein Land, eine Stadt oder ein anderes Gebiet versorgen, einschließlich Straßen, Brücken, Dämme, Tunnel, Telekommunikations- und Stromnetze @de
in scheme: Media Topic
created: 2019-07-25T12:00:00+00:00
modified: 2021-07-12T12:00:00+00:00
broader: construction and property

commercial building
type: Concept
preferred label: erhvervsbyggeri @dk
preferred label: construção comercial @pt-br
preferred label: bygging av næringseiendom @no-nb
preferred label: Företagsbyggnader @se
preferred label: 商业建筑 @zh-hans
preferred label: Geschäftsgebäude @de
preferred label: Construction de bâtiments destinés au commerce @fr
preferred label: Construcción de edificios comerciales @es
preferred label: مبنى تجاري @ar
preferred label: bygging av næringseigedom @no-nn
definition: Bygninger, der er beregnet til erhvervsbrug. Det kan være kontorbyggeri, butikker, restauranter og hoteller. @dk
definition: The construction of buildings for commerce and business, including office buildings, retail shops, restaurants, hotels and stadiums
definition: Construção de edifícios para comércio e negócios, como prédios de escritórios, lojas, restaurantes, hotéis e estádios. @pt-br
definition: Planering, bygge och underhåll av byggnader som främst används för kommersiell verksamhet. @se
definition: 商业建筑的建设，包括办公楼、零售店、餐馆、酒店和体育场馆 @zh-hans
definition: Der Bau von Gebäuden für Handel und Gewerbe, einschließlich Bürogebäuden, Einzelhandelsgeschäften, Restaurants, Hotels und Stadien @de
change note: Retired. Use medtop:20001367 commercial real estate instead.
in scheme: Media Topic
created: 2019-07-25T12:00:00+00:00
retired: 2023-03-31T12:00:00+00:00
modified: 2023-03-31T12:00:00+00:00
broader: construction and property

commercial real estate
type: Concept
preferred label: commercial real estate:
preferred label: næringseiendom @no-nb
preferred label: næringseigedom @no-nn
preferred label: Företagsbyggnader @se
preferred label: Gewerbeimmobilien @de
definition: The building and sale of property used for business purposes rather than as a living space
definition: Planering, bygge och underhåll av byggnader som främst används för kommersiell verksamhet. @se
definition: Bau und Verkauf von Immobilien, die für geschäftliche Zwecke und nicht als Wohnraum genutzt werden @de
in scheme: Media Topic
created: 2023-03-31T12:00:00+00:00
modified: 2023-03-31T12:00:00+00:00
broader: construction and property

residential real estate
type: Concept
preferred label: boligeiendom @no-nb
preferred label: bustadeigendom @no-nn
preferred label: Bostadsbyggande @se
preferred label: Wohnimmobilien @de
definition: The building and sale of property to be used as living space
definition: Uppförande och försäljning av fastigheter främst för bostäder. @se
definition: Bau und Verkauf von Immobilien, die als Wohnraum genutzt werden @de
in scheme: Media Topic
created: 2023-03-31T12:00:00+00:00
modified: 2023-03-31T12:00:00+00:00
broader: construction and property

beverage
type: Concept
preferred label: Boissons @fr
preferred label: Bebidas @es
preferred label: Getränke @de
preferred label: Drycker @se
preferred label: مشروبات @ar
preferred label: bebidas @pt-pt
preferred label: drikkevare @dk
preferred label: 饮料 @zh-hans
preferred label: drikke @no-nb
definition: Konsumierbare Getränke, alkoholische und nicht-alkoholische @de
definition: Liquid consumables, both alcoholic and non-alcoholic
definition: Drickbar vätska, med eller utan alkohol. @se
definition: Consumíveis líquidos, alcoólicos e não alcoólicos. @pt-pt
definition: Drikkelig væske, med eller uden alkohol. @dk
definition: 包括含酒精的和不含酒精的液体消耗品 @zh-hans
definition: Drikkevarer med eller utan alkohol. @no-nn
definition: Drikkevarer med eller uten alkohol @no-nb
change note: Retired. Use medtop:20000324 beverage and grocery instead.
in scheme: Media Topic
created: 2009-10-22T02:00:00+00:00
retired: 2023-03-31T12:00:00+00:00
modified: 2023-03-31T12:00:00+00:00
broader: consumer goods

clothing
type: Concept
preferred label: Bekleidung @de
preferred label: Vestuario @es
preferred label: Kläder @se
preferred label: Habillement @fr
preferred label: البسة @ar
preferred label: vestuário @pt-pt
preferred label: tøj @dk
preferred label: 服装 @zh-hans
preferred label: klær @no-nb
preferred label: klede @no-nn
definition: Plagg som människor bär på kroppen, till exempel tröjor, skjortor, kjolar, klänningar och byxor. @se
definition: The manufacturing and purchasing of apparel
definition: Waren, die als Kleidung getragen werden @de
definition: Artigos de vestuário. @pt-pt
definition: Tøj, som folk bruger på kroppen, såsom sweatere, skjorter, nederdele, kjoler og bukser. @dk
definition: 用于穿着的物品 @zh-hans
in scheme: Media Topic
created: 2009-10-22T02:00:00+00:00
modified: 2023-03-31T12:00:00+00:00
broader: consumer goods

grocery
type: Concept
preferred label: Alimentos @es
preferred label: Lebensmittel @de
preferred label: اغذية @ar
preferred label: Mat @se
preferred label: Distribution alimentaire @fr
preferred label: alimentação @pt-pt
preferred label: mad @dk
preferred label: 食品杂货 @zh-hans
preferred label: mat @no-nb
definition: The selling of edible goods for human consumption to the end customers
definition: Föda som regelbundet måste tillföras kroppen för att livsfunktionerna ska uppehållas. @se
definition: Früchte, Gemüse, Brot, Fleisch zum Verzehr für Menschen @de
definition: Venda de bens para consumo humano ao consumidor final. @pt-pt
definition: Salg af madvarer. @dk
definition: 向最终消费者售卖食杂品。描述对食品加工、配送、销售的内容宜入“食品业” @zh-hans
change note: Retired. Use medtop:20000324 beverage and grocery instead.
in scheme: Media Topic
created: 2009-10-22T02:00:00+00:00
retired: 2023-03-31T12:00:00+00:00
modified: 2023-03-31T12:00:00+00:00
broader: consumer goods

luxury good
type: Concept
preferred label: سلع فاخرة @ar
preferred label: Luxusgüter @de
preferred label: Lyxvaror @se
preferred label: Luxe @fr
preferred label: Artículos de lujo @es
preferred label: bens de luxo @pt-pt
preferred label: luksusvare @dk
preferred label: 奢侈品 @zh-hans
preferred label: luksusartikler @no-nb
preferred label: luksusartiklar @no-nn
definition: Non-essential high-end goods, such as leather bags, jewellery or supercars
definition: Ledertaschen, Schmuck, gehobene Mode, Accessoires etc. @de
definition: Varor som säljs till ett högt pris, t ex läderväskor och smycken. @se
definition: Carteiras em pele, joias, alta-costura, acessórios, etc. @pt-pt
definition: Bolsa de couro, joias, alta-costura, acessórios etc. @pt-br
definition: Varer, der sælges til en høj pris, såsom lædertasker og smykker. @dk
definition: 皮包、珠宝、高级时装、配饰等 @zh-hans
definition: Non-essential high-end goods, such as leather bags, jewelry or supercars
in scheme: Media Topic
created: 2009-10-22T02:00:00+00:00
modified: 2023-03-31T12:00:00+00:00
broader: consumer goods

non-durable good
type: Concept
preferred label: Biens de consommation courante @fr
preferred label: Förbrukningsvaror @se
preferred label: Artículos perecederos @es
preferred label: Gebrauchsgüter @de
preferred label: سلع غير معمرة @ar
preferred label: bens não-duradouros @pt-pt
preferred label: bens não duráveis @pt-br
preferred label: Ikke-varigt forbrugsgode @dk
preferred label: 非耐用品 @zh-hans
preferred label: dagligvarer @no-nb
preferred label: daglegvare @no-nn
definition: Lampen, Stifte und Schreibwaren, Geschirr, Uhren, Brillen etc. @de
definition: Products meant to only be used for a short period of time
definition: Varor som förbrukas förhållandevis snabbt, t ex tändare, pennor och glas. @se
definition: Produtos para serem usados por um breve período de tempo. @pt-pt
definition: Produkter, der kun er beregnet til at blive brugt i en kort periode. @dk
definition: 仅在短时间内使用的产品 @zh-hans
change note: Retired. Use medtop:20000243 consumer goods instead.
in scheme: Media Topic
created: 2009-10-22T02:00:00+00:00
retired: 2023-03-31T12:00:00+00:00
modified: 2023-03-31T12:00:00+00:00
broader: consumer goods

toy and game
type: Concept
preferred label: Leksaker @se
preferred label: Spielwaren @de
preferred label: لعب @ar
preferred label: Jouets @fr
preferred label: Juguetes @es
preferred label: brinquedos @pt-pt
preferred label: legetøj @dk
preferred label: 玩具 @zh-hans
preferred label: leketøy @no-nb
preferred label: leiketøy @no-nn
definition: Föremål som är avsett att användas vid lek. @se
definition: Spielzeug für Kinder @de
definition: Children's playthings or collectible items for adults, such as dolls, action figures and miniatures
definition: Objetos com os quais as crianças brincam. @pt-pt
definition: Salg af legetøj. @dk
definition: 儿童玩具 @zh-hans
in scheme: Media Topic
created: 2009-10-22T02:00:00+00:00
modified: 2023-03-31T12:00:00+00:00
broader: consumer goods

beverage and grocery
type: Concept
preferred label: صناعة غذائية @ar
preferred label: Industries alimentaires @fr
preferred label: Industria alimentaria @es
preferred label: Nahrungsmittelindustrie @de
preferred label: Livsmedelsindustri @se
preferred label: indústria da alimentação @pt-pt
preferred label: fødevareindustri @dk
preferred label: 食品业 @zh-hans
preferred label: dagligvare @no-nb
preferred label: daglegvare @no-nn
definition: The production and sale of foodstuffs
definition: Das Geschäft mit der Erzeugung, Verteilung und dem Verkauf von Grundbedarfsmitteln. @de
definition: Framtagande, distribution och försäljning av varor som regelbundet måste tillföras kroppen för att livsfunktionerna ska uppehållas. @se
definition: Negócio do processamento, distribuição e venda de produtos básicos para o consumo humano. @pt-pt
definition: Produktion, distribution og salg af fødevarer. @dk
definition: 为人类基本消费而加工、分销食品的商业活动 @zh-hans
in scheme: Media Topic
created: 2009-10-22T02:00:00+00:00
modified: 2023-03-31T12:00:00+00:00
broader: consumer goods

furnishings and furniture
type: Concept
preferred label: Inredning och möbler @se
preferred label: Meubles et décoration @fr
preferred label: Muebles y decoración @es
preferred label: اثاث ومفروشات @ar
preferred label: Möbel @de
preferred label: mobiliário e decoração @pt-pt
preferred label: møbler og indretning @dk
preferred label: 家具和家居饰品 @zh-hans
preferred label: møbelindustri @no-nb
definition: Tillverkning av möbler, tapeter, färg och annat material för inomhusdekorering. @se
definition: Fertigung von Möbeln, Tapete, Farben und Erzeugnisse zur Inneneinrichtung @de
definition: Manufacture of furniture, wallpaper, paints and fabrics for interior decoration
definition: Fabrico de móveis, papéis de parede, tintas e tecidos para decoração interior. @pt-pt
definition: Fremstilling af møbler, tapet, maling og andre materialer til indretning. @dk
definition: 家具、壁纸、油漆和室内装饰面料 @zh-hans
in scheme: Media Topic
created: 2009-10-22T02:00:00+00:00
modified: 2023-03-31T12:00:00+00:00
broader: consumer goods

tobacco and nicotine
type: Concept
preferred label: Tabac @fr
preferred label: Tabaco @es
preferred label: Tabak @de
preferred label: تبغ @ar
preferred label: Tobak @se
preferred label: tabaco @pt-pt
preferred label: tobak @dk
preferred label: 烟草 @zh-hans
preferred label: tobakk og nikotin @no-nb
definition: Odlandet, producerandet och försäljningen av tobak. @se
definition: Anbau, Produktion und Handel mit Tabakprodukten @de
definition: The sale and manufacturing of tobacco products for consumers, including cigarettes, e-cigarettes and vaping cartridges
definition: Cultivo, produção e venda de produtos do tabaco. @pt-pt
definition: Dyrkning, produktion og salg af tobak. @dk
definition: 烟草制品的种植、生产和销售 @zh-hans
in scheme: Media Topic
created: 2009-10-22T02:00:00+00:00
modified: 2023-03-31T12:00:00+00:00
broader: consumer goods

handicrafts
type: Concept
preferred label: Hantverk @se
preferred label: artesanato @pt-pt
preferred label: kunsthåndværk @dk
preferred label: 手工艺品 @zh-hans
preferred label: brukshåndverk @no-nb
preferred label: Handwerk @de
preferred label: Artisanat @fr
preferred label: Artesanía @es
preferred label: صناعة حرفية @ar
preferred label: brukshandverk @no-nn
definition: The creators and sellers of crafts and the making and selling of the supplies used to make those crafts
definition: Produkter eller tjänster som framställs med enkla metoder och verktyg, till skillnad från industriell massproduktion. @se
definition: Produtos ou serviços realizados com métodos e ferramentas simples, por oposição à produção industrial em massa. @pt-pt
definition: Salg af produkter eller tjenester produceret ved hjælp af enkle metoder og værktøjer i modsætning til industriel masseproduktion. @dk
definition: 用简单的技术和工具提供的产品或服务，与大规模工业生产相对 @zh-hans
definition: Produkte oder Dienstleistungen, die mit einfachen Fertigkeiten und Werkzeugen bereitgestellt werden, im Gegensatz zur industriellen Massenproduktion. @de
in scheme: Media Topic
created: 2016-04-04T12:00:00+00:00
modified: 2023-03-31T12:00:00+00:00
broader: consumer goods

pet product and service
type: Concept
preferred label: Husdjursprodukter och -tjänster @se
preferred label: produtos e serviços para animais de estimação @pt-pt
preferred label: kæledyrsprodukter og pleje @dk
preferred label: 宠物产品和服务 @zh-hans
preferred label: kjæledyrprodukter og -tjenester @no-nb
preferred label: Heimtierprodukte und- Dienstleistungen @de
preferred label: Services et produits pour animaux domestiques @fr
preferred label: Servicios y productos para animales domésticos @es
preferred label: خدمات ومنتجات للحيوانات الاليفة @ar
preferred label: kjæledyrprodukt og -tenester @no-nn
definition: Hygiene products, care and nutrition for pets
definition: Hygienprodukter samt omvårdnad och näring till djur som lever under människans vård och kontroll. @se
definition: Produtos de higiene, cuidados e alimentação para animais de estimação. @pt-pt
definition: Hygiejneprodukter samt pleje og ernæring til dyr, der lever under menneskelig pleje og kontrol. @dk
definition: 宠物卫生用品，护理和营养 @zh-hans
definition: Hygieneprodukte, Pflege und Ernährung für Haustiere. @de
in scheme: Media Topic
created: 2016-04-04T12:00:00+00:00
modified: 2023-03-31T12:00:00+00:00
broader: consumer goods

consumer electronics
type: Concept
preferred label: forbrugerelektronik @dk
preferred label: forbrukerelektronikk @no-nb
preferred label: eletrônica de consumo @pt-br
preferred label: eletrónica de consumo @pt-pt
preferred label: Konsumentelektronik @se
preferred label: 消费类电子产品 @zh-hans
preferred label: Unterhaltungselektronik @de
preferred label: Électronique grand public @fr
preferred label: Electrónica de consumo @es
preferred label: ادوات الكترونية @ar
preferred label: forbrukarelektronikk @no-nn
definition: Elektroniske apparater som computere, mobiltelefoner og fjernsyn, som bliver solgt til privat brug. @dk
definition: Electronic devices, such as computers, smart phones or televisions, designed and sold for personal use
definition: Dispositivos eletrônicos, como computadores, smartphones ou televisores, projetados e vendidos para uso pessoal. @pt-br
definition: Dispositivos eletrónicos, como computadores, smartphones ou televisores, projetados e vendidos para uso pessoal. @pt-pt
definition: Varor som datorer, telefoner, tv osv som säljs till privatpersoner för personlig användning. @se
definition: 为个人使用而设计和销售的电子设备，如电脑、智能手机或电视 @zh-hans
definition: Elektronische Geräte, wie Computer, Smartphones oder Fernseher, die für den persönlichen Gebrauch entworfen und verkauft werden @de
in scheme: Media Topic
created: 2019-08-02T12:00:00+00:00
modified: 2021-07-12T12:00:00+00:00
broader: consumer goods

department store
type: Concept
preferred label: Varuhus @se
preferred label: Grandes tiendas - grandes almacenes @es
preferred label: مخزن تجاري @ar
preferred label: Kaufhaus @de
preferred label: Grand magasin @fr
preferred label: grandes armazéns @pt-pt
preferred label: lojas de departamento @pt-br
preferred label: stormagasin @dk
preferred label: 百货商店 @zh-hans
preferred label: varemagasin @no-nb
definition: Försäljningsställe med stor säljyta och med ett brett varusortiment. @se
definition: Store selling a variety of goods, such as clothing, housewares, jewellery and cosmetics
definition: Große Läden, die bestimmt sind um Sachen für Einzelne anzubieten @de
definition: Grandes superfícies destinadas à venda ao público. @pt-pt
definition: Forretning opdelt i flere mindre butikker under samme tag. @dk
definition: 销售服装、家用器具、珠宝和化妆品等各式商品的商店 @zh-hans
definition: Store selling a variety of goods, such as clothing, housewares, jewelry and cosmetics
in scheme: Media Topic
created: 2009-10-22T02:00:00+00:00
modified: 2021-02-18T12:00:00+00:00
broader: retail

retail
type: Concept
preferred label: Venta minorista @es
preferred label: Detaljhandel @se
preferred label: Vente au détail @fr
preferred label: Einzelhandel @de
preferred label: تجارة مفرق @ar
preferred label: retalho @pt-pt
preferred label: varejo @pt-br
preferred label: detailhandel @dk
preferred label: 零售 @zh-hans
preferred label: detaljhandel @no-nb
definition: Die unterste Stufe in der Handelshierarchie @de
definition: The selling of goods directly to consumers
definition: Företag som säljer produkter som tillverkats av andra till senare led i tillverknings-, distributions- och konsumtionskedjan. @se
definition: A última etapa da cadeia de vendas. @pt-pt
definition: A última etapa da cadeia comercial. @pt-br
definition: Virksomheder, der sælger til private husholdninger. @dk
definition: 销售链的最后阶段 @zh-hans
in scheme: Media Topic
created: 2009-10-22T02:00:00+00:00
modified: 2023-03-31T12:00:00+00:00
broader: sales channel
narrower: department store
narrower: online shopping
narrower: mail order
narrower: specialty store
narrower: shopping mall
narrower: shopping district and high street

online shopping
type: Concept
preferred label: تجارة الكترونية @ar
preferred label: E-Commerce @de
preferred label: Comercio electrónico - comercio online @es
preferred label: Vente en ligne @fr
preferred label: E-handel @se
preferred label: comércio eletrónico @pt-pt
preferred label: comércio eletrônico @pt-br
preferred label: e-handel @dk
preferred label: 电子商务 @zh-hans
preferred label: netthandel @no-nb
definition: Kaufen und Verkaufen im Internet @de
definition: Varor som köps eller säljs med hjälp av internettjänster. @se
definition: Buying and selling items through the internet
definition: Compra e venda de produtos pela Internet. @pt-pt
definition: Varer købt eller solgt ved hjælp af internettjenester. @dk
definition: 通过互联网买卖商品 @zh-hans
definition: Kjøp og sal av varer på internett. @no-nn
definition: Kjøp og salg av varer på internett @no-nb
in scheme: Media Topic
created: 2009-10-22T02:00:00+00:00
modified: 2023-03-31T12:00:00+00:00
broader: retail

mail order
type: Concept
preferred label: شراء بالبريد @ar
preferred label: Postorder @se
preferred label: Versandhandel @de
preferred label: Vente par correspondance @fr
preferred label: Venta por correo @es
preferred label: vendas por correio @pt-pt
preferred label: postordre @dk
preferred label: 邮购 @zh-hans
preferred label: postordresalg @no-nb
preferred label: postordresal @no-nn
definition: Varor som säljs genom och leveras med hjälp av posten. @se
definition: Waren, die auf dem Postweg verkauft und versendet werden @de
definition: Items sold through and delivered by mail
definition: Artigos vendidos e entregues por correio. @pt-pt
definition: Varer solgt gennem og leveret pr. post. @dk
definition: 通过邮件销售和递送的物品 @zh-hans
change note: Retired. Use medtop:20000247 online shopping instead.
in scheme: Media Topic
created: 2009-10-22T02:00:00+00:00
retired: 2023-03-31T12:00:00+00:00
modified: 2023-03-31T12:00:00+00:00
broader: retail

specialty store
type: Concept
preferred label: Tiendas especializadas @es
preferred label: Fachhandel @de
preferred label: متجر متخصص @ar
preferred label: Specialbutiker @se
preferred label: Commerce spécialisé @fr
preferred label: lojas especializadas @pt-pt
preferred label: specialbutik @dk
preferred label: 专卖店 @zh-hans
preferred label: spesialforretning @no-nb
definition: Retail outlets that specialise in categories such as shoes, coats, power tools, etc
definition: Verkaufsstelle im Einzelhandel, die spezialisiert ist auf bestimmte Waren, wie z.B. Schuhe, Mäntel, elektronisches Werkzeug, etc. @de
definition: Detaljhandlare som specialiserat sig inom en särskild kategori, t ex skor eller verktyg. @se
definition: Lojas que se especializaram na venda de produtos específicos como sapatos, casacos, ferramentas, etc. @pt-pt
definition: Lojas que se especializaram na venda de produtos específicos como sapatos, casacos, ferramentas etc. @pt-br
definition: Forhandlere, der specialiserer sig i en bestemt kategori, såsom sko eller værktøj. @dk
definition: 专门经营特定类别，如鞋子、外套、电动工具等商品的店铺 @zh-hans
definition: Retail outlets that specialize in categories such as shoes, coats, power tools, etc
in scheme: Media Topic
created: 2009-10-22T02:00:00+00:00
modified: 2021-05-05T12:00:00+00:00
broader: retail

shopping mall
type: Concept
preferred label: Köpcentrum @se
preferred label: kjøpesentere @no-nb
preferred label: centro comercial @pt-pt
preferred label: storcenter @dk
preferred label: 购物中心 @zh-hans
preferred label: Einkaufszentrum @de
preferred label: Centre commercial @fr
preferred label: Centro comercial @es
preferred label: مركز تجاري @ar
preferred label: kjøpesenter @no-nn
definition: A large building or series of connected buildings that contain a variety of retail stores and food vendors
definition: En stor byggnad, eller sammankopplade byggnader, där många olika affärer, restauranger osv samlas. @se
definition: Edifício de grandes dimensões ou série de edifícios ligados que reúnem uma variedade de lojas de retalho e de comida. @pt-pt
definition: Edifício de grandes dimensões ou série de edifícios conectados que reúnem uma variedade de lojas de varejo e de comida. @pt-br
definition: En stor bygning eller flere forbundne bygninger, der indeholder en blanding af detailbutikker og spisesteder. @dk
definition: 一栋或多栋相互连接的建筑，聚集大量零售商店和餐饮 @zh-hans
definition: Ein großes Gebäude oder eine Reihe miteinander verbundener Gebäude, die eine Vielzahl von Einzelhandelsgeschäften und Lebensmittelverkäufern enthalten @de
in scheme: Media Topic
created: 2020-08-05T12:00:00+00:00
modified: 2021-07-12T12:00:00+00:00
broader: retail

shopping district and high street
type: Concept
preferred label: Affärsgata @se
preferred label: handlegater @no-nb
preferred label: zona comercial @pt-pt
preferred label: butiksstrøg @dk
preferred label: 商业街 @zh-hans
preferred label: Einkaufsviertel @de
preferred label: Zone commerciale @fr
preferred label: Zona comercial @es
preferred label: منطقة تجارية @ar
definition: Primary retail streets of towns or cities containing individual stores and restaurants
definition: En gata eller område i en stad där många affärer och restauranger är samlade. @se
definition: Principais ruas de comércio a retalho de vilas ou cidades, com lojas e restaurantes individuais. @pt-pt
definition: Principais ruas de varejo de vilas ou cidades, com lojas e restaurantes individuais. @pt-br
definition: En bygade, der indeholder flere butikker og restauranter @dk
definition: 包含个体商店和餐馆的城镇或城市的主要零售街道 @zh-hans
definition: Primäre Einzelhandelsstraßen von Städten oder Gemeinden mit einzelnen Geschäften und Restaurants @de
in scheme: Media Topic
created: 2020-08-05T12:00:00+00:00
modified: 2021-07-12T12:00:00+00:00
broader: retail

wholesale
type: Concept
preferred label: Venta mayorista @es
preferred label: Grossiste @fr
preferred label: Großhandel @de
preferred label: تجارة جملة @ar
preferred label: Grossister @se
preferred label: mercado grossista @pt-pt
preferred label: mercado atacadista @pt-br
preferred label: engrossalg @dk
preferred label: 批发 @zh-hans
preferred label: engroshandel @no-nb
definition: The first link in the sales chain after production
definition: Distributionsled som förmedlar varor till detaljhandeln och större förbrukare, det vill säga inte till privata konsumenter. @se
definition: Die oberste Stufe in der Handelshierarchie im Anschluss an die Produktion @de
definition: Primeiro elo da cadeia de vendas após a produção. @pt-pt
definition: Primeiro elo da cadeia comercial após a produção. @pt-br
definition: Det første led i salgskæden efter produktion. @dk
definition: 生产后销售链中的第一个环节 @zh-hans
in scheme: Media Topic
created: 2009-10-22T02:00:00+00:00
modified: 2023-03-31T12:00:00+00:00
broader: sales channel

renewable energy
type: Concept
preferred label: طاقة بديلة @ar
preferred label: Erneuerbare Energie @de
preferred label: Alternativ energi @se
preferred label: Energía alternativa @es
preferred label: Énergies alternatives @fr
preferred label: energias alternativas @pt-pt
preferred label: alternativ energi @dk
preferred label: 可替代能源 @zh-hans
preferred label: fornybar energi @no-nb
definition: Den kommersiella verksamhet som framställer energi utan att förstöra miljön. @se
definition: Energy derived from sustainable sources
definition: Geschäft mit Alternativen-Energien @de
definition: Negócio das energias alternativas. @pt-pt
definition: Den kommercielle virksomhed, der producerer energi uden at ødelægge miljøet. @dk
definition: 可替代能源行业 @zh-hans
in scheme: Media Topic
created: 2009-10-22T02:00:00+00:00
modified: 2023-03-31T12:00:00+00:00
broader: energy and resource
narrower: geothermal power
narrower: solar power
narrower: hydroelectric power
narrower: wind power

coal
type: Concept
preferred label: Charbon @fr
preferred label: Kohle @de
preferred label: Carbón @es
preferred label: Kol @se
preferred label: فحم @ar
preferred label: carvão @pt-pt
preferred label: kul @dk
preferred label: 煤炭 @zh-hans
preferred label: kullindustri @no-nb
preferred label: kolindustri @no-nn
definition: Production and mining of anthracite and bituminous products for use in power production
definition: Utvinning av antracit och bituminöst kol för användning i energiproduktion. @se
definition: Herstellung und Förderung von Glanz- und Steinkohle zur Energieerzeugung @de
definition: Produção e extração de antracite e de produtos betuminosos para usar na produção de energia. @pt-pt
definition: Produktion og minedrift af antracit og bituminøse produkter til anvendelse i kraftproduktion. @dk
definition: 用于电力生产的无烟煤和沥青制品的生产和开采 @zh-hans
in scheme: Media Topic
created: 2009-10-22T02:00:00+00:00
modified: 2021-02-18T12:00:00+00:00
broader: energy and resource

energy industry
type: Concept
preferred label: صناعة الطاقة @ar
preferred label: Energía @es
preferred label: Énergie @fr
preferred label: Energie @de
preferred label: Energiindustri @se
preferred label: indústria da energia @pt-pt
preferred label: energiindustri @dk
preferred label: 能源行业 @zh-hans
preferred label: kraftindustri @no-nb
definition: The energy industry, not focused on any specific sector
definition: Energiebranche, nicht auf einen bestimmten Bereich konzentriert @de
definition: Produktionen av energi utan fokus på någon speciell sektor. @se
definition: A indústria da energia, não focada num setor específico. @pt-pt
definition: Produktion af energi uden fokus på nogen bestemt sektor. @dk
definition: 能源行业，不特指任何特定领域 @zh-hans
in scheme: Media Topic
created: 2009-10-22T02:00:00+00:00
retired: 2019-07-25T12:00:00+00:00
modified: 2021-07-12T12:00:00+00:00
broader: energy and resource

nuclear power
type: Concept
preferred label: طاقة نووية @ar
preferred label: Kärnkraft @se
preferred label: Energía nuclear @es
preferred label: Énergie nucléaire @fr
preferred label: Atomenergie @de
preferred label: energia nuclear @pt-pt
preferred label: atomkraft @dk
preferred label: 核能 @zh-hans
preferred label: kjernekraft @no-nb
definition: Användande av radioaktivt material för produktion av el eller värme. @se
definition: Nutzung von radioaktivem Material zur Energiegewinnung @de
definition: Use of radioactive materials for power production
definition: Uso de materiais radioativos na produção de energia. @pt-pt
definition: Brug af radioaktivt materiale til produktion af elektricitet eller varme. @dk
definition: 对放射性物质产生的能源的利用 @zh-hans
in scheme: Media Topic
created: 2009-10-22T02:00:00+00:00
modified: 2021-07-12T12:00:00+00:00
broader: energy and resource

oil and gas - downstream activities
type: Concept
preferred label: نفط وغاز/تنقيب وانتاج @ar
preferred label: Distribution de pétrole et gaz @fr
preferred label: Olja och gas, leverans @se
preferred label: Distribución de petróleo y gas @es
preferred label: Öl und Gas (Verwertung) @de
preferred label: petróleo e gás (distribuição) @pt-pt
preferred label: olie og gas - nedstrømsaktivitet @dk
preferred label: 石油和天然气-下游活动 @zh-hans
preferred label: nedstrømsaktivitet @no-nb
preferred label: nedstraumsaktivitet @no-nn
definition: All matters concerning oil and gas, typically refining and distribution activities
definition: Allt som rör olja och gas från raffinaderiet till distributionen. @se
definition: Alle Sachverhalte der Raffinierung und Verteilung, die sich auf Öl und Gas beziehen @de
definition: Assuntos relativos ao petróleo e ao gás, tipicamente atividades de refinaria e de distribuição. @pt-pt
definition: Alt relateret til olie og gas fra raffinaderiet til distribution. @dk
definition: 与石油和天然气有关的活动，特别是炼油和分销活动 @zh-hans
in scheme: Media Topic
created: 2009-10-22T02:00:00+00:00
retired: 2019-07-25T12:00:00+00:00
modified: 2021-05-05T12:00:00+00:00
broader: energy and resource

oil and gas - upstream activities
type: Concept
preferred label: Olja och gas, utvinning @se
preferred label: Production de pétrole et gaz @fr
preferred label: Petróleo y gas primarios @es
preferred label: نفط وغاز/تكرير وبيع وتوزيع @ar
preferred label: Öl und Gas (Förderung) @de
preferred label: petróleo e gás (extração) @pt-pt
preferred label: olie og gas - opstrømsaktivitet @dk
preferred label: 石油和天然气-上游活动 @zh-hans
preferred label: oppstrømsaktvitet @no-nb
preferred label: oppstraumsaktvitet @no-nn
definition: Allt som rör olja och gas från upphämtningen till raffinaderiet. @se
definition: Alle Inhalte, die sich auf Öl und Gas beziehen, kennzeichnend hier die Gewinnung und der Transport zur Raffinerie @de
definition: All matters concerning oil and gas, typically supply chain activities from the reservoir to the refinery gate
definition: Assuntos relativos ao petróleo e ao gás, tipicamente atividades da cadeia de abastecimento desde a reserva até ao portão da refinaria. @pt-pt
definition: Assuntos relativos ao petróleo e ao gás, tipicamente atividades da cadeia de abastecimento desde a reserva até o portão da refinaria. @pt-br
definition: Alt relateret til olie og gas fra indsamlingen til raffinaderiet. @dk
definition: 从石油矿藏到炼油的所有环节 @zh-hans
in scheme: Media Topic
created: 2009-10-22T02:00:00+00:00
retired: 2019-07-25T12:00:00+00:00
modified: 2021-05-05T12:00:00+00:00
broader: energy and resource

biofuel
type: Concept
preferred label: Biobränsle @se
preferred label: biocombustível @pt-pt
preferred label: biobrændstof @dk
preferred label: 生物燃料 @zh-hans
preferred label: biodrivstoff @no-nb
preferred label: Biokraftstoff @de
preferred label: Biocarburant @fr
preferred label: Biocarburante @es
preferred label: وقود حيوي @ar
definition: Fuel that is derived from biomass, such as ethanol
definition: Bränsle som tillverkas av produkter från biologiska processer istället för bränsle som tillverkas baserat på geologiska processer som fossila bränslen, kol osv. @se
definition: Combustível produzido a partir de material orgânico, como o etanol. @pt-pt
definition: Brændstof produceret af produkter fra biologiske processer i stedet for brændstof produceret baseret på geologiske processer som fossile brændstoffer, kul osv. @dk
definition: 从生物物质中提取的燃料，如乙醇 @zh-hans
definition: Kraftstoff, der aus lebender Materie gewonnen wird, wie zum Beispiel Ethano @de
in scheme: Media Topic
created: 2019-04-06T12:00:00+00:00
modified: 2023-03-31T12:00:00+00:00
broader: energy and resource

oil and gas
type: Concept
preferred label: olie- og gasindustrien @dk
preferred label: olje og gass @no-nb
preferred label: indústria do petróleo e do gás @pt-br
preferred label: Olja och gas @se
preferred label: 油气工业 @zh-hans
preferred label: Öl- und Gasindustrie @de
preferred label: Industrie du gaz et du pétrole @fr
preferred label: Industria de petróleo y gas @es
preferred label: صناعة النفط والغاز @ar
definition: Virksomhed, der opsporer, udvinder, raffinerer, transporterer og sælger petrokemiske produkter. @dk
definition: The exploration, extraction, refining, transporting and marketing of petroleum products and natural gas
definition: Exploração, extração, refino, transporte e comercialização de derivados de petróleo e de gás natural. @pt-br
definition: Exploração, extração, refinação, transporte e comercialização de derivados de petróleo e de gás natural. @pt-pt
definition: Allt som rör olja och gas från prospektering till leverans och försäljning. @se
definition: 石油和天然气的勘探、开采、精炼、运输和销售等 @zh-hans
definition: Exploration, Gewinnung, Raffinierung, Transport und Vermarktung von Erdölprodukten und Erdgas @de
in scheme: Media Topic
created: 2019-07-25T12:00:00+00:00
modified: 2023-03-31T12:00:00+00:00
broader: energy and resource
narrower: diesel fuel
narrower: kerosene/paraffin
narrower: natural gas
narrower: petrol

geothermal power
type: Concept
preferred label: Geotermisk energi @se
preferred label: energia geotérmica @pt-pt
preferred label: geotermisk energi @dk
preferred label: 地热能 @zh-hans
preferred label: jordenergi @no-nb
preferred label: geothermische Energie @de
preferred label: Énergie géothermique @fr
preferred label: Energía geotérmica @es
preferred label: كهرباء حرارية أرضية @ar
definition: Thermal energy that is generated and stored in the Earth
definition: Energi som hämtas från geoteremiska processer där värme lagras i jordskorpan. @se
definition: Energia térmica que é gerada a partir do calor proveniente do interior da Terra. @pt-pt
definition: Energi opnået fra geotermiske processer, hvor varme opbevares i jordskorpen. @dk
definition: 在地下产生并储存的热能 @zh-hans
definition: Thermische Energie, die in der Erde erzeugt und gespeichert wird @de
in scheme: Media Topic
created: 2019-04-06T12:00:00+00:00
modified: 2023-03-31T12:00:00+00:00
broader: renewable energy

solar power
type: Concept
preferred label: Solenergi @se
preferred label: energia solar @pt-pt
preferred label: solenergi @dk
preferred label: 太阳能发电 @zh-hans
preferred label: Solarenergie @de
preferred label: Énergie solaire @fr
preferred label: Energía solar @es
preferred label: الطاقة الشمسية @ar
definition: Electricity generated and harvested from the sun's rays
definition: Energi som bygger på omvandling av solenergi i någon form. @se
definition: Eletricidade gerada e colhida a partir dos raios solares. @pt-pt
definition: Elektricitet produceret og genereret fra solens stråler. @dk
definition: 从太阳光中产生和获得的电能 @zh-hans
definition: Aus Sonnenstrahlen erzeugte und geerntete Elektrizitä @de
in scheme: Media Topic
created: 2019-04-06T12:00:00+00:00
modified: 2023-03-31T12:00:00+00:00
broader: renewable energy

hydroelectric power
type: Concept
preferred label: Vattenkraft @se
preferred label: energia hidroelétrica @pt-pt
preferred label: energia hidrelétrica @pt-br
preferred label: vandkraft @dk
preferred label: 水力发电 @zh-hans
preferred label: vannkraft @no-nb
preferred label: Wasserkraft @de
preferred label: Énergie hydroélectrique @fr
preferred label: Energía hidroeléctrica @es
preferred label: طاقة هيدروالكترونية @ar
preferred label: vasskraft @no-nn
definition: Electricity produced from hydropower when water flows through turbines
definition: Energi som genereras genom att leda vatten genom turbiner. Vattnet samlas ofta i dammar så flödet kan regleras efter behov. @se
definition: Eletricidade produzida a partir de energia hídrica quando a água passa através de turbinas. @pt-pt
definition: Energi genereret ved at føre vand gennem turbiner. Vandet opsamles ofte i damme, så strømmen kan reguleres efter behov. @dk
definition: 当水流过涡轮时产生的电能 @zh-hans
definition: Elektrizität, die aus Wasserkraft erzeugt wird, wenn Wasser durch Turbinen fließt @de
in scheme: Media Topic
created: 2019-04-06T12:00:00+00:00
modified: 2023-03-31T12:00:00+00:00
broader: renewable energy

wind power
type: Concept
preferred label: Vindkraft @se
preferred label: energia eólica @pt-pt
preferred label: vindkraft @dk
preferred label: 风力发电 @zh-hans
preferred label: Windenergie @de
preferred label: Énergie éolienne @fr
preferred label: Energía eólica @es
preferred label: طاقة رياح @ar
definition: Electricity that is generated by kinetic energy of wind, usually produced by windmills or turbines
definition: Energi som genereras i turbiner som sätts i rörelse av vind som driver någon form av propeller. @se
definition: Eletricidade gerada pela energia cinética do vento, geralmente produzida por moinhos de vento ou turbinas. @pt-pt
definition: Energi, der genereres i turbiner, der sættes i gang af vind, der driver en eller anden form for propel. @dk
definition: 由风能产生的电能，通常由风车或涡轮机产生 @zh-hans
definition: Elektrizität, die durch die kinetische Energie des Windes erzeugt wird, die normalerweise von Windmühlen oder Turbinen erzeugt wird @de
in scheme: Media Topic
created: 2019-04-06T12:00:00+00:00
modified: 2023-03-31T12:00:00+00:00
broader: renewable energy

diesel fuel
type: Concept
preferred label: Combustible diesel @es
preferred label: Diesel @se
preferred label: ديزل @ar
preferred label: Gazole @fr
preferred label: gasóleo @pt-pt
preferred label: dieselbrændstof @dk
preferred label: 柴油 @zh-hans
preferred label: diesel @no-nb
definition: A distilled petroleum product heavier than gasoline used for trucks, marine engines, certain cars and in some forms for home heating
definition: Bränsle för dieselmotorer och värmeanläggningar bestående av relativt svårflyktiga brännoljor, t ex tjockolja. @se
definition: Destilliertes Petroleumprodukt schwerer als Benzin nicht nur für LKWs, Seemotoren, sondern auch in spezieller Form zum Heizen. @de
definition: Produto petrolífero destilado, mais pesado do que a gasolina, utilizado para camiões, motores de barcos e certos sistemas de calefação. @pt-pt
definition: Produto petrolífero destilado, mais pesado do que a gasolina, utilizado para caminhões, motores de barcos e certos sistemas de calefação. @pt-br
definition: Brændstof til dieselmotorer og opvarmningsanlæg, der består af relativt flygtige fyringsolier, såsom tung olie. @dk
definition: 一种比汽油重的蒸馏石油产品，不仅用于卡车、船用发动机，而且以某些形式用于家庭取暖 @zh-hans
in scheme: Media Topic
created: 2009-10-22T02:00:00+00:00
modified: 2023-03-31T12:00:00+00:00
broader: oil and gas

electricity
type: Concept
preferred label: Strom @de
preferred label: Elproduktion och -distribution @se
preferred label: انتاج وتوزيع كهرباء @ar
preferred label: Producción y distribución de electricidad @es
preferred label: Électricité @fr
preferred label: produção e distribuição de eletricidade @pt-pt
preferred label: elproduktion og distribution @dk
preferred label: 电力生产和分配 @zh-hans
preferred label: elektrisitet @no-nb
definition: Elnätet samt försäljningen av el på grossist- och återförsäljarnivå. @se
definition: In erster Linie das Energieverteilungsnetz betreffend, aber auch den Verkauf von Energie an den Strommarkt und Verteiler @de
definition: The power line distribution system and the sale of electrical power at wholesale and retail levels
definition: Tudo o que diz respeito ao sistema de distribuição de energia, mas também à venda de energia elétrica por grosso e a retalho. @pt-pt
definition: Tudo o que diz respeito ao sistema de distribuição de energia, mas também à venda de energia elétrica por atacado e no varejo. @pt-br
definition: Elnettet og salg af elektricitet på engros- og detailniveau. @dk
definition: 主要涉及电力线路配电系统，也包括批发和零售级别的电力销售 @zh-hans
in scheme: Media Topic
created: 2009-10-22T02:00:00+00:00
modified: 2023-03-31T12:00:00+00:00
broader: utilities

kerosene/paraffin
type: Concept
preferred label: Kérosène @fr
preferred label: Fotogen @se
preferred label: كيروسين، بارافين @ar
preferred label: Kerosin/Parafin @de
preferred label: Kerosene @es
preferred label: querosene / parafina @pt-pt
preferred label: querosene/parafina @pt-br
preferred label: petroleum og paraffin @dk
preferred label: 煤油和石蜡 @zh-hans
preferred label: parafin @no-nb
definition: En petroleumprodukt som ofta används som motorbränsle i allt från båtar till jetplan, men också som bränsle i lampor. @se
definition: Ein leichtes Petroleumdestillat als Kochbrennstoff genutzt, Flugzeugmotoren, Lampen, Heizung und zur Reinigung. @de
definition: A light petroleum distillate used for cooking fuel, aircraft jet engines, lamps, heating and cleaning
definition: Produto derivado do petróleo, usado como combustível para cozinhas, motores de aviões, candeeiros, calefação e limpeza. @pt-pt
definition: Et olieprodukt, der ofte bruges som motorbrændstof i alt fra både til jetfly, men også som brændstof i lamper. @dk
definition: 一种轻质石油馏分油，用于烹饪燃料、飞机喷气发动机、灯、加热和清洗等用途 @zh-hans
change note: Retired. Use medtop:20001243 oil and gas instead.
in scheme: Media Topic
created: 2009-10-22T02:00:00+00:00
retired: 2023-03-31T12:00:00+00:00
modified: 2023-03-31T12:00:00+00:00
broader: oil and gas

natural gas
type: Concept
preferred label: Gas natural @es
preferred label: Gaz naturel @fr
preferred label: غاز طبيعي @ar
preferred label: Naturgas @se
preferred label: Erdgas @de
preferred label: gás natural @pt-pt
preferred label: naturgas @dk
preferred label: 天然气 @zh-hans
preferred label: naturgass @no-nb
definition: Brännbar gas som erhålls ur jorden och som bildats genom förmultning av organiska ämnen, används som bränsle och industriråvara. @se
definition: A natural resource, mainly methane in a flammable gaseous state extracted from the ground
definition: Natürlicher Rohstoff aus der Erde, meist Methan in entflammbarem, gasförmigen Zustand. @de
definition: Recurso natural, sobretudo metano em estado gasoso inflamável. @pt-pt
definition: Brændbar gas opnået fra jorden og dannet ved nedbrydning af organiske stoffer bruges som brændstof og industrielt råmateriale. @dk
definition: 一种自然资源，主要为来自地面的可燃气体形式的甲烷 @zh-hans
in scheme: Media Topic
created: 2009-10-22T02:00:00+00:00
modified: 2023-03-31T12:00:00+00:00
broader: oil and gas

petrol
type: Concept
preferred label: نفط @ar
preferred label: Bensin @se
preferred label: Essence @fr
preferred label: Gasolina, nafta @es
preferred label: Benzin @de
preferred label: gasolina @pt-pt
preferred label: benzin @dk
preferred label: 汽油 @zh-hans
preferred label: bensin @no-nb
preferred label: gasoline
definition: Typ av lättflyktigt och brandfarligt bränsle för lätta eller snabbgående motorer, särskilt för personbilar. @se
definition: Destilliertes Petroleumprodukt zur Nutzung als Brennstoff für Autos, mit oder ohne Zusätze @de
definition: Distilled petroleum product used for automotive fuel, with or without additives
definition: Produto petrolífero destilado, usado para combustível automóvel, com ou sem aditivos. @pt-pt
definition: Destilleret olieprodukt, der bruges til bilbrændstof, med eller uden tilsætningsstoffer. @dk
definition: 用作汽车燃料的石油制品 @zh-hans
in scheme: Media Topic
created: 2009-10-22T02:00:00+00:00
modified: 2021-02-18T12:00:00+00:00
broader: oil and gas

waste management
type: Concept
preferred label: Avfallshantering och bekämpning av föroreningar @se
preferred label: Traitement des déchets et contrôle de la pollution @fr
preferred label: Manejo de desechos y control de contaminación @es
preferred label: Schadstoffkontrolle @de
preferred label: ادارة نفايات ومراقبة التلوث @ar
preferred label: indústria de gestão de resíduos @pt-pt
preferred label: affaldshåndtering og forureningskontrol @dk
preferred label: 废物管理业 @zh-hans
preferred label: avfallshåndtering @no-nb
preferred label: avfallshandtering @no-nn
definition: The collecting, disposing or recycling of household and business waste
definition: Geschäft mit der Abfallverwertung und Verschmutzungskontrolle @de
definition: Den kommersiella verksamhet som hanterar avfall och bevakar utsläpp. @se
definition: O negócio da gestão de resíduos e do controlo da poluição. @pt-pt
definition: O negócio da gestão de resíduos e do controle da poluição. @pt-br
definition: De kommercielle aktiviteter, der håndterer affald og overvåger emissioner. @dk
definition: 经营废物管理及污染控制业务 @zh-hans
in scheme: Media Topic
created: 2009-10-22T02:00:00+00:00
modified: 2023-03-31T12:00:00+00:00
broader: utilities

water supply
type: Concept
preferred label: Alimentation en eau @fr
preferred label: Suministro de agua @es
preferred label: امدادات المياه @ar
preferred label: Wasser @de
preferred label: Färskvattenförsörjning @se
preferred label: abastecimento de água @pt-pt
preferred label: vandforsyning @dk
preferred label: 供水 @zh-hans
preferred label: vannforsyning @no-nb
preferred label: vassforsyning @no-nn
definition: Angelegenheiten des Gebrauchs-und Trinkwasserschutzes @de
definition: The business of providing water for household and commercial use
definition: Den kommersiella verksamhet som förser människor med rent vatten. @se
definition: O negócio do fornecimento de água para uso humano. @pt-pt
definition: Den kommercielle aktivitet, der forsyner folk med rent vand. @dk
definition: 提供人使用水的业务 @zh-hans
in scheme: Media Topic
created: 2009-10-22T02:00:00+00:00
modified: 2023-03-31T12:00:00+00:00
broader: utilities

funeral parlour and crematorium
type: Concept
preferred label: خدمة دفن الموتى @ar
preferred label: Servicios funerarios y de crematorio @es
preferred label: Bestattungsinstitut @de
preferred label: Begravningsfirmor @se
preferred label: Pompes funèbres @fr
preferred label: agência funerária e crematório @pt-pt
preferred label: bedemandsforretning og krematorium @dk
preferred label: 殡仪馆和火葬场 @zh-hans
preferred label: begravelsesbyrå og krematorium @no-nb
preferred label: funeral home and crematorium
preferred label: gravferdsbyrå og krematorium @no-nn
definition: Companies that provide services for disposal of the dead
definition: Företag som tillhandahåller tjänster för hantering av avlidna personer. @se
definition: Unternehmen, die Dienstleistungen anbieten im Zusammenhang mit dem Tod @de
definition: Empresas que fornecem serviços funerários. @pt-pt
definition: Virksomheder, der leverer tjenester til håndtering af afdøde personer. @dk
definition: 提供死者处置服务的公司 @zh-hans
change note: Retired. Use medtop:20001235 funeral and memorial service instead.
in scheme: Media Topic
created: 2009-10-22T02:00:00+00:00
retired: 2023-03-31T12:00:00+00:00
modified: 2023-03-31T12:00:00+00:00
broader: financial and business service

personal finance
type: Concept
preferred label: Épargne personnelle @fr
preferred label: Privatfinanzen @de
preferred label: Finanzas personales @es
preferred label: ميزانية شخصية @ar
preferred label: Privatekonomi @se
preferred label: finanças pessoais @pt-pt
preferred label: privatøkonomi @dk
preferred label: 个人理财 @zh-hans
preferred label: personlig økonomi @no-nb
preferred label: personleg økonomi @no-nn
definition: An individual's income and expenses
definition: Privates Einkommen und Ausgaben @de
definition: En individs inkomster, utgifter, tillgångar och skulder. @se
definition: Gastos e receitas individuais. @pt-pt
definition: Den enkeltes indkomst, udgifter, aktiver og forpligtelser. @dk
definition: 指 个人的收入和支出 @zh-hans
in scheme: Media Topic
created: 2009-10-22T02:00:00+00:00
retired: 2023-03-31T12:00:00+00:00
modified: 2023-03-31T12:00:00+00:00
broader: financial and business service

personal income
type: Concept
preferred label: Revenus personnels @fr
preferred label: دخل فردي @ar
preferred label: Privatinkomster @se
preferred label: Ingresos @es
preferred label: Nettoeinkommen @de
preferred label: rendimento individual @pt-pt
preferred label: personlig indkomst @dk
preferred label: 个人收入 @zh-hans
preferred label: personlig inntekt @no-nb
preferred label: personleg inntekt @no-nn
definition: Money that a person earns and is his/hers to keep or spend
definition: Pengar som en person tjänar och som står denne fritt att använda. @se
definition: Verdienst einer Person und was ihm/ihr davon zur Verfügung steht @de
definition: Dinheiro que uma pessoa ganha. @pt-pt
definition: Penge, som en person tjener, og som han er fri til at bruge. @dk
definition: 一个人挣来的钱，可以留着或花掉 @zh-hans
in scheme: Media Topic
created: 2009-10-22T02:00:00+00:00
retired: 2023-03-31T12:00:00+00:00
modified: 2023-03-31T12:00:00+00:00
broader: financial and business service

printing service
type: Concept
preferred label: Imprimerie et reprographie @fr
preferred label: طباعة ودمات ترويج @ar
preferred label: Impresión-servicio promocional @es
preferred label: Druckdienstleister @de
preferred label: Tryckerier @se
preferred label: serviços promocionais e de impressão @pt-pt
preferred label: trykning og salgsfremstød @dk
preferred label: 印刷服务 @zh-hans
preferred label: trykketjenester @no-nb
preferred label: trykkjetenester @no-nn
definition: Produktion av tryckt material såsom skyltar, flygblad och reklambad. @se
definition: Produktion von Druckmaterialien wie Flyer, Werbeplakate, Schilder etc. @de
definition: The production of printed matter such as flyers, ads, signs, etc.
definition: Produção de material impresso como panfletos, anúncios, letreiros, etc. @pt-pt
definition: Produção de material impresso como panfletos, anúncios, letreiros etc. @pt-br
definition: Produktion af trykte materialer såsom skilte, flyers og reklamer. @dk
definition: 传单、广告、标签等印制品生产 @zh-hans
in scheme: Media Topic
created: 2009-10-22T02:00:00+00:00
retired: 2023-03-31T12:00:00+00:00
modified: 2023-03-31T12:00:00+00:00
broader: financial and business service

accountancy and auditing
type: Concept
preferred label: Bokföring och revision @se
preferred label: Wirtschaftsprüfer @de
preferred label: Comptabilité et Audit @fr
preferred label: Contabilidad y auditoría @es
preferred label: محاسبة وتدقيق حسابات @ar
preferred label: serviços de contabilidade e auditoria @pt-pt
preferred label: bogføring og revision @dk
preferred label: 会计和审计 @zh-hans
preferred label: bokføring og revisjon @no-nb
definition: Unternehmen die Bilanzen erstellen, Haushalte konsolidieren und die Richtigkeit von Geschäftsberichten prüfen @de
definition: Companies that provide balance sheet preparation and budget reconciliation services and examine accuracy of financial statements
definition: Tjänster som hjälper till att systematiskt redovisa ekonomiska förhållanden och granskning att redovisningen är tillförlitlig. @se
definition: Serviços que fornecem balancetes, conciliações orçamentais e verificam a exatidão de relatórios financeiros. @pt-pt
definition: Tjenester, der hjælper med systematisk at rapportere økonomiske forhold og gennemgå, at regnskaberne er pålidelige. @dk
definition: 提供资产负债表、预算调和及财务报表审查的服务 @zh-hans
in scheme: Media Topic
created: 2009-10-22T02:00:00+00:00
modified: 2023-03-31T12:00:00+00:00
broader: financial service

auction
type: Concept
preferred label: Auktion @de
preferred label: خدمات مزادات @ar
preferred label: Auktionstjänster @se
preferred label: Vente aux enchères @fr
preferred label: Remates, subastas @es
preferred label: venda por leilão @pt-pt
preferred label: auktion @dk
preferred label: 拍卖 @zh-hans
preferred label: auksjon @no-nb
definition: Käufe durch bieten @de
definition: Tjänster där varor är ute för försäljning och vid vilken spekulanterna efter hand avger allt högre bud och varan säljs till den högstbjudande. @se
definition: Auction houses and all types of auctions, such as police auctions and silent auctions
definition: Vendas por leilão. @pt-pt
definition: Tjenester, hvor varer sælges, og hvor køberne gradvis byder højere, og varerne sælges til den højeste byder. @dk
definition: 竞价销售 @zh-hans
in scheme: Media Topic
created: 2009-10-22T02:00:00+00:00
modified: 2023-03-31T12:00:00+00:00
broader: sales channel

banking
type: Concept
preferred label: Banker @se
preferred label: عمل مصرفي @ar
preferred label: Bank @de
preferred label: Banque @fr
preferred label: Servicios bancarios @es
preferred label: banca @pt-pt
preferred label: bank @dk
preferred label: 银行业 @zh-hans
preferred label: bankvirksomhet @no-nb
preferred label: bankverksemd @no-nn
definition: Företag som förvarar, överför, tar emot eller delar ut pengar. @se
definition: Financial institutions and services for storing, transmitting, receiving and delivering money
definition: Unternehmen, die Bargeld lagern, übermitteln, empfangen und verteilen @de
definition: Serviços de guarda, transmissão, receção e entrega de dinheiro. @pt-pt
definition: Serviços de guarda, transmissão, recepção e entrega de dinheiro. @pt-br
definition: Tjenester til opbevaring, transmission, modtagelse og levering af kontanter. @dk
definition: 提供货币的存储、运输、接收和支付的服务行业 @zh-hans
in scheme: Media Topic
created: 2009-10-22T02:00:00+00:00
modified: 2023-03-31T12:00:00+00:00
broader: financial service

consultancy
type: Concept
preferred label: Consultants @fr
preferred label: خدمات استشارية @ar
preferred label: Unternehmensberatung @de
preferred label: Konsulter @se
preferred label: Servicios de consultoría @es
preferred label: serviço de consultoria @pt-pt
preferred label: konsulenttjeneste @dk
preferred label: 咨询服务 @zh-hans
preferred label: konsulentvirksomhet @no-nb
preferred label: konsulentverksemd @no-nn
definition: Leverantörer av expertkunskap inom ett specifikt område, vanligtvis under en avtalad tid. @se
definition: Anbieter von Expertenwissen in vielseitigen Wissensgebieten, meist in Form von Zeitverträgen @de
definition: Providers of expert knowledge in a wide range of fields usually on a temporary, contract basis
definition: Fornecedores de conhecimentos especializados em vários domínios, geralmente com base em contratos temporários. @pt-pt
definition: Udbydere af ekspertviden inden for et specifikt område, normalt i en aftalt periode. @dk
definition: 提供广泛领域的专业知识服务，通常基于临时合同 @zh-hans
in scheme: Media Topic
created: 2009-10-22T02:00:00+00:00
modified: 2023-03-31T12:00:00+00:00
broader: business service

employment agency
type: Concept
preferred label: Services d'aide à la recherche d'emploi @fr
preferred label: وكالات توظيف @ar
preferred label: Agencias de empleo @es
preferred label: Bemanningsföretag @se
preferred label: Arbeitsvermittlung @de
preferred label: agência de emprego @pt-pt
preferred label: arbejdsformidling @dk
preferred label: 职业介绍所 @zh-hans
preferred label: arbeidsformidling @no-nb
definition: A service helping people find jobs, and companies to find workers
definition: Dienst, der Menschen unterstützt einen Arbeitsplatz zu finden und für Firmen Arbeitskräfte vermittelt @de
definition: Tjänster som hjälper personer att hitta ett arbete och som hjälper företag att hitta arbetskraft. @se
definition: Serviço que ajuda as pessoas a encontrar emprego e as empresas a encontrar empregados. @pt-pt
definition: Tjenester, der hjælper folk med at finde et job og hjælpe virksomheder med at finde arbejde. @dk
definition: 帮助人们找到工作，帮助公司找到工人的服务 @zh-hans
in scheme: Media Topic
created: 2009-10-22T02:00:00+00:00
modified: 2023-03-31T12:00:00+00:00
broader: business service

health care provider
type: Concept
preferred label: مزود خدمات صحية @ar
preferred label: Vårdgivare @se
preferred label: Prestadores de servicios de salud @es
preferred label: Gesundheitsdienst @de
preferred label: Services de santé @fr
preferred label: prestador de serviços de saúde @pt-pt
preferred label: privat sundhedsforsikring @dk
preferred label: 医疗服务提供者 @zh-hans
preferred label: helsetjenestetilbyder @no-nb
preferred label: helsetenestetilbydar @no-nn
definition: Anbieter von medizinischen Diensten auf allen Ebenen, inklusive Ärzte, Kliniken etc. @de
definition: Företag som tillhandahåller tjänster inom hälso- och sjukvård. @se
definition: Organisations and individuals that provide medical services at all levels
definition: Fornecedores de serviços médicos a todos os níveis, incluindo médicos, hospitais, etc. @pt-pt
definition: Fornecedores de serviços médicos a todos os níveis, incluindo médicos, hospitais etc. @pt-br
definition: Virksomheder, der leverer sundhedsydelser. @dk
definition: 各级医疗服务的提供者，包括医生、医院等 @zh-hans
definition: Organizations and individuals that provide medical services at all levels
in scheme: Media Topic
created: 2009-10-22T02:00:00+00:00
modified: 2022-06-14T12:00:00+00:00
broader: healthcare industry

insurance
type: Concept
preferred label: Versicherung @de
preferred label: تأمين @ar
preferred label: Seguros @es
preferred label: Försäkringar @se
preferred label: Assurances @fr
preferred label: seguros @pt-pt
preferred label: forsikring @dk
preferred label: 保险 @zh-hans
definition: Tjänster som låter individer betala små belopp regelbundet för att skydda sig ekonomiskt mot stora oväntade händelser. @se
definition: Ein Risiko tragendes Unternehmen, das einzelnen ermöglicht regelmäßig einen kleinen Beitrag zu zahlen, um finanziell auf unvorhergesehene Ereignisse vorbereitet zu sein. @de
definition: A risk-taking venture that allows individuals to pay small amounts periodically to guard financially against unexpected events
definition: Contrato de assunção de risco que pressupõe que os indivíduos paguem periodicamente uma quantia para ficarem protegidos financeiramente contra eventos inesperados. @pt-pt
definition: Tjenester, der tillader enkeltpersoner at betale små beløb regelmæssigt for at beskytte sig økonomisk mod større uventede begivenheder. @dk
definition: 允许个人定期支付小额款项以防范意外事件的风险投资 @zh-hans
in scheme: Media Topic
created: 2009-10-22T02:00:00+00:00
modified: 2023-03-31T12:00:00+00:00
broader: financial service

financial advisory service
type: Concept
preferred label: خدمات استثمارية @ar
preferred label: Conseil financier @fr
preferred label: Asesoría de inversiones @es
preferred label: Ekonomisk rådgivning @se
preferred label: Investmentdienst @de
preferred label: serviços de investimento @pt-pt
preferred label: investeringsrådgivning @dk
preferred label: 投资服务 @zh-hans
preferred label: finansrådgivning @no-nb
preferred label: finansrådgivarar @no-nn
definition: Finanzberater, entgegen Börsenhändlern und -beratern @de
definition: Financial advisers, as opposed to stock dealers or consultants
definition: Företag som ger råd om hur en individ eller ett företag bör investera. @se
definition: Conselheiros financeiros. @pt-pt
definition: Virksomheder, der rådgiver om, hvordan en enkeltperson eller virksomhed skal investere. @dk
definition: 指财务顾问，而不是股票交易商或顾问 @zh-hans
in scheme: Media Topic
created: 2009-10-22T02:00:00+00:00
modified: 2023-03-31T12:00:00+00:00
broader: financial service

janitorial service
type: Concept
preferred label: Société de nettoyage @fr
preferred label: Fastighetsskötsel @se
preferred label: Reinigungsservice @de
preferred label: Servicios de conserjería @es
preferred label: خدمة صيانة مباني @ar
preferred label: serviços de limpeza @pt-pt
preferred label: rengøring @dk
preferred label: 清洁服务 @zh-hans
preferred label: renholdstjenester @no-nb
preferred label: reinhaldstenester @no-nn
definition: Unternehmen, die für private und geschäftliche Kunden Reinigungsdienstleistungen anbieten @de
definition: Companies that provide cleaning and similar services for homes and businesses.
definition: Företag som hjälper till med städning av bostäder eller affärslokaler. @se
definition: Empresas que fornecem serviços de limpeza e similares. @pt-pt
definition: Virksomheder, der udfører rengøring af boliger eller forretningslokaler. @dk
definition: 为家庭和企业提供清洁和类似服务的公司 @zh-hans
change note: Retired.
in scheme: Media Topic
created: 2009-10-22T02:00:00+00:00
retired: 2023-03-31T12:00:00+00:00
modified: 2023-03-31T12:00:00+00:00
broader: business service

legal service
type: Concept
preferred label: Rechtsberatung @de
preferred label: Juridiska tjänster @se
preferred label: خدمات قانونية @ar
preferred label: Service juridique @fr
preferred label: Servicios legales @es
preferred label: serviços jurídicos @pt-pt
preferred label: juridisk tjeneste @dk
preferred label: 法律服务 @zh-hans
preferred label: juridisk bistand @no-nb
definition: Tjänster som hjälper individer eller företag att tolka och förhålla sig till nationella, regionala eller lokala lagar. @se
definition: Lawyers, notaries and others who help companies and individuals deal with state, federal and local laws
definition: Rechtsanwälte und andere, die Firmen und Einzelnen dabei helfen mit staatlichen, bundesstaatlichen und örtlichen Gesetzen umzugehen. @de
definition: Advogados, notários e outros que ajudam empresas e indivíduos a lidar com leis. @pt-pt
definition: Tjenester, der hjælper enkeltpersoner eller virksomheder med at fortolke og forholde sig til nationale, regionale eller lokale love. @dk
definition: 律师、公证人和其他人帮助公司和个人处理州、联邦和地方法律事务 @zh-hans
change note: 2016-04-04: definition slightly modified.
in scheme: Media Topic
created: 2009-10-22T02:00:00+00:00
modified: 2023-03-31T12:00:00+00:00
broader: business service

personal finance and investment
type: Concept
preferred label: استثمارات شخصية @ar
preferred label: Privata investeringar @se
preferred label: Privatinvestition @de
preferred label: Inversiones personales @es
preferred label: Placements personnels @fr
preferred label: investimentos pessoais @pt-pt
preferred label: personlig investering @dk
preferred label: 个人投资 @zh-hans
preferred label: sparerådgivning @no-nb
preferred label: sparerådgiving @no-nn
definition: En individs personliga finanser och ekonomiska satsningar. @se
definition: Private Finanzen und Investitionen @de
definition: Investing an individual's savings in the hope of future gains
definition: Finanças e investimentos pessoais. @pt-pt
definition: Den enkeltes finansielle investeringer. @dk
definition: 个人理财及投资 @zh-hans
in scheme: Media Topic
created: 2009-10-22T02:00:00+00:00
modified: 2023-03-31T12:00:00+00:00
broader: financial service

personal service
type: Concept
preferred label: Servicios personales @es
preferred label: Körperpflegeservice @de
preferred label: Soins de beauté @fr
preferred label: Skönhetsindustri @se
preferred label: خدمة شخصية @ar
preferred label: serviços pessoais @pt-pt
preferred label: skønhedspleje @dk
preferred label: 个人服务 @zh-hans
preferred label: personlig pleie @no-nb
preferred label: personleg pleie @no-nn
definition: Consumer service that is intangible e.g. beauty care such as hairdressing
definition: Dienstleistung, die nicht ganz greifbar ist, z.B. Kosmetik und Haarpflege @de
definition: Tjänster för att ta hand om en individs kropp, såsom hårfrisering, massage och nagelvård. @se
definition: Serviço ao consumidor que é intangível, como cuidados de beleza ou cabeleireiro. @pt-pt
definition: Tjenester til at tage sig af den enkeltes krop, såsom frisør, massage og neglepleje. @dk
definition: 如美容护理等无形消费服务 @zh-hans
change note: Retired. Use medtop:20001249 hairstyles or medtop:20000220 cosmetics instead.
in scheme: Media Topic
created: 2009-10-22T02:00:00+00:00
retired: 2023-03-31T12:00:00+00:00
modified: 2023-03-31T12:00:00+00:00
broader: business service

rental service
type: Concept
preferred label: خدمات تأجير @ar
preferred label: Mietservice @de
preferred label: Rentadoras @es
preferred label: Uthyrningsfirmor @se
preferred label: Sociétés de location @fr
preferred label: serviços de aluguer @pt-pt
preferred label: serviços de locação @pt-br
preferred label: udlejningsfirma @dk
preferred label: 租赁服务 @zh-hans
preferred label: utleievirksomhet @no-nb
preferred label: utleigeverksemd @no-nn
definition: Companies that provide items on a short-term rental basis, including motor vehicles, clothing, tools, heavy equipment and other supplies
definition: Unternehmen, die Vermietungen anbieten, Fahrzeuge, Smokings, Werkzeuge, schwere Ausrüstung und andere Angebote @de
definition: Företag som hyr ut saker, såsom bilar, kläder och verktyg. @se
definition: Empresas que fornecem serviços de aluguer, incluindo veículos, smokings, ferramentas, equipamento pesado e outros bens. @pt-pt
definition: Empresas que fornecem serviços de locação, incluindo veículos, smokings, ferramentas, equipamento pesado e outros bens. @pt-br
definition: Virksomheder, der udlejer eksempelvis biler, boliger, tøj og værktøj. @dk
definition: 提供租赁服务的公司，包括机动车、晚礼服、工具、重型设备和其他用品的租赁 @zh-hans
in scheme: Media Topic
created: 2009-10-22T02:00:00+00:00
modified: 2023-03-31T12:00:00+00:00
broader: business service

shipping and postal service
type: Concept
preferred label: Kurierdienst @de
preferred label: Servicios de envío @es
preferred label: خدمات الشحن @ar
preferred label: Messagerie @fr
preferred label: Bud- och transporttjänster @se
preferred label: serviços de expedição @pt-pt
preferred label: kurer- og transporttjeneste @dk
preferred label: 运输服务 @zh-hans
preferred label: frakt- og posttjenester @no-nb
preferred label: frakt- og posttenester @no-nn
definition: Företag som förbereder och fraktar paket och dokument åt individer eller företag. @se
definition: Organisations that prepare and transport packages and documents for individuals or companies by any means, including postal services
definition: Unternehmen, die Pakete und Dokumente für Einzelne oder Firmen verpacken und auf allen Wegen transportieren, Postdienste miteingeschlossen @de
definition: Empresas que preparam e transportam embalagens e documentos por vários meios, incluindo serviços postais. @pt-pt
definition: Virksomheder, der forbereder og sender pakker og dokumenter til enkeltpersoner eller virksomheder. @dk
definition: 以任何方式（包括邮政服务）为个人或公司包装和运输包裹和文件的公司 @zh-hans
definition: Organizations that prepare and transport packages and documents for individuals or companies by any means, including postal services
in scheme: Media Topic
created: 2009-10-22T02:00:00+00:00
modified: 2023-03-31T12:00:00+00:00
broader: business service

stock broking
type: Concept
preferred label: Börsenmakler @de
preferred label: Courtage d'actions @fr
preferred label: Corretaje de acciones @es
preferred label: Aktiemäklande @se
preferred label: سمسرة @ar
preferred label: corretagem @pt-pt
preferred label: børsmægling @dk
preferred label: 股票经纪 @zh-hans
preferred label: aksjemekling @no-nb
definition: Kaufen und Verkaufen von Firmenanteilen im Auftrag von Einzelnen oder anderen Gremien. @de
definition: Tjänster för att köpa och sälja aktier åt individer eller andra entiteter. @se
definition: The buying and selling of company shares on behalf of individuals or other entities
definition: Compra e venda de ações de uma companhia, em representação de indivíduos ou entidades. @pt-pt
definition: Tjenester til at købe og sælge aktier til enkeltpersoner eller andre enheder. @dk
definition: 代表个人或者其他实体买卖公司股票的行为 @zh-hans
in scheme: Media Topic
created: 2009-10-22T02:00:00+00:00
modified: 2023-03-31T12:00:00+00:00
broader: financial service

wedding service
type: Concept
preferred label: Hochzeitsservice @de
preferred label: خدمات زواج @ar
preferred label: Services matrimoniaux @fr
preferred label: Servicios de boda @es
preferred label: Bröllopstjänster @se
preferred label: serviços de casamento @pt-pt
preferred label: bryllupsservice @dk
preferred label: 婚礼服务 @zh-hans
preferred label: bryllupstjenester @no-nb
preferred label: bryllaupstenester @no-nn
definition: Varor och tjänster för att genomföra en vigsel med tillhörande festligheter. @se
definition: Services and products related to the wedding industry
definition: Dienste und Produkte rund um die Hochzeit @de
definition: Serviços e produtos relacionados com a indústria do casamento. @pt-pt
definition: Serviços e produtos relacionados à indústria do casamento. @pt-br
definition: Varer og tjenester til at gennemføre en vielse med tilhørende festligheder. @dk
definition: 与婚庆行业相关的服务和产品 @zh-hans
change note: Retired. Use medtop:20001236 wedding instead.
in scheme: Media Topic
created: 2009-10-22T02:00:00+00:00
retired: 2023-03-31T12:00:00+00:00
modified: 2023-03-31T12:00:00+00:00
broader: business service

aerospace
type: Concept
preferred label: صناعات جوية وفضائية @ar
preferred label: Industrie aérospatiale @fr
preferred label: Flug- und Raumfahrindustrie @de
preferred label: Industria aeroespacial @es
preferred label: Flyg- och rymdindustri @se
preferred label: indústria aeroespacial @pt-pt
preferred label: fly- og rumfartsindustri @dk
preferred label: 航空航天 @zh-hans
preferred label: fly- og romfartsindustri @no-nb
definition: Produktion av flygplan och rymdfarkoster samt komponenter som behövs för att tillverka dessa. @se
definition: Firmen, die Komponenten für Flugzeuge und die Raumfahrt zusammenbauen oder herstellen @de
definition: Companies that assemble or manufacture components for airplanes and space ships.
definition: Companhias que montam ou fabricam componentes para aviões e naves espaciais. @pt-pt
definition: Produktion af fly og rumfartøjer og komponenter, der er nødvendige for at fremstille dem. @dk
definition: 为飞机和宇宙飞船装配或制造部件的公司 @zh-hans
in scheme: Media Topic
created: 2009-10-22T02:00:00+00:00
modified: 2021-02-18T12:00:00+00:00
broader: manufacturing and engineering

automotive
type: Concept
preferred label: Industrie automobile @fr
preferred label: Bilindustri @se
preferred label: تجهيزات سيارات @ar
preferred label: Automobilindustrie @de
preferred label: Equipamiento para vehículos @es
preferred label: automóvel @pt-pt
preferred label: bilindustri @dk
preferred label: 汽车制造 @zh-hans
definition: Produktion av bilar och komponenter som behövs för att tillverka bilar. @se
definition: Firmen die Komponenten für Autos herstellen @de
definition: Companies that manufacture automotive components and assemble automobiles
definition: Companhias que fabricam peças para automóveis e que os montam. @pt-pt
definition: Produktion af biler og komponenter, der er nødvendige for at fremstille biler. @dk
definition: 指汽车零部件生产及整车组装 @zh-hans
in scheme: Media Topic
created: 2009-10-22T02:00:00+00:00
modified: 2021-02-18T12:00:00+00:00
broader: manufacturing and engineering

defence equipment
type: Concept
preferred label: Försvarsindustri @se
preferred label: تجهيرات دفاعية @ar
preferred label: Industrie de défense @fr
preferred label: Equipos de defensa @es
preferred label: Rüstungsindustrie @de
preferred label: indústria da defesa @pt-pt
preferred label: forsvarsudstyr @dk
preferred label: 国防装备 @zh-hans
preferred label: våpenindustri @no-nb
preferred label: defense equipment
definition: Produktion av vapen, stridsvagnar, kanoner, fartyg med mera för användning av militära och icke-militära försvarsstyrkor. @se
definition: Hersteller von Gewehren, Kanonen, Panzern und Schiffen etc. für militärische und nicht-militärische Sicherheitsdienste @de
definition: Manufacturers of guns, tanks, ships or other equipment for military and non-military protection services
definition: Fabricantes de armas, tanques, canhões, barcos, etc. para os serviços de proteção militar e não militar. @pt-pt
definition: Fabricantes de armas, tanques, canhões, barcos etc. para os serviços de proteção militar e não militar. @pt-br
definition: Produktion af våben, tanks, kanoner, skibe og mere til brug af militære og ikke-militære forsvarsstyrker. @dk
definition: 枪支、坦克、大炮、船舶等军事和非军事防卫武器 @zh-hans
in scheme: Media Topic
created: 2009-10-22T02:00:00+00:00
modified: 2023-03-31T12:00:00+00:00
broader: manufacturing and engineering

electrical appliance
type: Concept
preferred label: Elektroindustrie @de
preferred label: اجهزة كهربائية @ar
preferred label: Appareils électriques et électroménager @fr
preferred label: Artefactos eléctricos @es
preferred label: Elutrustningar @se
preferred label: material elétrico @pt-pt
preferred label: elektrisk udstyr @dk
preferred label: 电器 @zh-hans
preferred label: elektronikkindustri @no-nb
definition: Makers of large and small electrical goods for use in homes or business
definition: Produktion av stora och små elektroniska varor för användning i hemmet eller affärsverksamheten. @se
definition: Hersteller von großen und kleinen Elektrowaren für den privaten und geschäftlichen Gebrauch @de
definition: Fabricantes de produtos elétricos para uso doméstico ou industrial. @pt-pt
definition: Produktion af store og små elektroniske varer til brug i hjemmet eller virksomheden. @dk
definition: 家用或专业用的小型和大型电器 @zh-hans
in scheme: Media Topic
created: 2009-10-22T02:00:00+00:00
modified: 2021-02-18T12:00:00+00:00
broader: manufacturing and engineering

heavy engineering
type: Concept
preferred label: هندسة ثقيلة @ar
preferred label: Engins de chantier @fr
preferred label: Tunga maskiner @se
preferred label: Ingeniería pesada @es
preferred label: Anlagenbau @de
preferred label: equipamentos pesados @pt-pt
preferred label: sværindustri @dk
preferred label: 重工机械 @zh-hans
preferred label: tungindustri @no-nb
definition: Manufacturers of engineering equipment, such as cranes and bulldozers, for use in major construction projects
definition: Herstellung von Kränen, Bulldozern und ähnliches für den Gebrauch bei großen Bauprojekten @de
definition: Produktion av kranar, bulldozers och liknande för användning i stora konstruktionsprojekt. @se
definition: Fabricantes de gruas, buldózeres e equipamento similar para uso em grandes projetos de construção. @pt-pt
definition: Fabricantes de gruas, buldôzeres e equipamento similar para uso em grandes projetos de construção. @pt-br
definition: Produktion af kraner, bulldozere og lignende til anvendelse i store byggeprojekter. @dk
definition: 起重机、推土机等重型设备 @zh-hans
in scheme: Media Topic
created: 2009-10-22T02:00:00+00:00
modified: 2023-03-31T12:00:00+00:00
broader: manufacturing and engineering

industrial component
type: Concept
preferred label: Componentes industriales @es
preferred label: Zulieferindustrie @de
preferred label: مكونات صناعية @ar
preferred label: Komponenttillverkning @se
preferred label: Composants industriels @fr
preferred label: equipamentos metalomecânicos @pt-pt
preferred label: industriel komponent @dk
preferred label: 工业部件 @zh-hans
preferred label: komponentindustri @no-nb
definition: Produktion av mekansika, elektroniska eller elektriska produkter som behövs för att tillverka andra produkter. @se
definition: Manufacturers of mechanical, electrical, electronic items needed in the manufacture of other items
definition: Hersteller von mechanischen, elektrischen und elektronischen Produkten, die zur Herstellung anderer Produkte benötigt werden @de
definition: Fabricantes de artigos mecânicos, elétricos e eletrónicos, necessários na produção de outros equipamentos. @pt-pt
definition: Fabricantes de artigos mecânicos, elétricos e eletrônicos, necessários na produção de outros equipamentos. @pt-br
definition: Produktion af mekaniske, elektroniske eller elektriske produkter, der er nødvendige for at fremstille andre produkter. @dk
definition: 机械，电气，电子产品生产所需的其他部件 @zh-hans
in scheme: Media Topic
created: 2009-10-22T02:00:00+00:00
retired: 2023-03-31T12:00:00+00:00
modified: 2023-03-31T12:00:00+00:00
broader: manufacturing and engineering

instrument engineering
type: Concept
preferred label: Gerätebau @de
preferred label: هندسة اجهزة @ar
preferred label: Construction d'instruments @fr
preferred label: Ingeniería de instrumentos @es
preferred label: Mätinstrumenttillverkning @se
preferred label: engenharia de instrumentação @pt-pt
preferred label: instrumentteknik @dk
preferred label: 仪表工程 @zh-hans
preferred label: presisjonsinstrumentindustri @no-nb
preferred label: presisjonsinstrumentsindustri @no-nn
definition: Produktion av instrument för kalibrering samt mätning av t ex hastighet, tryck och distans. @se
definition: Hersteller von Instrumenten zur Eichung, Messungen von Dingen wie Geschwindigkeit, Druck und Entfernung @de
definition: Manufacturers of instruments for calibration, measurement of things like speed, pressure, distance
definition: Fabricantes de instrumentos de calibração ou de medição de coisas como velocidade, pressão, distância, etc. @pt-pt
definition: Fabricantes de instrumentos de calibração ou de medição de coisas como velocidade, pressão, distância etc. @pt-br
definition: Produktion af instrumenter til kalibrering og måling af fx hastighed, tryk og afstand. @dk
definition: 用于校准、测量诸如速度、压力、距离等的仪表制造商 @zh-hans
in scheme: Media Topic
created: 2009-10-22T02:00:00+00:00
retired: 2023-03-31T12:00:00+00:00
modified: 2023-03-31T12:00:00+00:00
broader: manufacturing and engineering

machine manufacturing
type: Concept
preferred label: Mécanique lourde @fr
preferred label: Maschinenbau @de
preferred label: Maskintillverkning @se
preferred label: Fabricación de máquinas @es
preferred label: صناعة آلات @ar
preferred label: engenharia de máquinas @pt-pt
preferred label: maskinfremstilling @dk
preferred label: 机械制造 @zh-hans
preferred label: maskinindustri @no-nb
definition: Manufacturers of turbines, engines, fans, pumps, motors and other components for powered equipment
definition: Produktion av turbiner, motorer, fläktar, pumpar och andra komponenter till motordriven utrustning. @se
definition: Hersteller von Turbinen, Maschinen, Pumpen, Ventilatoren, Motoren und Komponenten für schwere Ausrüstung @de
definition: Fabricantes de turbinas, motores, ventiladores, bombas e componentes para equipamentos elétricos. @pt-pt
definition: Produktion af turbiner, motorer, ventilatorer, pumper og andre komponenter til motordrevet udstyr. @dk
definition: 涡轮机、发动机、风扇、泵、电动机和动力设备部件的制造商。 @zh-hans
in scheme: Media Topic
created: 2009-10-22T02:00:00+00:00
modified: 2023-03-31T12:00:00+00:00
broader: manufacturing and engineering

shipbuilding
type: Concept
preferred label: Schiffbau @de
preferred label: Construction navale @fr
preferred label: Astilleros @es
preferred label: بناء سفن @ar
preferred label: Varvsindustri @se
preferred label: construção naval @pt-pt
preferred label: skibsbyggeri @dk
preferred label: 造船 @zh-hans
preferred label: skipsbygging @no-nb
definition: Hersteller von Schiffen, U-Booten oder Lastkähnen @de
definition: Produktion av fartyg, ubåtar och pråmar. @se
definition: Manufacturers of ships and submersibles and suppliers for the maintenance and repair of these vessels
definition: Fabricantes de navios, submarinos, barcaças. @pt-pt
definition: Produktion af skibe, ubåde og pramme. @dk
definition: 船舶、潜艇、驳船制造 @zh-hans
in scheme: Media Topic
created: 2009-10-22T02:00:00+00:00
modified: 2023-03-31T12:00:00+00:00
broader: manufacturing and engineering

capital goods
type: Concept
preferred label: Kapitalvaror @se
preferred label: bens de produção @pt-pt
preferred label: kapitalgode @dk
preferred label: 资本品 @zh-hans
preferred label: kapitalvarer @no-nb
preferred label: Investitionsgüter @de
preferred label: Biens d'équipement @fr
preferred label: Bienes de equipo @es
preferred label: سلع انتاجية @ar
definition: Varaktiga produkter som används vid produktionen av andra varor eller tjänster. @se
definition: Durable goods used in the production of other goods or services.
definition: Bens duráveis utilizados na produção de outros bens ou serviços. @pt-pt
definition: Holdbare produkter, der bruges til produktion af andre varer eller tjenester. @dk
definition: 用于生产其他商品或服务的耐用品，也称资本财货 @zh-hans
definition: Langlebige Güter, die bei der Produktion anderer Güter oder Dienstleistungen verwendet werden @de
in scheme: Media Topic
created: 2016-04-04T12:00:00+00:00
retired: 2023-03-31T12:00:00+00:00
modified: 2023-03-31T12:00:00+00:00
broader: manufacturing and engineering

railway manufacturing
type: Concept
preferred label: Järnvägsindustrin @se
preferred label: construção ferroviária @pt-pt
preferred label: jernbanefremstilling @dk
preferred label: 铁路制造业 @zh-hans
preferred label: jernbaneindustri @no-nb
preferred label: Bahnindustrie @de
preferred label: Industrie ferroviaire @fr
preferred label: Industria ferroviaria @es
preferred label: صناعة السكك الحديد @ar
definition: Manufactures of rolling stock and suppliers for the maintenance and repair of railroads
definition: Produktion av tåg, järnvägar, signalsystem samt drift och underhåll av dessa. @se
definition: Fabricantes e fornecedores de material circulante, ferrovias, sistemas de sinalização, manutenção e reparação. @pt-pt
definition: Produktion af tog, jernbaner, signalanlæg og drift og vedligeholdelse heraf. @dk
definition: 车辆制造商、供应商、铁路和信号产业、维护和修理业 @zh-hans
definition: Schienenfahrzeughersteller, Zulieferer, Eisenbahn- und Signalindustrie, Wartung und Reparatur. @de
in scheme: Media Topic
created: 2016-04-04T12:00:00+00:00
modified: 2023-03-31T12:00:00+00:00
broader: manufacturing and engineering

advertising
type: Concept
preferred label: Publicité @fr
preferred label: Reklam @se
preferred label: Publicidad @es
preferred label: Werbung @de
preferred label: اعلان @ar
preferred label: publicidade @pt-pt
preferred label: reklame @dk
preferred label: 广告 @zh-hans
preferred label: reklamebransjen @no-nb
definition: Methods of promoting goods and services to consumers
definition: Methoden Waren und Dienstleistungen dem Kunden anzupreisen mit Hilfe von Videos, Grafiken, Text etc. @de
definition: Metoder för att marknadsföra varor och tjänster med hjälp av video, grafik eller text. @se
definition: Métodos de promoção de bens e serviços junto do consumidor, através de vídeos, imagens, textos, etc. @pt-pt
definition: Métodos de promoção de bens e serviços junto do consumidor, através de vídeos, imagens, textos etc. @pt-br
definition: Metoder til markedsføring af varer og tjenester ved hjælp af video, grafik eller tekst. @dk
definition: 通过视频、图形、印刷文本等方式向消费者推销商品和服务的方式 @zh-hans
in scheme: Media Topic
created: 2009-10-22T02:00:00+00:00
modified: 2023-03-31T12:00:00+00:00
broader: media and entertainment industry

books and publishing
type: Concept
preferred label: Édition @fr
preferred label: Libros @es
preferred label: Förlagsindustrin @se
preferred label: Verlag @de
preferred label: صناعة الكتب @ar
preferred label: mercado livreiro @pt-pt
preferred label: bogbranche @dk
preferred label: 图书业 @zh-hans
preferred label: bokbransjen @no-nb
definition: Den kommersiella verksamhet som producerar och säljer böcker, både skönlitteratur och facklitteratur. @se
definition: The business of producing and selling books, including e-books and audiobooks
definition: Das Geschäft gebundene Medien zu produzieren und zu verkaufen, sowohl Belletristik als auch Sachliteratur @de
definition: Negócio de produção e venda de publicações, seja de ficção ou de não ficção. @pt-pt
definition: Kommercielle virksomheder, der producerer og sælger bøger, både fiktion og ikke-fiktion. @dk
definition: 生产和销售各种小说或非小说作品 @zh-hans
definition: Produksjon og sal av skjønnlitteratur og sakprosa. @no-nn
definition: Produksjon og salg av skjønnlitteratur og sakprosa @no-nb
in scheme: Media Topic
created: 2009-10-22T02:00:00+00:00
modified: 2023-03-31T12:00:00+00:00
broader: media and entertainment industry

film industry
type: Concept
preferred label: صناعة السينما @ar
preferred label: Filmindustrin @se
preferred label: Industrie du cinéma @fr
preferred label: Filmindustrie @de
preferred label: Industria cinematográfica @es
preferred label: indústria cinematográfica @pt-pt
preferred label: filmbranche @dk
preferred label: 电影业 @zh-hans
preferred label: filmbransjen @no-nb
definition: Den kommersiella verksamhet som ägnas åt inspelning, bearbetning, förvärv, distribution, visning, försäljning och uthyrning av film. @se
definition: The business of making, selling and distributing films
definition: Artikel, die sich auf das Filmgeschäft beziehen @de
definition: Histórias relativas ao negócio do cinema. @pt-pt
definition: Kommercielle virksomheder, der er afsat til optagelse, forarbejdning, erhvervelse, distribution, visning, salg og leje af film. @dk
definition: 电影业务 @zh-hans
in scheme: Media Topic
created: 2009-10-22T02:00:00+00:00
modified: 2023-03-31T12:00:00+00:00
broader: media and entertainment industry

music industry
type: Concept
preferred label: Musikindustrin @se
preferred label: Musikindustrie @de
preferred label: Industrie musicale @fr
preferred label: صناعة الموسيقى @ar
preferred label: Industria musical @es
preferred label: indústria musical @pt-pt
preferred label: musikbranche @dk
preferred label: 音乐产业 @zh-hans
preferred label: musikkbransjen @no-nb
definition: Den kommersiella verksamhet som omfattar publicering och försäljning av musik i olika former, främst fonogram eller digitala filer via internet, men även noter samt industriell tillverkning av och handel med musikinstrument och apparater för in- och avspelning av musik. @se
definition: Aufnahme, Produktion, Marketing von Musik @de
definition: Recording, production and marketing of music
definition: Gravação, produção e marketing de música. @pt-pt
definition: Optagelse, produktion og markedsføring af musik. @dk
definition: 录制、生产、销售音乐作品 @zh-hans
in scheme: Media Topic
created: 2009-10-22T02:00:00+00:00
modified: 2023-03-31T12:00:00+00:00
broader: media and entertainment industry

news agency
type: Concept
preferred label: Nachrichtenagentur @de
preferred label: وكالات انباء @ar
preferred label: Agencias de noticias @es
preferred label: Nyhetsbyråer @se
preferred label: Agence de presse @fr
preferred label: agências noticiosas @pt-pt
preferred label: nyhedsbureau @dk
preferred label: 通讯社 @zh-hans
preferred label: nyhetsbyrå @no-nb
preferred label: nyheitsbyrå @no-nn
definition: Commercial agencies for production and distribution of newsworthy events through print, broadcast, video or electronic media
definition: Kommerzielle Agenturen, die nachrichtenrelevante Ereignisse aufbereiten und verbreiten durch Presse, Fernsehen, Video oder elektronische Medien @de
definition: Kommersiella företag som producerar och distribuerar nyheter i text, bild och rörlig bild. @se
definition: Agências comerciais que produzem e distribuem eventos noticiosos por escrito, por rádio ou televisão, por vídeo ou por meios eletrónicos. @pt-pt
definition: Agências comerciais que produzem e distribuem eventos noticiosos por escrito, por rádio ou televisão, por vídeo ou por meios eletrônicos. @pt-br
definition: Kommercielle virksomheder, der producerer og distribuerer nyheder i tekst, billede og film. @dk
definition: 通过印刷、广播、视频或电子媒体等方式生产和发布有新闻价值的事件的商业机构 @zh-hans
change note: Retired. Use medtop:20001372 news industry instead.
in scheme: Media Topic
created: 2009-10-22T02:00:00+00:00
retired: 2023-03-31T12:00:00+00:00
modified: 2023-03-31T12:00:00+00:00
broader: media and entertainment industry

newspaper and magazine
type: Concept
preferred label: Presse @de
preferred label: Diarios y revistas @es
preferred label: Dagstidningar och magasin @se
preferred label: Journaux et périodiques @fr
preferred label: صحف ومجلات @ar
preferred label: imprensa @pt-pt
preferred label: avis og magasin @dk
preferred label: 报纸和杂志 @zh-hans
preferred label: aviser og magasiner @no-nb
preferred label: aviser og magasin @no-nn
definition: Das Geschäft mit gebundenen und ungebundenen, gedruckten Papiermaterial zur regelmäßigen Verbreitung von Nachrichten @de
definition: The business of producing bound and unbound printed paper products for periodic distribution of news items
definition: Den kommersiella verksamhet som producerar pappersprodukter innehållande nyheter och information. @se
definition: Negócio de produção de meios escritos ou gráficos impressos para a distribuição periódica de notícias. @pt-pt
definition: Kommercielle virksomheder, der producerer papirprodukter, der indeholder nyheder og information. @dk
definition: 生产装订和未装订的印刷品定期发行新闻产品的业务 @zh-hans
change note: Retired. Use medtop:20001372 news industry instead.
in scheme: Media Topic
created: 2009-10-22T02:00:00+00:00
retired: 2023-03-31T12:00:00+00:00
modified: 2023-03-31T12:00:00+00:00
broader: media and entertainment industry

online media industry
type: Concept
preferred label: انترنت @ar
preferred label: Presse en ligne @fr
preferred label: Online Medien @de
preferred label: Internetbaserade medier @se
preferred label: Noticias en línea @es
preferred label: média online @pt-pt
preferred label: mídia online @pt-br
preferred label: online-mediebranche @dk
preferred label: 网络媒体产业 @zh-hans
preferred label: nettmediebransjen @no-nb
definition: Das Geschäft mit der Verbreitung von Nachrichten und Informationen über Computernetzwerke für den öffentlichen Gebrauch @de
definition: Den kommersiella verksamhet som distribuerar nyheter och information genom datornätverk för allmän konsumtion. @se
definition: The business of distributing news and information through computer networks for public consumption
definition: Negócio de distribuição de notícias e informação através de redes de computadores, para consumo público. @pt-pt
definition: Kommercielle virksomheder, der distribuerer nyheder og information gennem computernetværk til almindeligt forbrug. @dk
definition: 通过计算机网络向公众传播新闻和信息的业务 @zh-hans
change note: Retired. Use medtop:20001372 news industry instead.
in scheme: Media Topic
created: 2009-10-22T02:00:00+00:00
retired: 2023-03-31T12:00:00+00:00
modified: 2023-03-31T12:00:00+00:00
broader: media and entertainment industry

public relations
type: Concept
preferred label: Relations publiques @fr
preferred label: Öffentlichkeitsarbeit @de
preferred label: Pr @se
preferred label: Relaciones públicas @es
preferred label: علاقات عامة @ar
preferred label: relações públicas @pt-pt
preferred label: PR @dk
preferred label: 公共关系 @zh-hans
preferred label: pr-bransjen @no-nb
definition: The business of managing and disseminating information from an individual or an organization to the public in order to influence their perception
definition: Den kommersiella verksamhet som marknadsför produkter eller tjänster med hjälp av reklam, direktkontakt eller annonser. @se
definition: Tätigkeit Produkte und Dienstleistungen anzupreisen durch Werbekampagnen, und/oder Kundenkontakt oder Nachrichtenverbreitung. @de
definition: Promoção de produtos e serviços através de campanhas publicitárias e/ou pessoa a pessoa, ou através de comunicados de imprensa. @pt-pt
definition: Promoção de produtos e serviços através de campanhas publicitárias e/ou pessoa a pessoa, ou através de releases. @pt-br
definition: Kommercielle virksomheder, der markedsfører produkter eller tjenester gennem reklame, direkte kontakt eller annoncer. @dk
definition: 简称公关，指通过广告，或通过人际关系，或通过新闻传播推广产品和服务的工作 @zh-hans
in scheme: Media Topic
created: 2009-10-22T02:00:00+00:00
modified: 2023-03-31T12:00:00+00:00
broader: media and entertainment industry

radio industry
type: Concept
preferred label: صناعة الاذاعة @ar
preferred label: Industria de radio @es
preferred label: Radioindustrin @se
preferred label: Radio @fr
preferred label: Radioindustrie @de
preferred label: rádio @pt-pt
preferred label: radiobranche @dk
preferred label: 广播业 @zh-hans
preferred label: radiobransjen @no-nb
definition: Den kommersiella verksamhet som producerar, distribuerar och sänder radioprogram. @se
definition: Companies and organisations involved in the broadcast of radio stations and their content to the public
definition: Radiogeschäft @de
definition: Histórias relativas ao negócio da rádio. @pt-pt
definition: Kommercielle virksomheder, der producerer, distribuerer og sender radioprogrammer. @dk
definition: 广播业务 @zh-hans
definition: Companies and organizations involved in the broadcast of radio stations and their content to the public
in scheme: Media Topic
created: 2009-10-22T02:00:00+00:00
modified: 2023-03-31T12:00:00+00:00
broader: media and entertainment industry

satellite and cable service
type: Concept
preferred label: Satellit- och kabelleverantörer @se
preferred label: خدمة اقمار اصطناعية وكابل @ar
preferred label: Satellit und Kabelservice @de
preferred label: Servicios satelitales y de cable @es
preferred label: Diffuseurs par câble ou satellite @fr
preferred label: serviços de satélite e de cabo @pt-pt
preferred label: satellit- og kabeltjeneste @dk
preferred label: 卫星电视和有线电视服务 @zh-hans
preferred label: tv-distribusjonsbransjen @no-nb
definition: Den kommersiella verksamhet som tillhandahåller tv med hjälp av satellit- eller kabelöverföring. @se
definition: Das Geschäft mit der Übertragung von Nachrichten, Unterhaltung und Informationen durch Satelliten oder Kabelfernsehen @de
definition: The business of transmitting news, entertainment and information via satellite or cable television services
definition: Transmissão de notícias, entretenimento e informação via satélite ou serviços de televisão por cabo. @pt-pt
definition: Transmissão de notícias, entretenimento e informação via satélite ou serviços de televisão a cabo. @pt-br
definition: Kommercielle virksomheder, der leverer tv ved hjælp af satellit eller kabel transmission. @dk
definition: 通过卫星或有线电视服务传送新闻、娱乐和信息的业务 @zh-hans
in scheme: Media Topic
created: 2009-10-22T02:00:00+00:00
modified: 2021-05-05T12:00:00+00:00
broader: media and entertainment industry

television industry
type: Concept
preferred label: Tv-industrin @se
preferred label: صناعة التلفزيون @ar
preferred label: Fernsehproduktion @de
preferred label: Industria de la televisión @es
preferred label: Télévision @fr
preferred label: televisão @pt-pt
preferred label: tv-branche @dk
preferred label: 电视业 @zh-hans
preferred label: tv-bransjen @no-nb
definition: Fernsehgeschäft @de
definition: The production and broadcasting of television content
definition: Den kommersiella verksamhet som producerar, distribuerar och sänder tv. @se
definition: Histórias relativas ao negócio da televisão. @pt-pt
definition: Kommercielle virksomheder, der producerer, distribuerer og sender tv. @dk
definition: 电视业务 @zh-hans
in scheme: Media Topic
created: 2009-10-22T02:00:00+00:00
modified: 2023-03-31T12:00:00+00:00
broader: media and entertainment industry

streaming service
type: Concept
preferred label: Streamingtjänster @se
preferred label: strømmetjenester @no-nb
preferred label: serviço de streaming @pt-pt
preferred label: streaming tjeneste @dk
preferred label: 流媒体服务 @zh-hans
preferred label: Streaming-Dienst @de
preferred label: Service de streaming @fr
preferred label: Servicio de streaming @es
preferred label: خدمة بث تدفقي @ar
preferred label: strøymetenester @no-nn
definition: Providers of entertainment (music, movies, series, etc.) that deliver the content via an internet connection to the subscriber's computer, TV or mobile device
definition: Företag som tillhandahåller underhållning som film och musik direkt via internet. @se
definition: Fornecedores de entretenimento (música, filmes, séries, etc.) que disponibilizam o conteúdo por meio de uma ligação de Internet ao computador, TV ou dispositivo móvel do assinante. @pt-pt
definition: Fornecedores de entretenimento (música, filmes, séries, etc.) que disponibilizam o conteúdo por meio de uma conexão de Internet ao computador, TV ou dispositivo móvel do assinante. @pt-br
definition: Udbydere af underholdning (film, musik, serier og mere) som bliver leveret igennem en internet tjeneste, der er tilgængelig igennem brugerens computer, mobiltelefon eller TV. @dk
definition: 娱乐内容（音乐、电影、剧集等）供应商通过互联网向其订阅用户提供接入电脑、电视或移动设备的内容服务 @zh-hans
definition: Anbieter von Unterhaltungsangeboten (Musik, Filme, Serien usw.), die den Inhalt über eine Internetverbindung auf den Computer, das Fernsehgerät. oder ein mobiles Gerät des Abonnenten übertragen @de
in scheme: Media Topic
created: 2020-08-05T12:00:00+00:00
modified: 2023-03-31T12:00:00+00:00
broader: media and entertainment industry

podcast
type: Concept
preferred label: podkast @no-nb
preferred label: Podcast @se
definition: Podcast networks and the people who create and distribute audio content, typically in a series format, to audiences
definition: Nätverk och personer som framställer avsnitt om olika ämnen som lyssnare kan ta del av. @se
definition: Podcast-Netzwerke und die Personen, die Audio-Inhalte erstellen und verbreiten, in der Regel im Serienformat, an ein Publikum @de
in scheme: Media Topic
created: 2023-03-31T12:00:00+00:00
modified: 2023-03-31T12:00:00+00:00
broader: media and entertainment industry

news industry
type: Concept
preferred label: pressen @no-nb
preferred label: pressa @no-nn
preferred label: Nyhetsindustrin @se
preferred label: Nachrichtenindustrie @de
definition: The production and distribution of content about newsworthy events through print, broadcast, video or electronic media
definition: Produktion och distribution av nyheter i tryck, utsändning, video eller digitalt. @se
definition: Produktion und Verbreitung von Inhalten über berichtenswerte Ereignisse in Print-, Rundfunk-, Video- oder elektronischen Medien @de
in scheme: Media Topic
created: 2023-03-31T12:00:00+00:00
modified: 2023-03-31T12:00:00+00:00
broader: media and entertainment industry

precious material
type: Concept
preferred label: Gold und Edelmetall @de
preferred label: Or et métaux précieux @fr
preferred label: ذهب واحجار ثمينة @ar
preferred label: Guld och värdefulla metaller @se
preferred label: Oro y metales preciosos @es
preferred label: ouro e metais preciosos @pt-pt
preferred label: guld og dyrebart materiale @dk
preferred label: 黄金和贵金属 @zh-hans
preferred label: edelmetaller og sjeldne jordarter @no-nb
preferred label: edelmetall og sjeldne jordartar @no-nn
definition: Gewinnung, Verfeinerung und Verkauf von Gold und anderen wertvollen Metallen @de
definition: Gruvdrift, anrikning och försäljning av guld och andra ädla metaller. @se
definition: The mining, refining and sale of materials such as gold, silver, precious metals, diamonds and rare earths
definition: Mineração, refinação e venda de ouro e de outros metais preciosos. @pt-pt
definition: Minedrift, berigelse og salg af guld og andre ædelmetaller. @dk
definition: 黄金及其他贵金属的开采、提炼、销售 @zh-hans
in scheme: Media Topic
created: 2009-10-22T02:00:00+00:00
modified: 2023-03-31T12:00:00+00:00
broader: metal and mineral mining and refining

iron and steel
type: Concept
preferred label: حديد وصلب @ar
preferred label: Eisen und Stahl @de
preferred label: Järn och stål @se
preferred label: Sidérurgie @fr
preferred label: Hierro y acero @es
preferred label: ferro e aço @pt-pt
preferred label: jern og stål @dk
preferred label: 钢铁 @zh-hans
preferred label: stålindustri @no-nb
definition: Mining, refining and sales of iron-based metals
definition: Gruvdrift, anrikning och försäljning av järnhaltiga metaller. @se
definition: Gewinnung, Verfeinerung und Verkauf von eisenhaltigen Metallen @de
definition: Mineração, refinação e venda de metais ferrosos. @pt-pt
definition: Minedrift, berigelse og salg af jernholdige metaller. @dk
definition: 铁基金属的采矿、冶炼和销售 @zh-hans
change note: Retired. Use medtop:20000316 metal and mineral mining and refining instead.
in scheme: Media Topic
created: 2009-10-22T02:00:00+00:00
retired: 2023-03-31T12:00:00+00:00
modified: 2023-03-31T12:00:00+00:00
broader: metal and mineral mining and refining

mining
type: Concept
preferred label: Mines @fr
preferred label: Bergbau @de
preferred label: Minería @es
preferred label: Gruvdrift @se
preferred label: مناجم @ar
preferred label: minas @pt-pt
preferred label: minedrift @dk
preferred label: 采矿业 @zh-hans
preferred label: gruvedrift @no-nb
definition: Verksamheten med att gräva efter metaller, råmaterial såsom kol samt ädelstenar såsom diamanter. @se
definition: Industriezweig, der nach Metallen oder Rohstoffen wie Kohle, oder wertvollen Edelsteinen wie Diamanten gräbt. @de
definition: The industry of digging for metals, minerals, raw materials, such as coal, or precious gems, such as diamonds
definition: Indústria da extração de metais, de matérias-primas como o carvão, ou de pedras preciosas como os diamantes. @pt-pt
definition: Industri som beskæftiger sig med at grave efter metaller, råmaterialer og kul eller ædelstene som diamanter. @dk
definition: 挖掘金属、矿物、原材料（如煤）或宝石（如钻石）的产业 @zh-hans
change note: Retired. Use medtop:20000316 metal and mineral mining and refining instead.
in scheme: Media Topic
created: 2009-10-22T02:00:00+00:00
retired: 2023-03-31T12:00:00+00:00
modified: 2023-03-31T12:00:00+00:00
broader: metal and mineral mining and refining

non-ferrous metal
type: Concept
preferred label: Nichteisenmetall @de
preferred label: Icke-järnmetall @se
preferred label: معادن غير حديدية @ar
preferred label: Minerales no ferruginosos @es
preferred label: Métaux non-ferreux @fr
preferred label: metais não ferrosos @pt-pt
preferred label: ikke-jernholdigt metal @dk
preferred label: 有色金属 @zh-hans
preferred label: ikke-jernholdige metaller @no-nb
preferred label: ikkje-jernhaldig metall @no-nn
definition: Gruvdrift, anrikning och försäljning av koppar, zink, aluminium och andra icke järnhaltiga metaller. @se
definition: Gewinnung, Verfeinerung und Verkauf von Kupfer, Zink, Aluminium und anderen nicht-eisenhaltigen Metallen @de
definition: Mining, refining and sales of copper, zinc, aluminium, and other metals not based on iron
definition: Mineração, refinação e venda de cobre, zinco, alumínio e de outros metais não ferrosos. @pt-pt
definition: Minedrift, berigelse og salg af kobber, zink, aluminium og andre ikke-jernholdige metaller. @dk
definition: 铜、锌、铝和其他非铁金属的开采、冶炼和销售 @zh-hans
definition: Mining, refining and sales of copper, zinc, aluminum, and other metals not based on iron
change note: Retired. Use medtop:20000316 metal and mineral mining and refining instead.
in scheme: Media Topic
created: 2009-10-22T02:00:00+00:00
retired: 2023-03-31T12:00:00+00:00
modified: 2023-03-31T12:00:00+00:00
broader: metal and mineral mining and refining

distiller and brewer
type: Concept
preferred label: تقطير وانتاج الخمر @ar
preferred label: Alkoholische Getränke/Brauerei @de
preferred label: Brasseries et distilleries @fr
preferred label: Destillerier och bryggerier @se
preferred label: Destilerías y cervecerías @es
preferred label: bebidas destiladas e cerveja @pt-pt
preferred label: destilação e bebidas @pt-br
preferred label: destilleri og bryggeri @dk
preferred label: 酒和啤酒 @zh-hans
preferred label: destilleri og bryggjeri @no-nn
definition: Manufacture of alcoholic beverages
definition: Herstellung alkoholischer Getränke @de
definition: Tillverkning av alkoholhaltiga drycker. @se
definition: Fabrico de bebidas alcoólicas. @pt-pt
definition: Fremstilling af alkoholholdige drikkevarer. @dk
definition: 酒精饮料入此 @zh-hans
change note: Retired. Use medtop:20000324 beverage and grocery instead.
in scheme: Media Topic
created: 2009-10-22T02:00:00+00:00
retired: 2023-03-31T12:00:00+00:00
modified: 2023-03-31T12:00:00+00:00
broader: process industry

paper and packaging product
type: Concept
preferred label: Productos de papel y embalaje @es
preferred label: Papier et emballage @fr
preferred label: Papper @se
preferred label: Papier und Verpackung @de
preferred label: صناعة الورق والنغليف @ar
preferred label: papel e embalagem @pt-pt
preferred label: papir og emballage @dk
preferred label: 纸张和包装产品 @zh-hans
preferred label: papir- og emballasjeindustri @no-nb
definition: Produktion von Papiermaterial zum Schreiben, Einwickeln, Drucken oder Verpacken. @de
definition: Production of paper material for writing, wrapping, printing, or packaging
definition: Tillverkning av papper för att skriva, slå in, trycka eller paketera. @se
definition: Produção de papel para escrever, embrulhar, imprimir ou embalar. @pt-pt
definition: Fremstilling af papir til skrivning, indpakning, trykning eller emballering. @dk
definition: 用于书写、包装、印刷或包裹用途的纸张材料的生产 @zh-hans
definition: Framstilling av papir for skriving, trykking, pakking og emballasje. @no-nn
definition: Fremstilling av papir for skriving, trykking, pakking og emballasje @no-nb
in scheme: Media Topic
created: 2009-10-22T02:00:00+00:00
retired: 2023-03-31T12:00:00+00:00
modified: 2023-03-31T12:00:00+00:00
broader: process industry

rubber product
type: Concept
preferred label: Gummi @de
preferred label: Caoutchouc @fr
preferred label: Productos de caucho @es
preferred label: منتجات مطاطية @ar
preferred label: borracha @pt-pt
preferred label: gummiprodukt @dk
preferred label: 橡胶制品 @zh-hans
preferred label: gummi-industri @no-nb
definition: Tillverkning av produkter (t ex handskar, slangar, skyddskläder) i vilka naturgummi och syntetiskt gummi till betydande del ingår som basråvara. @se
definition: Herstellung von gummibasierten Materialien wie Handschuhe, Schutzmäntel, Schläuchen und Ähnliches @de
definition: Production of rubber-based materials for gloves, protective coatings, hoses and the like
definition: Produção de materiais de borracha para o fabrico de luvas, revestimentos protetores, mangueiras, etc. @pt-pt
definition: Produção de materiais de borracha para o fabrico de luvas, revestimentos protetores, mangueiras etc. @pt-br
definition: Fremstilling af produkter (f.eks. Handsker, slanger, beskyttelsesbeklædning), hvor naturgummi og syntetisk gummi i vid udstrækning indgår som basisråmateriale. @dk
definition: 用橡胶基材料生产的手套、防护涂层、软管等产品 @zh-hans
in scheme: Media Topic
created: 2009-10-22T02:00:00+00:00
retired: 2023-03-31T12:00:00+00:00
modified: 2023-03-31T12:00:00+00:00
broader: process industry

soft drinks
type: Concept
preferred label: Ej alkoholhaltig dryck @se
preferred label: Nicht-alkoholische Getränke @de
preferred label: مشروبات غير كحولية @ar
preferred label: Boissons non-alcoolisées @fr
preferred label: Bebidas no alcohólicas @es
preferred label: refrigerantes @pt-pt
preferred label: læskedrik @dk
preferred label: 软饮料 @zh-hans
preferred label: mineralvannindustri @no-nb
preferred label: mineralvassindustri @no-nn
definition: Tillverkning av alkoholfria drycker. @se
definition: Herstellung nicht-alkoholischer Getränke @de
definition: Production of non-alcoholic drinks
definition: Fabrico de bebidas não alcoólicas. @pt-pt
definition: Fremstilling af ikke-alkoholholdige drikkevarer. @dk
definition: 指不含酒精的饮料 @zh-hans
change note: Retired. Use medtop:20000324 beverage and grocery instead.
in scheme: Media Topic
created: 2009-10-22T02:00:00+00:00
retired: 2023-03-31T12:00:00+00:00
modified: 2023-03-31T12:00:00+00:00
broader: process industry

textile and clothing
type: Concept
preferred label: Kläder och textilier @se
preferred label: Textil und Bekleidung @de
preferred label: نسيج والبسة @ar
preferred label: Textile @fr
preferred label: Textiles y vestimenta @es
preferred label: têxtil e vestuário @pt-pt
preferred label: tekstil og tøj @dk
preferred label: 纺织和服装 @zh-hans
preferred label: tekstilindustri @no-nb
definition: Production of fabrics for furnishings and fixtures, and for clothing of various types
definition: Produktion von Materialien für Möbel und Vorhänge und für verschiedene Sorten von Bekleidung @de
definition: Tillverkning av material för att klä människor, möbler och andra föremål. @se
definition: Fabrico de tecidos para móveis e acessórios de vestuário de vários tipos. @pt-pt
definition: Fabrico de tecidos para móveis, abajures e vestuário de vários tipos. @pt-br
definition: Fremstilling af materialer til påklædning af mennesker, møbler og andre genstande. @dk
definition: 生产用于家具装修，以及各种类型的服装用的织物 @zh-hans
change note: Retired. Use medtop:20000245 clothing instead.
in scheme: Media Topic
created: 2009-10-22T02:00:00+00:00
retired: 2023-03-31T12:00:00+00:00
modified: 2023-03-31T12:00:00+00:00
broader: process industry

e-cigarette
type: Concept
preferred label: E-cigaretter @se
preferred label: cigarro eletrónico @pt-pt
preferred label: cigarro eletrônico @pt-br
preferred label: e-cigaret @dk
preferred label: 电子烟 @zh-hans
preferred label: e-sigarett @no-nb
preferred label: E-Zigarette @de
preferred label: E-cigarette @fr
preferred label: Cigarrillo electrónico @es
preferred label: السيجارة الالكترونية @ar
definition: Laddningsbar patron som fylls med vätska som förångas när den dras in i lungorna, avsedd att användas som substitut för tobaksrökning. @se
definition: An electronic cigarette is a battery-operated device with an atomizer and a cartridge containing either a nicotine or a non-nicotine liquid solution.
definition: Dispositivo eletrónico dotado de bateria, atomizador e um cartucho com uma solução líquida com ou sem nicotina. @pt-pt
definition: Dispositivo eletrônico dotado de bateria, atomizador e um cartucho com uma solução líquida com ou sem nicotina. @pt-br
definition: Genopladelig patron fyldt med væske, som fordamper, når den trækkes ind i lungerne, beregnet til at blive erstatning for tobaksrygning. @dk
definition: 电子烟是一种由电池驱动的装置，带有雾化器和含有尼古丁或非尼古丁液体溶液的烟筒。 @zh-hans
definition: Eine elektronische Zigarette ist ein batteriebetriebenes Gerät mit einem Zerstäuber und einer Patrone, die entweder eine nikotinhaltige oder eine nicht-nikotinhaltige flüssige Lösung enthält. @de
change note: Retired. Use medtop:20000330 tobacco and nicotine instead.
in scheme: Media Topic
created: 2016-04-04T12:00:00+00:00
retired: 2023-03-31T12:00:00+00:00
modified: 2023-03-31T12:00:00+00:00
broader: process industry

casinos and gambling
type: Concept
preferred label: Casinon @se
preferred label: Casinos et jeux d'argent @fr
preferred label: Glücksspielindustrie @de
preferred label: Casinos y juegos de azar @es
preferred label: كازينو وقمار @ar
preferred label: casinos e jogo @pt-pt
preferred label: cassinos e jogo @pt-br
preferred label: gambling og spil @dk
preferred label: 赌场和博彩 @zh-hans
preferred label: casino og gambling @no-nb
definition: Affärsverksamhet som går ut på att erbjuda lokaler för spel där utgången helt eller huvudsakligen bestäms av slumpen. @se
definition: Das Geschäft mit dem Angebot von verschiedenen Glücksspielen, wie Kartenspiel, Würfel, Lotto, Toto, Pferdewetten. @de
definition: Organisations providing outlets for betting money on games of chance or animal races
definition: Negócio do jogo, desde as instalações para vários jogos de azar, usando cartas, dados, roletas, até apostas em corridas de animais. @pt-pt
definition: Virksomheden, der tilbyder hasardspil, enten online eller fysisk som i et casino. @dk
definition: 利用纸牌、骰子、旋转轮子赌动物等为各种机会游戏提供渠道的业务。 @zh-hans
in scheme: Media Topic
created: 2009-10-22T02:00:00+00:00
modified: 2023-03-31T12:00:00+00:00
broader: tourism and leisure industry

hotel and accommodation
type: Concept
preferred label: فنادق ومساكن @ar
preferred label: Hotell och logi @se
preferred label: Gastgewerbe @de
preferred label: Hôtellerie @fr
preferred label: Hoteles y alojamiento @es
preferred label: hotelaria e alojamentos @pt-pt
preferred label: hotel og indkvartering @dk
preferred label: 酒店和住宿 @zh-hans
preferred label: hotellbransjen @no-nb
definition: Affärsverksamhet som går ut på att erbjuda tak över huvudet och mat till resenärer. @se
definition: Angebot von Verpflegung und Unterkunft für Reisende @de
definition: The business of providing lodging to travellers
definition: Negócio que fornece comida e alojamento a viajantes. @pt-pt
definition: Virksomheden med at levere mad og husly til rejsende. @dk
definition: 为旅行者提供食物和住所的生意 @zh-hans
definition: The business of providing lodging to travelers
in scheme: Media Topic
created: 2009-10-22T02:00:00+00:00
modified: 2023-03-31T12:00:00+00:00
broader: tourism and leisure industry

recreational and sporting goods
type: Concept
preferred label: Sport- und Freizeitartikel @de
preferred label: Articles de sport et plein air @fr
preferred label: سلع ترفيهية ورياضية @ar
preferred label: Sport- och fritidsprodukter @se
preferred label: Artículos deportivos y de recreación @es
preferred label: produtos para desporto e lazer @pt-pt
preferred label: produtos para esporte e lazer @pt-br
preferred label: sports- og fritidsprodukt @dk
preferred label: 娱乐和体育用品 @zh-hans
preferred label: sports- og fritidsutstyr @no-nb
definition: Manufacture of goods for leisure activities
definition: Tillverkning av varor som används till fritidssysselsättningar. @se
definition: Herstellung von Waren für sportliche Freizeitaktivitäten @de
definition: Fabrico de bens para atividades de lazer. @pt-pt
definition: Fremstilling af varer, der bruges til fritidsaktiviteter. @dk
definition: 休闲用品制造 @zh-hans
in scheme: Media Topic
created: 2009-10-22T02:00:00+00:00
modified: 2021-02-18T12:00:00+00:00
broader: tourism and leisure industry

restaurant and catering
type: Concept
preferred label: Restaurantes y restauración @es
preferred label: Restaurang och catering @se
preferred label: Gaststronomie @de
preferred label: مطاعم وطبخ @ar
preferred label: Restaurants et traiteurs @fr
preferred label: restauração e catering @pt-pt
preferred label: restaurantes e catering @pt-br
preferred label: restaurant og catering @dk
preferred label: 饭店和餐饮 @zh-hans
definition: The business of providing prepared food for customers
definition: Das Geschäft, zubereitete Nahrung für größere und kleinere Kundenkreise anzubieten. @de
definition: Affärsverksamhet som går ut på att servera färdig mat till stora eller små grupper av kunder. @se
definition: Negócio do fornecimento de comida preparada para clientes em grupos grandes ou pequenos. @pt-pt
definition: Virksomhed, der sælger mad til store eller små grupper af kunder. @dk
definition: 为顾客提供熟食的生意 @zh-hans
in scheme: Media Topic
created: 2009-10-22T02:00:00+00:00
modified: 2023-03-31T12:00:00+00:00
broader: tourism and leisure industry

tour operator
type: Concept
preferred label: تنظيم رحلات @ar
preferred label: Researrangörer @se
preferred label: Operadores de turismo @es
preferred label: Voyagiste @fr
preferred label: Reiseveranstalter @de
preferred label: operadores turísticos @pt-pt
preferred label: rejsearrangør @dk
preferred label: 旅行社 @zh-hans
preferred label: turoperatør @no-nb
definition: Anbieter von Reisen, sowohl vor Ort, als auch in Städte oder in andere Länder @de
definition: Operators of trips either locally or internationally
definition: Företag som paketerar resor i form av transport, boende och aktiviteter. @se
definition: Operadores de viagens, seja localmente, seja em outros países. @pt-pt
definition: Virksomheder, der sælger rejser i form af transport, indkvartering og aktiviteter. @dk
definition: 安排本地（如城镇周围）或到其他国家旅行的公司 @zh-hans
in scheme: Media Topic
created: 2009-10-22T02:00:00+00:00
modified: 2023-03-31T12:00:00+00:00
broader: tourism and leisure industry

air transport
type: Concept
preferred label: Transporte aéreo @es
preferred label: Transport aérien @fr
preferred label: Flygtransport @se
preferred label: Luftverkehr @de
preferred label: نقل جوي @ar
preferred label: aviação @pt-pt
preferred label: lufttransport @dk
preferred label: 航空运输 @zh-hans
preferred label: luftfart @no-nb
definition: Aktivitäten um Flugzeuge und Flughäfen. @de
definition: The movement of passengers and freight by air
definition: Kommersiell förflyttning av folk eller varor med hjälp av flygplan. @se
definition: Operações de aviões e de aeroportos. @pt-pt
definition: Kommerciel bevægelse af mennesker eller varer med fly. @dk
definition: 飞机和机场运营 @zh-hans
in scheme: Media Topic
created: 2009-10-22T02:00:00+00:00
modified: 2023-03-31T12:00:00+00:00
broader: transport

railway transport
type: Concept
preferred label: Bahn @de
preferred label: Transporte ferroviario @es
preferred label: Järnvägstransport @se
preferred label: نقل بالقطارات @ar
preferred label: Transport ferroviaire @fr
preferred label: transporte ferroviário @pt-pt
preferred label: jernbanetransport @dk
preferred label: 铁路运输 @zh-hans
definition: Kommersiell förflyttning av folk eller varor med hjälp av tåg och och järnvägar. @se
definition: The movement of passengers and freight by rail
definition: Geschäft mit dem Transport von Menschen und Ware auf der Schiene. @de
definition: Negócio do transporte de pessoas ou carga por comboio. @pt-pt
definition: Negócio do transporte de pessoas ou carga por trem. @pt-br
definition: Bevægelse af mennesker eller varer med tog og jernbaner. @dk
definition: 客运和货运 @zh-hans
in scheme: Media Topic
created: 2009-10-22T02:00:00+00:00
modified: 2023-03-31T12:00:00+00:00
broader: transport

road transport
type: Concept
preferred label: Vägtransport @se
preferred label: Straßentransport @de
preferred label: Transporte carretero @es
preferred label: Transport routier @fr
preferred label: نقل طرقي @ar
preferred label: transporte rodoviário @pt-pt
preferred label: vejtransport @dk
preferred label: 公路运输 @zh-hans
preferred label: veitransport @no-nb
preferred label: vegtransport @no-nn
definition: Geschäft mit dem Transport von Waren durch LKWs und Straßen. @de
definition: Kommersiell förflyttning av varor med hjälp av lastbilar och vägar. @se
definition: The movement of passengers and freight by road
definition: Negócio do transporte de mercadorias por camião e autoestrada. @pt-pt
definition: Negócio do transporte de mercadorias por caminhão e rodovia. @pt-br
definition: Bevægelse af mennesker eller varer ved hjælp af lastbiler eller busser på vejnettet. @dk
definition: 货物运输和高速公路用卡车和公路运输货物的业务 @zh-hans
in scheme: Media Topic
created: 2009-10-22T02:00:00+00:00
modified: 2023-03-31T12:00:00+00:00
broader: transport

traffic
type: Concept
preferred label: Verkehrsbericht @de
preferred label: Tráfico @es
preferred label: حركة سير @ar
preferred label: Trafik @se
preferred label: Information routière @fr
preferred label: trânsito @pt-pt
preferred label: trafik @dk
preferred label: 交通 @zh-hans
preferred label: trafikk @no-nb
definition: Verkehrsberichte und/oder Warnhinweise @de
definition: Traffic reports and/or warnings
definition: Samtidig rörelse på begränsad yta av ett antal transportmedel längs särskilt inrättade färdvägar till lands, till sjöss eller i luften. @se
definition: Informações e/ou alertas sobre o trânsito. @pt-pt
definition: Trafikmeldinger. @dk
definition: 交通报告或警告 @zh-hans
in scheme: Media Topic
created: 2009-10-22T02:00:00+00:00
retired: 2023-03-31T12:00:00+00:00
modified: 2023-03-31T12:00:00+00:00
broader: transport

waterway and maritime transport
type: Concept
preferred label: Transport fluvial et maritime @fr
preferred label: Sjötransport @se
preferred label: Transporte fluvial y marítimo @es
preferred label: ممرات مائية ونقل بحري @ar
preferred label: Schifffahrt @de
preferred label: transporte marítimo e fluvial @pt-pt
preferred label: vandvej og søtransport @dk
preferred label: 水路和海运 @zh-hans
preferred label: skipsfart @no-nb
definition: Handelsbewegung von Menschen oder Waren mit Booten und Schiffen auf dem Wasserweg @de
definition: Commercial movement of people or goods via boats, ships and water
definition: Kommersiell förflyttning av folk eller varor med hjälp av båtar, skepp och vatten. @se
definition: Movimento comercial de pessoas ou bens através de barcos, navios e água. @pt-pt
definition: Kommerciel bevægelse af mennesker eller varer med båd, skib og vand. @dk
definition: 通过船只和水路进行人或货物的商业运输 @zh-hans
in scheme: Media Topic
created: 2009-10-22T02:00:00+00:00
modified: 2021-02-18T12:00:00+00:00
broader: transport

logistics
type: Concept
preferred label: Logistik @se
preferred label: logística @pt-pt
preferred label: logistik @dk
preferred label: 物流业 @zh-hans
preferred label: logistikk @no-nb
preferred label: Logistique @fr
preferred label: Logística @es
preferred label: لوجستية @ar
definition: Supply chain, inventory management and transportation of products.
definition: Materialflöde inom företag eller organisationer, vanligtvis med huvudsyftet att åstadkomma metoder för att rätt material skall finnas på rätt plats vid rätt tid. @se
definition: Gestão da cadeia de abastecimento, do inventário de stock e do transporte de produtos. @pt-pt
definition: Gestão da cadeia de abastecimento, do inventário de estoque e do transporte de produtos. @pt-br
definition: Forsyningskæde, lagerstyring og transport af produkter. @dk
definition: 供应链、库存管理、产品运输 @zh-hans
definition: Lieferkette, Bestandsverwaltung und Transport von Produkten. @de
in scheme: Media Topic
created: 2016-04-04T12:00:00+00:00
modified: 2023-03-31T12:00:00+00:00
broader: transport

public transport
type: Concept
preferred label: kollektivtransport @no-nn
preferred label: Kollektivtrafik @se
preferred label: Öffentliche Verkehrsmittel @de
definition: Forms of transportation, such as buses and trains, that charge set fares, run on fixed routes and are available to the general public
definition: Olika typer av transporter med exempelvis buss och tåg som går på bestämda linjer och tider och fasta priser. @se
definition: Verkehrsmittel wie Busse und Bahnen, die feste Fahrpreise verlangen, auf festen Strecken verkehren und für die Allgemeinheit zugänglich sind @de
in scheme: Media Topic
created: 2022-09-23T12:00:00+00:00
modified: 2022-09-23T12:00:00+00:00
broader: transport

taxi and ride-hailing
type: Concept
preferred label: taxi @no-nn
preferred label: Taxitjänster @se
preferred label: Taxi und Fahrdienst @de
definition: On-demand ride service, provided by taxi companies or tech companies such as Uber and Lyft, the drivers who transport passengers and the rules and regulations imposed upon these companies within a region
definition: Traditionella taxiföretag eller it-lösningar där personer kan betala för transporttjänster. @se
definition: Fahrdienste auf Abruf, die von Taxi- oder Technologieunternehmen wie Uber und Lyft angeboten werden, die Fahrer, die Fahrgäste befördern, und die Regeln und Vorschriften, die diesen Unternehmen in einer Region auferlegt werden @de
in scheme: Media Topic
created: 2022-09-23T12:00:00+00:00
modified: 2022-09-23T12:00:00+00:00
broader: transport

shared transport
type: Concept
preferred label: køyretøydeling @no-nn
preferred label: kjøretøydeling @no-nb
preferred label: Mobilitetspool @se
preferred label: gemeinsam genutzter Transport @de
definition: A network of vehicles, such as cars, bikes and scooters, that can be rented by travellers on an as-needed basis for short-term use
definition: A network of vehicles, such as cars, bikes and scooters, that can be rented by travelers on an as-needed basis for short-term use
definition: Nätverk av fordon som bilar, cyklar och elfordon som kan korttidshyras av medlemmar. @se
definition: Ein Netz von Fahrzeugen wie Autos, Fahrrädern und Motorrollern, die von Reisenden bei Bedarf für eine kurzfristige Nutzung gemietet werden können @de
in scheme: Media Topic
created: 2022-09-23T12:00:00+00:00
modified: 2022-09-23T12:00:00+00:00
broader: transport

commuting
type: Concept
preferred label: سفر @ar
preferred label: Transport quotidien @fr
preferred label: Pendelverkehr @de
preferred label: Pendling @se
preferred label: Transporte colectivo @es
preferred label: deslocação pendular @pt-pt
preferred label: migração pendular @pt-br
preferred label: pendling @dk
preferred label: 通勤 @zh-hans
definition: Regelbundna resor mellan bostad och arbetsplats, vanligen dagliga. @se
definition: Der Weg von und zur Arbeit, einschließlich Transportmöglichkeiten, Reisenetzwerke und Fahrgemeinschaften. @de
definition: The process of getting to and from work, including transport options, travel networks, car pooling.
definition: O processo de chegar ao ou vir do trabalho, incluindo opções de transporte, redes de transporte e partilha de carro. @pt-pt
definition: Regelmæssige ture mellem hjem og arbejdsplads, normalt dagligt. @dk
definition: 往返工作的过程，包括交通选择，行车线路，汽车共乘等 @zh-hans
in scheme: Media Topic
created: 2009-10-22T02:00:00+00:00
modified: 2021-02-18T12:00:00+00:00
broader: employment
broad match: http://cv.iptc.org/newscodes/subjectcode/10007000

economic trends and indicators
type: Concept
preferred label: Volkswirtschaft @de
preferred label: Macroeconomía @es
preferred label: Macro-économie @fr
preferred label: Makroekonomi @se
preferred label: اقتصادات كلية @ar
preferred label: macroeconomia @pt-pt
preferred label: makroøkonomi @dk
preferred label: 宏观经济 @zh-hans
definition: Storskaliga ekonomiska frågor på nationell eller högre nivå. @se
definition: The behaviour and performance of the economy as a whole
definition: Wirtschaftsraum auf nationaler oder internationaler Ebene @de
definition: Economia em grande escala, a nível mundial ou nacional. @pt-pt
definition: Større økonomiske spørgsmål på nationalt eller højere niveau. @dk
definition: 世界或国家层面上的广义经济学 @zh-hans
definition: The behavior and performance of the economy as a whole
in scheme: Media Topic
created: 2009-10-22T02:00:00+00:00
modified: 2024-03-28T12:00:00+00:00
broader: economy
narrower: bonds
narrower: budgets and budgeting
narrower: consumers
narrower: consumer confidence
narrower: credit and debt
narrower: deflation
narrower: economic growth
narrower: economic indicator
narrower: gross domestic product
narrower: industrial production
narrower: inventories
narrower: productivity
narrower: employment statistics
narrower: exporting
narrower: government aid
narrower: government debt
narrower: importing
narrower: inflation
narrower: investments
narrower: mortgages
narrower: prices
narrower: recession

central bank
type: Concept
preferred label: مصرف مركزي @ar
preferred label: Zentralbank @de
preferred label: Centralbanker @se
preferred label: Bancos centrales @es
preferred label: Banque centrale @fr
preferred label: banco central @pt-pt
preferred label: centralbank @dk
preferred label: 中央银行 @zh-hans
preferred label: sentralbank @no-nb
definition: A country's major bank that sets interest rates and provides transfer of funds between commercial banks
definition: Bank som utgör centrum för bankväsendet i ett land och har ansvar för sedelutgivningen, utlåningen till staten och andra banker med mera. @se
definition: Die größte Bank eines Landes, die den Zinssatz festlegt und den Austausch von Geldflüssen zwischen kommerziellen Banken steuert. @de
definition: O principal banco de um país, que fixa taxas de juro e transfere fundos entre bancos comerciais. @pt-pt
definition: En bank, der er centrum for banker i et land og er ansvarlig for at udstede pengesedler, udlån til staten og andre banker med mere. @dk
definition: 国家主要的银行，负责制定利率，并在商业银行之间提供资金转移 @zh-hans
in scheme: Media Topic
created: 2009-10-22T02:00:00+00:00
modified: 2024-03-28T12:00:00+00:00
broader: economy

currency
type: Concept
preferred label: Cours des devises @fr
preferred label: Währung @de
preferred label: قيمة عملة @ar
preferred label: Tipo de cambio @es
preferred label: Valutor @se
preferred label: valor cambial @pt-pt
preferred label: valutakurs @dk
preferred label: 汇率 @zh-hans
preferred label: valuta @no-nb
definition: Värdeförhållande mellan två valutor. @se
definition: The system of money used by a country, including the value of one currency as measured against another
definition: Der aktuelle Wert einer Währung im Verhältnis zu einer anderen @de
definition: Valor de uma moeda em comparação com outra. @pt-pt
definition: Værdiforhold mellem to valutaer. @dk
definition: 一种货币相对于另一种货币的价值 @zh-hans
definition: Eit lands mynteining. @no-nn
definition: Et lands myntenhet @no-nb
in scheme: Media Topic
created: 2009-10-22T02:00:00+00:00
modified: 2024-03-28T12:00:00+00:00
broader: economy
narrower: cryptocurrency

economic organisation
type: Concept
preferred label: تنظيم اقتصادي @ar
preferred label: Organizaciones económicas @es
preferred label: Branschorganisationer @se
preferred label: Organisation économique @fr
preferred label: Private Wirtschaftsorganisation @de
preferred label: associações empresariais @pt-pt
preferred label: økonomisk interesseorganisation @dk
preferred label: 经济组织 @zh-hans
preferred label: næringsorganisasjon @no-nb
preferred label: economic organization
preferred label: økonomiorganisasjon @no-nn
definition: Business, industrial and trade associations, societies and other private-sector groups
definition: Wirtschafts-, Industrie- und Handelsunternehmen, Gesellschaften oder andere Gruppen auf dem privaten Sektor @de
definition: En intresseförening för företag i en viss bransch. @se
definition: Associações empresariais, industriais e comerciais, sociedades e outros grupos do setor privado. @pt-pt
definition: En sammenslutning af interesser for virksomheder i en bestemt branche. @dk
definition: 商业、工业和贸易协会及其他社会和民间经济组织 @zh-hans
in scheme: Media Topic
created: 2009-10-22T02:00:00+00:00
modified: 2024-03-28T12:00:00+00:00
broader: economy

emerging market
type: Concept
preferred label: Tillväxtmarknad @se
preferred label: Mercados emergentes @es
preferred label: اسواق ناشئة @ar
preferred label: Marché des pays émergents @fr
preferred label: Schwellenland @de
preferred label: mercados emergentes @pt-pt
preferred label: vækstøkonomier @dk
preferred label: 新兴市场 @zh-hans
preferred label: framvoksende marked @no-nb
preferred label: framveksande marknad @no-nn
definition: Marknader som representeras av utvecklingsländer, som strävar efter att bli en del av den globala ekonomin och som ibland behöver hjälp av internationella långivare. @se
definition: Die Märkte die kämpfen, um den weltweiten Wirtschaftsmarkt zu erreichen und die finanzielle Hilfe fordern von internationalen Kreditgebern @de
definition: Economies of developing nations that are growing and becoming more engaged with global markets
definition: Mercados que lutam para entrar nas economias mundiais e aqueles que requerem ajuda financeira de credores internacionais. @pt-pt
definition: De markeder, der kæmper for at komme ind i verdensøkonomierne, og dem, der kræver økonomisk hjælp fra internationale långivere. @dk
definition: 那些正在努力进入世界经济的市场，以及那些需要国际贷款机构提供金融援助的市场 @zh-hans
in scheme: Media Topic
created: 2009-10-22T02:00:00+00:00
modified: 2024-03-28T12:00:00+00:00
broader: economy

international economic institution
type: Concept
preferred label: Internationella ekonomiska organisationer @se
preferred label: Institution économique internationale @fr
preferred label: مؤسسة اقتصادية دولية @ar
preferred label: Instituciones económicas internacionales @es
preferred label: Internationale Wirtschaftsorganisation @de
preferred label: instituições económicas internacionais @pt-pt
preferred label: instituições econômicas internacionais @pt-br
preferred label: international økonomisk organisation @dk
preferred label: 国际经济机构 @zh-hans
preferred label: internasjonalt økonomisk organ @no-nb
definition: Entiteter såsom Världsbanken, WTO och Unido, som verkar på en global nivå. @se
definition: Organisationen wie UNIDO, Weltbank, WTO, etc. Die auf internationaler Ebene handeln @de
definition: Global institutions working in the domain of international economic cooperation and stability, such as the International Monetary Fund, UNIDO, World Bank and World Trade Organization
definition: Entidades como a Organização das Nações Unidas para o Desenvolvimento Industrial, o Banco Mundial, a Organização Mundial de Comércio, o Import-Export Bank, etc. @pt-pt
definition: Entidades como a Organização das Nações Unidas para o Desenvolvimento Industrial, o Banco Mundial, a Organização Mundial de Comércio, o Import-Export Bank etc. @pt-br
definition: Enheder som Verdensbanken, WTO og Unido, der opererer på globalt plan. @dk
definition: 联合国工业发展组织、世界银行、世界贸易组织、进出口银行等这类在国际范围开展业务的实体 @zh-hans
in scheme: Media Topic
created: 2009-10-22T02:00:00+00:00
modified: 2024-07-01T12:00:00+00:00
broader: economy

international trade
type: Concept
preferred label: Comercio internacional @es
preferred label: تجارة دولية @ar
preferred label: Commerce international @fr
preferred label: Welthandel @de
preferred label: Internationell handel @se
preferred label: comércio externo @pt-pt
preferred label: international handel @dk
preferred label: 国际贸易 @zh-hans
preferred label: internasjonal handel @no-nb
definition: Handel von Gütern und Dienstleistungen zwischen Ländern @de
definition: Trade of goods and services between nations
definition: Handel med varor och tjänster mellan länder. @se
definition: Comércio de bens e serviços entre nações. @pt-pt
definition: Handel med varer og tjenester mellem lande. @dk
definition: 国家间货物和服务贸易 @zh-hans
in scheme: Media Topic
created: 2009-10-22T02:00:00+00:00
modified: 2024-03-28T12:00:00+00:00
broader: economy
narrower: trade agreements
narrower: balance of trade
narrower: trade dispute
narrower: trade policy
narrower: tariff

monetary policy
type: Concept
preferred label: Politique monétaire @fr
preferred label: Penningpolitik @se
preferred label: Política monetaria y fiscal @es
preferred label: Geld- und Finanzpolitik @de
preferred label: عملة وسياسة نقدية @ar
preferred label: política monetária @pt-pt
preferred label: pengepolitik @dk
preferred label: 货币政策 @zh-hans
preferred label: pengepolitikk @no-nb
definition: Durch die Regierungsbank (Bundesbank) gesteuerte Politik über die Höhe des sich im Umlauf befindenden Geldes und die Zinsraten zu denen es verliehen wird. @de
definition: Statliga åtgärder för reglering av penningväsendet och kreditmarknaden i ett land, särskilt genom centralbanken. @se
definition: Government bank directed policy on the amount of money in circulation and the rate at which it can be loaned
definition: Política monetária governamental sobre a quantidade de dinheiro em circulação e a taxa de juro a que pode ser emprestado. @pt-pt
definition: Statslige foranstaltninger til regulering af det monetære system og kreditmarkedet i et land, især gennem centralbanken. @dk
definition: 由政府银行主导的货币流通量和贷款利率政策 @zh-hans
in scheme: Media Topic
created: 2009-10-22T02:00:00+00:00
modified: 2024-03-28T12:00:00+00:00
broader: economy
narrower: interest rates

mutual funds
type: Concept
preferred label: Fonds communs de placement @fr
preferred label: Fondos mutuales @es
preferred label: صناديق استثمار @ar
preferred label: Investmentfond @de
preferred label: Fonder @se
preferred label: fundos de investimento @pt-pt
preferred label: fond @dk
preferred label: 共同基金 @zh-hans
definition: Pools von Anteilen oder festverzinslichen Wertpapieren zum Verkauf, oft gesammelt mit Investitionsabsicht in Wachstum, Einkommen oder Sicherheit @de
definition: Pools of shares or bonds for sale often grouped by investment intention, such as growth, income or security
definition: En samling värdepapper, ofta kallad för portfölj, som ägs av många människor tillsammans, vilka är andelsägare och som kan bestå av olika typer av aktie- eller räntebaserade värdepapper. @se
definition: Fundo de ações ou obrigações para venda agrupadas por intenção de investimento, tal como crescimento de rendimento ou segurança. @pt-pt
definition: En samling af værdipapirer, ofte benævnt en portefølje, der ejes af mange mennesker sammen, der er medejere, og som kan bestå af forskellige typer aktie- eller rente-baserede værdipapirer. @dk
definition: 出售的股票或债券的集合，通常按投资意图（如增长、收入或证券）分组 @zh-hans
in scheme: Media Topic
created: 2009-10-22T02:00:00+00:00
modified: 2024-03-28T12:00:00+00:00
broader: economy

sharing economy
type: Concept
preferred label: Delningsekonomi @se
preferred label: economia de partilha @pt-pt
preferred label: economia colaborativa @pt-br
preferred label: deleøkonomi @dk
preferred label: 共享经济 @zh-hans
preferred label: delingsøkonomi @no-nb
preferred label: gemeinsame Wirtschaft @de
preferred label: Économie du partage @fr
preferred label: Economía colaborativa @es
preferred label: اقتصاد المشاركة @ar
definition: Peer-to-peer-based sharing of access to goods and services
definition: Aktiviteter som syftar till minskad resursåtgång genom effektivare kapacitetsutnyttjande såsom delning av tillgång till varor och tjänster. @se
definition: Acesso a bens e serviços em redes colaborativas. @pt-pt
definition: Aktiviteter, der sigter mod at reducere ressourceforbruget gennem en mere effektiv kapacitetsudnyttelse, såsom deling af adgangen til varer og tjenester. @dk
definition: 基于点对点的商品和服务共享 @zh-hans
definition: Peer-to-Peer-basierte gemeinsame Nutzung des Zugangs zu Gütern und Dienstleistungen. @de
in scheme: Media Topic
created: 2016-04-04T12:00:00+00:00
modified: 2024-03-28T12:00:00+00:00
broader: economy

economic policy
type: Concept
preferred label: Ekonomisk politik @se
preferred label: Wirtschaftspolitik @de
preferred label: سياسة اقتصادية @ar
preferred label: Politique économique @fr
preferred label: Política económica @es
preferred label: política económica @pt-pt
preferred label: política econômica @pt-br
preferred label: økonomisk politik @dk
preferred label: 经济政策 @zh-hans
preferred label: økonomisk politikk @no-nb
definition: Regierungsgesteuerte Politik in Bezug auf die Produktionen, Steuern, Tarife und alles, was mit der Ausrichtung und Gesundheit der Wirtschaft zusammenhängt @de
definition: Government-directed policy on the economy including, production, taxes and tariffs
definition: Åtgärder från i första hand statens sida inriktade på att påverka förhållanden i ekonomin. @se
definition: Política governamental relativamente à produção, impostos, tarifas e outros assuntos que afetem a direção e saúde da economia. @pt-pt
definition: Foranstaltninger, en offentlig myndighed benytter til at regulere den økonomiske adfærd i et samfund. @dk
definition: 政府对生产、税收、关税以及影响经济发展方向和健康的因素制定政策 @zh-hans
in scheme: Media Topic
created: 2009-10-22T02:00:00+00:00
modified: 2025-03-31T12:00:00+00:00
broader: government policy
narrower: nationalisation
narrower: privatisation
narrower: state-owned enterprise
narrower: economic development incentive

nationalisation
type: Concept
preferred label: Nacionalización @es
preferred label: Förstatligande @se
preferred label: تأميم @ar
preferred label: Verstaatlichung @de
preferred label: Nationalisation @fr
preferred label: nacionalização @pt-pt
preferred label: nationalisering @dk
preferred label: 国有化 @zh-hans
preferred label: nasjonalisering @no-nb
preferred label: nationalization
definition: State takeover of private organisations or properties
definition: Överföring av privat verksamhet eller egendom till staten. @se
definition: Übernahme von privaten Unternehmen oder Eigentum durch den Staat. @de
definition: Tomada de posse por parte do estado de empresas ou propriedades privadas. @pt-pt
definition: Statslig overtagelse af private virksomheder eller ejendomme. @dk
definition: 国家接管私人公司或财产 @zh-hans
definition: State takeover of private organizations or properties
in scheme: Media Topic
created: 2009-10-22T02:00:00+00:00
modified: 2025-03-31T12:00:00+00:00
broader: economic policy

privatisation
type: Concept
preferred label: Privatisierung @de
preferred label: خصخصة @ar
preferred label: Privatización @es
preferred label: Privatisations @fr
preferred label: Privatisering @se
preferred label: privatização @pt-pt
preferred label: privatisering @dk
preferred label: 私有化 @zh-hans
preferred label: privatization
definition: Överföring av offentlig verksamhet till privat ägo. @se
definition: Private Übernahme von staatlichen Unternehmen oder Staatseigentum. @de
definition: The transfer of state-owned organisations or properties to private owners
definition: Transferência de empresas ou propriedades do estado para proprietários ou empresas privados. @pt-pt
definition: Overførsel af statsejede virksomheder, ejendomme eller aktiviteter til private ejere. @dk
definition: 将国有企业或财产转让给私人所有人 @zh-hans
definition: The transfer of state-owned organizations or properties to private owners
in scheme: Media Topic
created: 2009-10-22T02:00:00+00:00
modified: 2025-03-31T12:00:00+00:00
broader: economic policy

state-owned enterprise
type: Concept
preferred label: شركة مملوكة للحكومة @ar
preferred label: Entreprise d'Etat @fr
preferred label: Staatseigentum @de
preferred label: Empresas estatales @es
preferred label: Statligt ägda företag @se
preferred label: empresas estatais @pt-pt
preferred label: empresa estatal @pt-br
preferred label: statsejet virksomhed @dk
preferred label: 国有企业 @zh-hans
preferred label: statlig selskap @no-nb
preferred label: statleg selskap @no-nn
definition: Die Regierung als Besitzer von Firmen, komplett oder in Teilen @de
definition: Företag som ägs eller delägs av staten. @se
definition: Enterprises owned partially or completely by the government
definition: O governo como proprietário de empresas, com capital exclusivo ou parcial do estado. @pt-pt
definition: Virksomheder som ejes af staten og agerer på et marked på markedsvilkår. @dk
definition: 政府作为公司的所有者，不论是完全的还是部分的 @zh-hans
in scheme: Media Topic
created: 2009-10-22T02:00:00+00:00
modified: 2025-03-31T12:00:00+00:00
broader: economic policy
broad match: http://cv.iptc.org/newscodes/subjectcode/04017001

economic development incentive
type: Concept
preferred label: Utvecklingsstöd @se
preferred label: statsstøtte @no-nb
preferred label: incentivo ao desenvolvimento económico @pt-pt
preferred label: incentivo ao desenvolvimento econômico @pt-br
preferred label: 经济发展刺激 @zh-hans
preferred label: Anreiz zur wirtschaftlichen Entwicklung @de
preferred label: Aide publique @fr
preferred label: Incentivo de desarrollo económico @es
preferred label: حوافز التنمية الاقتصادية @ar
definition: The offer of funds, financial incentive programmes or subsidies to stimulate businesses and the economy
definition: Olika program och ekonomiskt stöd för att stimulera ekonomi och företagsamhet inom olika områden. @se
definition: Financiamento, programas de incentivos financeiros e subsídios para estimular empresas e partes da economia. @pt-pt
definition: Statslige finansielle programmer der skal stimulere erhvervsliv og andre dele af økonomien @dk
definition: 用于刺激商业和部分经济的资金、金融刺激项目或补贴 @zh-hans
definition: Finanzierung, finanzielle Anreizprogramme und Subventionen zur Stimulierung von Unternehmen und Teilen der Wirtschaft @de
in scheme: Media Topic
created: 2020-08-05T12:00:00+00:00
modified: 2025-03-31T12:00:00+00:00
broader: economic policy

bonds
type: Concept
preferred label: Anleihe @de
preferred label: سندات @ar
preferred label: Bonos @es
preferred label: Obligationer @se
preferred label: Obligations @fr
preferred label: obrigações @pt-pt
preferred label: obligation @dk
preferred label: 债券 @zh-hans
preferred label: obligasjon @no-nb
definition: Corporate or governmental paper representing the loan of money at a fixed rate and for a fixed time to that company or government
definition: Firmen- oder Regierungspapier, das die Leihgabe von Geld zu einem festgelegten Preis und Zeitraum für diese Firma oder Regierung auszeichnet. @de
definition: Köp- och säljbar skuldförbindelse som utgör del av större lån och som löses in till visst belopp då lånet förfaller. @se
definition: Documento empresarial ou governamental que representa o empréstimo de dinheiro, a uma taxa de juro fixa e por determinado período de tempo, a uma empresa ou governo. @pt-pt
definition: Virksomheds- eller statsdokument, der repræsenterer lånet af penge til en fast rente og i en fast tid til det pågældende firma eller stat. @dk
definition: 包括政府和企业发行的债券，债券认购人以固定利率向发债公司或政府提供一定期限的贷款 @zh-hans
definition: Verdipapir som er ferda ut som ein stats eller bedrifts gjeldsforplikting til ei oppgitt rente. @no-nn
definition: Verdipapir utstedt som en stats eller bedrifts gjeldsforpliktelse til en anigtt rente. @no-nb
change note: Retired. Use medtop:medtop:20001376 corporate bond or medtop:20000368 government debt for government debt bonds.
in scheme: Media Topic
created: 2009-10-22T02:00:00+00:00
retired: 2024-03-28T12:00:00+00:00
modified: 2024-03-28T12:00:00+00:00
broader: economic trends and indicators

budgets and budgeting
type: Concept
preferred label: Haushalt @de
preferred label: Budget @fr
preferred label: Budget och budgetarbete @se
preferred label: ميزانيات ورسم ميزانيات @ar
preferred label: Presupuesto @es
preferred label: orçamento @pt-pt
preferred label: budget og budgettering @dk
preferred label: 预算 @zh-hans
preferred label: budsjett @no-nb
definition: A method of balancing revenues against expenses
definition: Methode das Gleichgewicht zwischen Einnahmen und Ausgaben auszubalancieren @de
definition: En beräkning i förväg av alla inkomster och utgifter. @se
definition: Método de equilibrar receitas e despesas. @pt-pt
definition: En beregning på forhånd af alle indtægter og udgifter. @dk
definition: 平衡收支的一种方法 @zh-hans
change note: Retired. Use medtop:20000607 government budget or medtop:20000287 personal finance and investment instead.
in scheme: Media Topic
created: 2009-10-22T02:00:00+00:00
retired: 2024-03-28T12:00:00+00:00
modified: 2024-03-28T12:00:00+00:00
broader: economic trends and indicators

consumers
type: Concept
preferred label: Kunde @de
preferred label: Konsumenter @se
preferred label: Consommation @fr
preferred label: مستهلكون @ar
preferred label: Consumidores @es
preferred label: consumidores @pt-pt
preferred label: forbruger @dk
preferred label: 消费者 @zh-hans
preferred label: forbruker @no-nb
preferred label: forbrukar @no-nn
definition: Käufer von Waren und Dienstleistungen @de
definition: Buyers of goods and services
definition: Köpare av varor och tjänster. @se
definition: Comprador de bens e serviços. @pt-pt
definition: Købere af varer og tjenester. @dk
definition: 商品和服务的购买者 @zh-hans
change note: Retired. Use medtop:20000352 consumer confidence, medtop:20000243 consumer goods or medtop:20000284 market trend instead.
in scheme: Media Topic
created: 2009-10-22T02:00:00+00:00
retired: 2024-03-28T12:00:00+00:00
modified: 2024-03-28T12:00:00+00:00
broader: economic trends and indicators
narrower: consumer issue

consumer confidence
type: Concept
preferred label: Konsumentförtroende @se
preferred label: ثقة المستهلك @ar
preferred label: Verbraucherschutz @de
preferred label: Confianza del consumidor @es
preferred label: Confiance des consommateurs @fr
preferred label: confiança do consumidor @pt-pt
preferred label: forbrugertillid @dk
preferred label: 消费者信心 @zh-hans
preferred label: forbrukertillit @no-nb
preferred label: forbrukartillit @no-nn
definition: A measure of consumers' feelings about current and future economic conditions, including prices, inflation and the quality of retail goods, used as an indicator of the overall state of the economy
definition: Sicherung der Zufriedenheit der Verbraucher @de
definition: Kunders företroende för den aktuella ekonomiska situationen. @se
definition: A confiança do consumidor na economia. @pt-pt
definition: Kundernes tillid til den aktuelle økonomiske situation. @dk
definition: 消费者对经济的信心 @zh-hans
in scheme: Media Topic
created: 2009-10-22T02:00:00+00:00
modified: 2024-03-28T12:00:00+00:00
broader: economic trends and indicators

credit and debt
type: Concept
preferred label: Crédito y débito @es
preferred label: ائتمان ودين @ar
preferred label: Krediter och skulder @se
preferred label: Crédit et endettement @fr
preferred label: Kredit- und Schuldensumme @de
preferred label: crédito e dívida @pt-pt
preferred label: kredit og gæld @dk
preferred label: 信用和债务 @zh-hans
preferred label: kreditt og gjeld @no-nb
definition: Ekonomisk tillgång som får disponeras mot räntekostnader och penningsumma, som man är skyldig att betala tillbaka. @se
definition: Kredit: Geldmenge, die jemandem zur Verfügung steht, meistens als Leihgabe. Schulden: Geldmenge, die jemand schuldig ist. @de
definition: Credit: the amount of money available to you, often by loan. Debt: the amount you owe.
definition: Crédito: dinheiro disponível, geralmente por empréstimo. Dívida: dinheiro devido. @pt-pt
definition: Kredit, det beløb du har til rådighed, ofte ved lån. Gæld, det beløb, du skylder. @dk
definition: 信用：通常指通过贷款可用的金额。债务:所欠的金额 @zh-hans
change note: Retired. Use medtop:20000368 government debt, medtop:20000390 debt market or medtop:20000287 personal finance and investment instead.
in scheme: Media Topic
created: 2009-10-22T02:00:00+00:00
retired: 2024-03-28T12:00:00+00:00
modified: 2024-03-28T12:00:00+00:00
broader: economic trends and indicators

deflation
type: Concept
preferred label: Deflación @es
preferred label: Déflation @fr
preferred label: Deflation @se
preferred label: انكماش @ar
preferred label: deflação @pt-pt
preferred label: 通货紧缩 @zh-hans
preferred label: deflasjon @no-nb
definition: Priserna på varor och tjänster sjunker eller handeln minskar. @se
definition: The decrease in the general price level of goods and services within an economy
definition: Senkung der Preise @de
definition: Queda dos preços. @pt-pt
definition: Priserne på varer og tjenester falder eller handelen falder. @dk
definition: 价格下跌 @zh-hans
in scheme: Media Topic
created: 2009-10-22T02:00:00+00:00
modified: 2024-03-28T12:00:00+00:00
broader: economic trends and indicators
broad match: http://cv.iptc.org/newscodes/subjectcode/04008016

economic growth
type: Concept
preferred label: Croissance économique @fr
preferred label: Wachstum @de
preferred label: Crecimiento @es
preferred label: Ekonomisk tillväxt @se
preferred label: نمو اقتصادي @ar
preferred label: crescimento económico @pt-pt
preferred label: crescimento econômico @pt-br
preferred label: økonomisk vækst @dk
preferred label: 经济增长 @zh-hans
preferred label: økonomisk vekst @no-nb
definition: Ansteigen des BIP @de
definition: An increase of the gross domestic product (GDP)
definition: Ökning över tiden av produktionen av varor och tjänster i ett land, bruttonationalprodukten (BNP). @se
definition: Aumento do PIB. @pt-pt
definition: Stigning over tid i produktionen af varer og tjenester i et land, bruttonationalproduktet (BNP). @dk
definition: GDP增长 @zh-hans
in scheme: Media Topic
created: 2009-10-22T02:00:00+00:00
modified: 2024-03-28T12:00:00+00:00
broader: economic trends and indicators
broad match: http://cv.iptc.org/newscodes/subjectcode/04000000

economic indicator
type: Concept
preferred label: Indicateur économique @fr
preferred label: Indicadores económicos @es
preferred label: Konjunktur @de
preferred label: Ekonomiska indikatorer @se
preferred label: مؤشر اقتصادي @ar
preferred label: indicadores económicos @pt-pt
preferred label: indicadores econômicos @pt-br
preferred label: økonomisk indikator @dk
preferred label: 经济指标 @zh-hans
definition: Verschiedene Indizes, wie Warenbestände von Unternehmen, Preisbewegungen, die anzeigen, ob die Wirtschaftslage sich verbessert oder verschlechtert @de
definition: Certain indexes, such as company inventories, the movement of prices that show whether the economy is improving or declining
definition: Specifika index, t ex lagersaldon och prisindex, som visar om ekonomin förbättras eller försämras. @se
definition: Certos índices, tais como inventários, movimento dos preços, que indicam se a economia melhora ou piora. @pt-pt
definition: Specifikke indekser, såsom aktiebalancer og prisindeks, der viser, om økonomien forbedres eller forværres. @dk
definition: 反映经济是好转还是衰退的某些指标，如公司库存、价格变动 @zh-hans
change note: Retired. Use medtop:20000346 economic trends and indicators instead.
in scheme: Media Topic
created: 2009-10-22T02:00:00+00:00
retired: 2024-03-28T12:00:00+00:00
modified: 2024-03-28T12:00:00+00:00
broader: economic trends and indicators

gross domestic product
type: Concept
preferred label: Bruttonationalprodukt @se
preferred label: Produit intérieur brut @fr
preferred label: اجمالي الناتج الداخلي @ar
preferred label: Bruttoinlandsprodukt @de
preferred label: Producto Interno Bruto @es
preferred label: produto interno bruto @pt-pt
preferred label: bruttonationalprodukt (bnp) @dk
preferred label: 国内生产总值 @zh-hans
preferred label: bruttonasjonalprodukt @no-nb
definition: A measure of a region's economic performance, commonly abbreviated as GDP
definition: Messlatte des Ökonomischen Zustands einer Region, deutsch: BIP englisch: GDP @de
definition: Värdet av alla de varor och tjänster som framställs i ett land under ett år. @se
definition: Indicador económico do valor monetário da produção num território, comummente abreviado como PIB. @pt-pt
definition: Indicador econômico do valor monetário da produção em um território, comumente abreviado como PIB. @pt-br
definition: Værdien af alle varer og tjenester, der er produceret i et land i et år. @dk
definition: 衡量一个地区经济表现的指标，通常缩写为GDP @zh-hans
in scheme: Media Topic
created: 2009-10-22T02:00:00+00:00
modified: 2024-03-28T12:00:00+00:00
broader: economic trends and indicators
broad match: http://cv.iptc.org/newscodes/subjectcode/04000000

industrial production
type: Concept
preferred label: انتاج صناعي @ar
preferred label: Production industrielle @fr
preferred label: Industriproduktion @se
preferred label: Industrieproduktion @de
preferred label: Producción industrial @es
preferred label: produção industrial @pt-pt
preferred label: industriproduktion @dk
preferred label: 工业生产 @zh-hans
preferred label: industriproduksjon @no-nb
definition: Manufacture of durable and non-durable goods
definition: Industriell framställning av föremål. @se
definition: Produktion von nachhaltigen und kurzlebigen Produkten @de
definition: Fabrico de bens duradouros e não-duradouros. @pt-pt
definition: Fabrico de bens duráveis e não duráveis. @pt-br
definition: Industriel fremstilling af genstande. @dk
definition: 耐久和非耐久产品的生产 @zh-hans
in scheme: Media Topic
created: 2009-10-22T02:00:00+00:00
modified: 2024-03-28T12:00:00+00:00
broader: economic trends and indicators

inventories
type: Concept
preferred label: Lagerstatus @se
preferred label: Inventur @de
preferred label: جردة @ar
preferred label: Stocks @fr
preferred label: Inventarios @es
preferred label: inventários @pt-pt
preferred label: lagerbeholdning @dk
preferred label: 库存 @zh-hans
preferred label: lagerbehaldning @no-nn
definition: Goods not sold and held by the producer, wholesaler or retailer
definition: Varor som inte har sålts utan förvaras av producent, grossist eller återförsäljare. @se
definition: Unverkaufte Güter, die von Produktionsfirmen, Warenhäusern und Einzelhändlern zurückbehalten wurden @de
definition: Bens que não foram vendidos e que permanecem no produtor, grossista ou retalhista. @pt-pt
definition: Bens que não foram vendidos e que permanecem no produtor, atacadista ou varejista. @pt-br
definition: Varer, der ikke er solgt, men opbevares af producenten, grossisten eller forhandleren. @dk
definition: 生产者、批发商、零售商未销售或持有的货物 @zh-hans
in scheme: Media Topic
created: 2009-10-22T02:00:00+00:00
modified: 2024-03-28T12:00:00+00:00
broader: economic trends and indicators

productivity
type: Concept
preferred label: Produktivität @de
preferred label: Produktivitet @se
preferred label: Productividad @es
preferred label: انتاجية @ar
preferred label: Productivité @fr
preferred label: produtividade @pt-pt
preferred label: produktivitet @dk
preferred label: 生产能力 @zh-hans
definition: A measure of output from production or service
definition: Messlatte für die Produktion von Gütern oder Dienstleistungen @de
definition: Förhållandet mellan erhållet resultat och insatta resurser vid industriell produktion. @se
definition: Custo de produção de um item de valor, geralmente medido como o rendimento por hora e por pessoa. @pt-pt
definition: Forholdet mellem det opnåede resultat og de ressourcer, der er investeret i industriel produktion. @dk
definition: 度量生产和服务产出 @zh-hans
in scheme: Media Topic
created: 2009-10-22T02:00:00+00:00
modified: 2024-03-28T12:00:00+00:00
broader: economic trends and indicators

employment statistics
type: Concept
preferred label: Arbetsmarknadsstatistik @se
preferred label: احصاءات قطاع الوظائف @ar
preferred label: Statistiques de l'emploi @fr
preferred label: Estadísticas de empleo @es
preferred label: Arbeitsstatistik @de
preferred label: estatísticas de emprego @pt-pt
preferred label: beskæftigelsesstatistik @dk
preferred label: 就业统计 @zh-hans
preferred label: sysselsettingsstatistikk @no-nb
preferred label: sysselsetjingsstatistikk @no-nn
definition: Statistiken über Beschäftigung @de
definition: Statistik som beskriver den nationella arbetsmarknaden. @se
definition: Trends and statistics about areas such as job growth, unemployment and wage growth
definition: Estatísticas sobre o emprego. @pt-pt
definition: Statistik om beskæftigelse. @dk
definition: 关于就业的统计数据 @zh-hans
in scheme: Media Topic
created: 2009-10-22T02:00:00+00:00
modified: 2024-03-28T12:00:00+00:00
broader: economic trends and indicators
broad match: http://cv.iptc.org/newscodes/subjectcode/04008000

exporting
type: Concept
preferred label: Export @de
preferred label: Exportaciones @es
preferred label: Exportations @fr
preferred label: صادرات @ar
preferred label: exportações @pt-pt
preferred label: eksport @dk
preferred label: 出口 @zh-hans
definition: Alles was im eigenen Land hergestellt und produziert und überallhin verkauft und versendet wird @de
definition: The producing of manufacturing of goods by a country to be sold elsewhere
definition: Organiserad utförsel av varor eller tjänster från det egna landet till utlandet. @se
definition: Aquilo que é produzido ou manufaturado num país e é enviado para fora para ser vendido. @pt-pt
definition: Aquilo que é produzido ou manufaturado em um país e é enviado para fora para ser vendido. @pt-br
definition: Hvad der er produceret eller fremstillet i eet land og sendt og solgt i et andet land. @dk
definition: 在本国生产或制造并被送往其他国家销售的（产品或服务） @zh-hans
in scheme: Media Topic
created: 2009-10-22T02:00:00+00:00
modified: 2024-03-28T12:00:00+00:00
broader: economic trends and indicators

government aid
type: Concept
preferred label: مساعدات حكومية @ar
preferred label: Subvention @de
preferred label: Aide publique @fr
preferred label: Ayuda estatal @es
preferred label: Statligt bistånd @se
preferred label: ajuda governamental @pt-pt
preferred label: udviklingsbistand @dk
preferred label: 政府援助 @zh-hans
preferred label: stat-til-stat-bistand @no-nb
definition: Finanzielle und andere Unterstützung durch eine Regierung, in der Regel Unterstützung einer anderen Regierung. @de
definition: Supply of financial and other help by one government, usually to another
definition: Överföring av resurser till fattiga länder på förmånliga villkor med syftet att bidra till utveckling. @se
definition: Fornecimento de ajuda financeira ou de outro tipo de um governo, geralmente a outro governo. @pt-pt
definition: Overførsel af ressourcer til fattige lande på gunstige vilkår med det formål at bidrage til udvikling. @dk
definition: 由政府提供的财政和其他帮助，通常是向另一个政府 @zh-hans
change note: Retired. Use medtop:20000643 foreign aid instead.
in scheme: Media Topic
created: 2009-10-22T02:00:00+00:00
retired: 2024-03-28T12:00:00+00:00
modified: 2024-03-28T12:00:00+00:00
broader: economic trends and indicators

government debt
type: Concept
preferred label: Dette publique @fr
preferred label: Staatsverschuldung @de
preferred label: ديون حكومية @ar
preferred label: Statsskuld @se
preferred label: Deuda pública @es
preferred label: dívida pública @pt-pt
preferred label: statsgæld @dk
preferred label: 政府债务 @zh-hans
preferred label: statsgjeld @no-nb
definition: De pengar som staten är skyldig till exempel andra länder. @se
definition: Debt incurred when a country borrows funds to pay for public services and projects that it cannot afford based on the amount of taxes it has raised
definition: Die Menge, die eine Regierung an festverzinslichen Wertpapieren, Dienstleistungen und Waren schuldet und Leistungen für die sie kein Bargeld zahlen kann @de
definition: Quantia que um governo deve em obrigações, serviços ou bens pelos quais não existe dinheiro efetivo. @pt-pt
definition: De penge, som staten skylder, for eksempel til andre lande. @dk
definition: 政府所欠债券、服务以及没有现款购买的商品和服务的总额 @zh-hans
in scheme: Media Topic
created: 2009-10-22T02:00:00+00:00
modified: 2024-03-28T12:00:00+00:00
broader: economic trends and indicators

importing
type: Concept
preferred label: Importaciones @es
preferred label: واردات @ar
preferred label: Import @se
preferred label: Importations @fr
preferred label: importações @pt-pt
preferred label: import @dk
preferred label: 进口 @zh-hans
definition: Alles was im Ausland erworben und zum Wiederverkauf ins Land gebraucht wurde @de
definition: A country bringing in goods that were produced or manufactured elsewhere
definition: Organiserad införsel av varor från utlandet till det egna landet. @se
definition: Aquilo que é comprado no estrangeiro e que é trazido para um país para ser revendido. @pt-pt
definition: Organiseret import af varer fra udlandet til eget land. @dk
definition: 在国外购买并带到国内转售的（产品或服务） @zh-hans
in scheme: Media Topic
created: 2009-10-22T02:00:00+00:00
modified: 2024-03-28T12:00:00+00:00
broader: economic trends and indicators

inflation
type: Concept
preferred label: تضخم @ar
preferred label: Inflation @fr
preferred label: Inflación @es
preferred label: inflação @pt-pt
preferred label: 通货膨胀 @zh-hans
preferred label: inflasjon @no-nb
definition: The overall increase in prices and cost of living throughout an economy
definition: Preissteigerung @de
definition: Ekonomisk utveckling som yttrar sig i fortlöpande allmän höjning av prisnivån och därmed försämring av penningvärdet. @se
definition: Subida dos preços. @pt-pt
definition: Økonomisk udvikling, der manifesterer sig i den kontinuerlige generelle stigning i prisniveauet og dermed forringelsen af den monetære værdi. @dk
definition: 物价上涨 @zh-hans
in scheme: Media Topic
created: 2009-10-22T02:00:00+00:00
modified: 2024-03-28T12:00:00+00:00
broader: economic trends and indicators
broad match: http://cv.iptc.org/newscodes/subjectcode/04008016

investments
type: Concept
preferred label: استثمارات @ar
preferred label: Investition @de
preferred label: Investissements @fr
preferred label: Investeringar @se
preferred label: Inversiones @es
preferred label: investimentos @pt-pt
preferred label: investering @dk
preferred label: 投资 @zh-hans
definition: Spekulative Käufe von kollektiven Maschinen, Rohstoffen, Währungen oder Teilen davon @de
definition: Satsning av ekonomiskt värde med grundad förhoppning om framtida avkastning, vanligtvis i produktiv nyttighet och så att pengarna binds en längre tid. @se
definition: Speculative purchases of corporate instruments, of commodities, currencies, or parts thereof
definition: Compra especulativa de instrumentos corporativos, matérias-primas, divisas, etc. @pt-pt
definition: Compra especulativa de instrumentos corporativos, matérias-primas, divisas etc. @pt-br
definition: Investering i økonomisk værdi med håb om fremtidig afkast, normalt i produktiv brug, og således at pengene er bundet sammen i en længere periode. @dk
definition: 投机或部分投机购买公司票据、商品、货币 @zh-hans
change note: Retired. Use medtop:20000287 personal finance and investment instead.
in scheme: Media Topic
created: 2009-10-22T02:00:00+00:00
retired: 2024-03-28T12:00:00+00:00
modified: 2024-03-28T12:00:00+00:00
broader: economic trends and indicators

mortgages
type: Concept
preferred label: رهن @ar
preferred label: Bolån @se
preferred label: Hypothek @de
preferred label: Emprunt immobilier @fr
preferred label: Hipoteca @es
preferred label: hipotecas @pt-pt
preferred label: boliglån og realkredit @dk
preferred label: 抵押贷款 @zh-hans
preferred label: boliglån @no-nb
preferred label: bustadlån @no-nn
definition: Upplåning av pengar för köp av mark eller fastighet eller för reparation eller renovering av fastighet, mot säkerhet, vanligtvis i en fastighet. @se
definition: Darlehen mit der Absicht Eigentum zu kaufen, sowohl Land als auch Gebäude. Oder für Hausbesitzer um den Besitz zu renovieren oder instand zu halten, meist basierend auf Eigenkapital in Form von Eigentum. @de
definition: Trends around loans taken out to buy homes, such as the interest rates of mortgages, the amount of people buying property with a mortgage and the ease of getting approved for a mortgage
definition: Empréstimo de dinheiro com o objetivo de comprar uma propriedade, terreno ou edifício, ou, para proprietários, de reparar ou fazer a manutenção de propriedades. @pt-pt
definition: Låne penge til køb af jord eller ejendom eller til reparation, renovering af ejendom, for sikkerhed, normalt i en ejendom. @dk
definition: 用于购买土地或建筑物不动产的贷款，或者基于房产所有者权益维修或维护不动产的贷款。 @zh-hans
in scheme: Media Topic
created: 2009-10-22T02:00:00+00:00
modified: 2024-03-28T12:00:00+00:00
broader: economic trends and indicators

prices
type: Concept
preferred label: Precios @es
preferred label: Preis @de
preferred label: Marknadspriser @se
preferred label: اسعار @ar
preferred label: Prix @fr
preferred label: preços @pt-pt
preferred label: markedspris @dk
preferred label: 价格 @zh-hans
preferred label: pris @no-nb
definition: Det monetära värdet av varor, tjänster, aktier eller obligationer. @se
definition: Der Geldwert von Waren, Dienstleistungen oder Aktien und Anleihen @de
definition: The monetary value of goods, services or stocks and bonds
definition: Valor monetário de bens e serviços ou de ações e obrigações. @pt-pt
definition: Den monetære værdi af varer, tjenester, aktier eller obligationer. @dk
definition: 商品、服务或股票和债券的货币价值 @zh-hans
change note: Retired. Use medtop:20000370 inflation or medtop:20000356 deflation instead.
in scheme: Media Topic
created: 2009-10-22T02:00:00+00:00
retired: 2024-03-28T12:00:00+00:00
modified: 2024-03-28T12:00:00+00:00
broader: economic trends and indicators

recession
type: Concept
preferred label: Recession @se
preferred label: Récession @fr
preferred label: انكماش @ar
preferred label: Recesión @es
preferred label: Rezession @de
preferred label: recessão @pt-pt
preferred label: 经济衰退 @zh-hans
preferred label: resesjon @no-nb
definition: En mild form av lågkonjunktur och den vanligaste benämningen på en tillfällig nedgång i konjunkturen. @se
definition: Ein Abfall des BIP/GDP über zwei Quartale @de
definition: A decrease in gross domestic product over a period of two quarters in a row
definition: Descida do PIB num período de dois trimestres contínuos. @pt-pt
definition: Descida do PIB em um período de dois trimestres contínuos. @pt-br
definition: Defineres som en nedgang i et lands brutonationalprodukt over to på hinanden følgende kvartaler. Bruges også om økonomisk tilbagegang generelt. @dk
definition: 国内生产总值连续两个季度下降 @zh-hans
in scheme: Media Topic
created: 2009-10-22T02:00:00+00:00
modified: 2024-03-28T12:00:00+00:00
broader: economic trends and indicators
broad match: http://cv.iptc.org/newscodes/subjectcode/04000000

start-up and entrepreneurial business
type: Concept
preferred label: Entreprenörskap @se
preferred label: empreendedorismo @pt-pt
preferred label: iværksætteri @dk
preferred label: 创业 @zh-hans
preferred label: start-up og entreprenørskap @no-nb
preferred label: Unternehmertum @de
preferred label: Entrepreneuriat @fr
preferred label: Empresariado @es
preferred label: مقاولات @ar
definition: Processen att skapa, lansera och driva ett nytt företag. @se
definition: The process of designing, launching and running a new business
definition: O processo de projetar, lançar e executar um novo negócio. @pt-pt
definition: Processen med at oprette, lancere og drive et nyt firma. @dk
definition: 设计、启动和运行一个新企业或新业务 @zh-hans
definition: Der Prozess der Konzeption, Gründung und Führung eines neuen Unternehmens. @de
in scheme: Media Topic
created: 2016-04-04T12:00:00+00:00
modified: 2024-03-28T12:00:00+00:00
broader: business enterprise

small and medium enterprise
type: Concept
preferred label: Små och medelstora företag @se
preferred label: pequena e média empresa @pt-pt
preferred label: små og mellemstore virksomheder (SMV) @dk
preferred label: 中小企业 @zh-hans
preferred label: små og mellomstore bedrifter @no-nb
preferred label: kleine und mittlere Unternehmen @de
preferred label: Petites et moyennes entreprises @fr
preferred label: Pequeña y mediana empresa @es
preferred label: الشركات المتوسطة والصغيرة @ar
definition: A small and medium enterprise (SME) is a company whose number of employees, balance and turnover cannot exceed certain limits set by the country where it is located
definition: Företag vars antal anställda, omsättning och balansräkning inte får överskrida vissa nivåer som är uppsatta av landet de verkar i. @se
definition: Uma pequena e média empresa (PME) é uma empresa cujo número de funcionários, saldo e volume de negócios não pode exceder certos limites definidos pelo país onde está localizada. @pt-pt
definition: En lille eller mellemstor virksomhed (SMV) er en virksomhed, hvis antal ansatte, balance og omsætning ikke kan overstige visse grænser, der er fastsat af det land, hvor det er beliggende. @dk
definition: 中小企业(SME)是指员工数量、结余和营业额不能超过其所在国家规定的某些限制的公司 @zh-hans
definition: Ein kleines und mittleres Unternehmen (KMU) ist ein Unternehmen, dessen Mitarbeiterzahl, Bilanz und Umsatz bestimmte, vom Land, in dem es ansässig ist, festgelegte Grenzen nicht überschreiten dürfen. @de
in scheme: Media Topic
created: 2016-04-04T12:00:00+00:00
modified: 2024-03-28T12:00:00+00:00
broader: business enterprise

cooperative
type: Concept
preferred label: andelsselskab @dk
preferred label: Kooperativ @se
preferred label: 合作社 @zh-hans
preferred label: samvirke @no-nb
preferred label: cooperativa @pt-pt
preferred label: Kooperative @de
preferred label: Coopérative @fr
preferred label: Cooperativa @es
preferred label: جمعية تعاونية @ar
definition: An organisation which is owned and run jointly by its members, who share the profits or benefits of their work
definition: En virksomhed, der ejes og drives af sine medlemmer. Produktionen eller overskuddet deles mellem medlemmerne. @dk
definition: En organisation eller företag som ägs och drivs gemensamt av sina medlemmar och som delar vinsterna från verksamheten. @se
definition: 一个由其成员共同拥有和经营的组织，成员之间共享工作的利润或利益 @zh-hans
definition: Organização que pertence e é administrada conjuntamente pelos seus membros, que compartilham os lucros ou benefícios do seu trabalho. @pt-pt
definition: Organização que pertence e é administrada conjuntamente por seus membros, que compartilham os lucros ou benefícios de seu trabalho. @pt-br
definition: Eine Organisation, die sich im Besitz ihrer Mitglieder befindet und von ihnen gemeinsam geführt wird, die den Gewinn oder Nutzen ihrer Arbeit teilen @de
definition: An organization which is owned and run jointly by its members, who share the profits or benefits of their work
in scheme: Media Topic
created: 2019-10-07T12:00:00+00:00
modified: 2021-07-12T12:00:00+00:00
broader: business enterprise

consumer issue
type: Concept
preferred label: قضية مستهلك @ar
preferred label: Questions de consommation @fr
preferred label: Konsumentfrågor @se
preferred label: Problemas del consumidor @es
preferred label: Verbraucher @de
preferred label: questão de consumo @pt-pt
preferred label: forbrugerrettigheder @dk
preferred label: 消费者问题 @zh-hans
preferred label: forbrukervern @no-nb
preferred label: forbrukarvern @no-nn
definition: Issues, such as prices, inflation/deflation, quality of goods, at the retail sales level
definition: Preise, Inflation/Deflation, Warenqualität auf der Einzelhandelsebene @de
definition: Frågor kring priser, inflation/deflation och kvalitet på återförsäljarnivån. @se
definition: Assuntos como preços, inflação/deflação, qualidade dos bens, a nível da venda a retalho. @pt-pt
definition: Assuntos como preços, inflação/deflação, qualidade dos bens, a nível da venda no varejo. @pt-br
definition: Spørgsmål om forbrugeres rettigheder. @dk
definition: 消费者在零售层面反映的问题，如价格，通胀/通缩，商品质量等 @zh-hans
change note: Retired. Use individual product terms or medtop:20000207 product recall instead.
in scheme: Media Topic
created: 2009-10-22T02:00:00+00:00
retired: 2024-03-28T12:00:00+00:00
modified: 2024-03-28T12:00:00+00:00
broader: consumers

cryptocurrency
type: Concept
preferred label: kryptovaluta @dk
preferred label: Kryptovaluta @se
preferred label: 数字加密货币 @zh-hans
preferred label: criptomoeda @pt-pt
preferred label: Kryptowährung @de
preferred label: Cryptomonnaie @fr
preferred label: Criptomoneda @es
preferred label: عملة معماة @ar
definition: An internet-based medium of exchange using cryptography to conduct financial transactions
definition: En internet-baseret valuta, som benytter krypteringsteknologi til at facilitere finansielle transaktioner. @dk
definition: Digitala valutor där kryptografi används för att säkerställa transaktionerna. @se
definition: 一种使用密码学并基于因特网进行金融交易的交易媒介 @zh-hans
definition: Meio de troca baseado na Internet que usa criptografia para realizar transações financeiras. @pt-pt
definition: Ein internetbasiertes Tauschmittel, das Kryptographie zur Durchführung finanzieller Transaktionen verwendet @de
in scheme: Media Topic
created: 2019-10-07T12:00:00+00:00
modified: 2021-07-12T12:00:00+00:00
broader: currency

interest rates
type: Concept
preferred label: Ränta @se
preferred label: Taux d'intérêts @fr
preferred label: Tasas de interés @es
preferred label: Zinsen @de
preferred label: معدل الفائدة @ar
preferred label: juros @pt-pt
preferred label: rentesats @dk
preferred label: 利率 @zh-hans
preferred label: rente @no-nb
definition: Die Menge des Geldes, die jemand für geliehenes Geld zahlen muss @de
definition: The amount a lender charges a borrower as a percentage of the principal. Often set by a central bank or government.
definition: Överenskommet pris på kredit som tas ut av långivaren, angivet i procent av lånesumman. @se
definition: Montante de dinheiro que alguém deve pagar quando pede dinheiro emprestado. @pt-pt
definition: Den aftalte pris på kredit optaget af långiveren, udtrykt i procent af lånebeløbet. @dk
definition: 指一个人为借钱必须支付的金钱的数额 @zh-hans
in scheme: Media Topic
created: 2009-10-22T02:00:00+00:00
modified: 2024-03-28T12:00:00+00:00
broader: monetary policy

trade agreements
type: Concept
preferred label: Acuerdos comerciales @es
preferred label: Accords commerciaux @fr
preferred label: Handelsavtal @se
preferred label: اتفاقات تجارية @ar
preferred label: Handelsabkommen @de
preferred label: acordos comerciais @pt-pt
preferred label: handelsaftale @dk
preferred label: 贸易协定 @zh-hans
preferred label: handelsavtale @no-nb
definition: Överenskommelse mellan två eller flera länder om villkoren för handelsförbindelser länderna emellan. @se
definition: Verträge zwischen Ländern auf Regierungsebene für den An- und Verkauf von Gütern und Dienstleistungen @de
definition: Agreements between countries or trading blocs for the sale and purchase of goods and services
definition: Acordo governamental entre países para a compra e venda de bens e serviços. @pt-pt
definition: Aftale mellem to eller flere lande om handelsbetingelserne mellem landene. @dk
definition: 各国之间就销售和购买商品和服务达成的政府级协议 @zh-hans
in scheme: Media Topic
created: 2009-10-22T02:00:00+00:00
modified: 2024-03-28T12:00:00+00:00
broader: international trade

balance of trade
type: Concept
preferred label: Handelsbilanz @de
preferred label: Handelsbalans @se
preferred label: ميزان تجاري @ar
preferred label: Balance commerciale @fr
preferred label: Balanza comercial @es
preferred label: balança comercial @pt-pt
preferred label: handelsbalance @dk
preferred label: 贸易平衡 @zh-hans
preferred label: handelsbalanse @no-nb
definition: Skillnaden mellan värdet av ett lands expor toch värdet av dess import av varor. @se
definition: Die finanzielle Differenz zwischen Import und Export in Bezug auf den Warenwert @de
definition: The difference between the financial value of imports and exports
definition: Diferença entre o valor financeiro de importações e exportações. @pt-pt
definition: Forskellen mellem værdien af et lands eksport og værdien af dets import af varer. @dk
definition: 进出口价值的差异 @zh-hans
in scheme: Media Topic
created: 2009-10-22T02:00:00+00:00
modified: 2024-03-28T12:00:00+00:00
broader: international trade

trade dispute
type: Concept
preferred label: Litigio comercial @es
preferred label: Conflit commercial @fr
preferred label: Handelstvist @se
preferred label: نزاع تجاري @ar
preferred label: Handeslstreitigkeit @de
preferred label: disputa comercial @pt-pt
preferred label: handelstvist @dk
preferred label: 贸易争端 @zh-hans
definition: Internationale Streitigkeiten über Handelsbeschränkungen, Kartelle, Dumping etc. @de
definition: International dispute over issues such as trade barriers, cartels and dumping, resolved by the World Trade Organization
definition: Internationell dispyt om handelshinder, kartellverksamhet, prisdumpning med mera. @se
definition: Disputas internacionais sobre barreiras ao comércio, cartéis e dumping. @pt-pt
definition: International konflikt om handelshindringer, karteloperationer, prisdumping og mere. @dk
definition: 国际争端如贸易壁垒，贸易纠纷、卡特尔、倾销等 @zh-hans
in scheme: Media Topic
created: 2009-10-22T02:00:00+00:00
modified: 2024-03-28T12:00:00+00:00
broader: international trade

trade policy
type: Concept
preferred label: Handelspolitik @se
preferred label: Handelsbeschränkung @de
preferred label: سياسة تجارية @ar
preferred label: Politique commerciale @fr
preferred label: Política comercial @es
preferred label: política comercial @pt-pt
preferred label: handelspolitik @dk
preferred label: 贸易政策 @zh-hans
preferred label: handelspolitikk @no-nb
definition: Governmental decisions on tariffs, shipping, embargoes, and the types of goods and services to be imported and exported
definition: Benämning på alla ekonomisk-politiska åtgärder med vilka avsikten är att påverka utrikeshandeln. @se
definition: Regierungsentscheidungen über Tarife, Verschiffung, Embargos und welche Güter und Dienstleistungen @de
definition: Decisões governamentais em relação a tarifas, embarque, embargos e os tipos de bens e serviços que são importados e exportados. @pt-pt
definition: Beskrivelse af alle økonomiske og politiske foranstaltninger med det formål at påvirke udenrigshandel. @dk
definition: 征收关税、航运、禁运以及进出口某类商品和服务的政府决定 @zh-hans
in scheme: Media Topic
created: 2009-10-22T02:00:00+00:00
modified: 2024-03-28T12:00:00+00:00
broader: international trade

tariff
type: Concept
preferred label: تعرفة @ar
preferred label: Aranceles @es
preferred label: Tullavgifter @se
preferred label: Droits de douane @fr
preferred label: Zoll @de
preferred label: tarifas @pt-pt
preferred label: toldafgift @dk
preferred label: 关税 @zh-hans
preferred label: toll @no-nb
definition: En skatt enligt en tariff som betalas vid import eller export av varor över en landgräns, oftast för att utjämna prisdifferenser. @se
definition: Fees placed on imported or exported goods
definition: Gebühren, die auf importierte und exportierte Waren erhoben werden, meist strafend. @de
definition: Taxas impostas a bens importados ou exportados, muitas vezes punitivas. @pt-pt
definition: En told, der betales ved import eller eksport af varer over en landegrænse, normalt for at udligne prisforskelle. @dk
definition: 对进出口货物征收的费用，通常是惩罚性的 @zh-hans
in scheme: Media Topic
created: 2009-10-22T02:00:00+00:00
modified: 2024-03-28T12:00:00+00:00
broader: international trade

commodities market
type: Concept
preferred label: Marché des matières premières @fr
preferred label: سوق السلع @ar
preferred label: Råvarumarknad @se
preferred label: Warenbörse @de
preferred label: Mercado de materias primas @es
preferred label: mercados de produtos de base @pt-pt
preferred label: råvarebørs @dk
preferred label: 大宗商品市场 @zh-hans
preferred label: råvaremarked @no-nb
preferred label: råvaremarknad @no-nn
definition: Tauschgeschäft und Verkauf von Waren, wie Baumwolle, Öl, Kohle, Metalle etc. @de
definition: Handelsplats för standardiserad handel med råvaror och/eller handelsvaror, eller derivatinstrument baserade på dessa varor t ex bomull, olja, kol, metaller med mera. @se
definition: The market for goods such as cotton, oil, coal and metals
definition: Troca ou comercialização de matérias-primas como algodão, petróleo, carvão, metais, etc. @pt-pt
definition: Troca ou comercialização de matérias-primas como algodão, petróleo, carvão, metais etc. @pt-br
definition: Handelssted for standardiseret handel med råvarer og/eller råvarer eller afledte instrumenter baseret på disse varer, for eksempel bomuld, olie, kul, metaller og mere. @dk
definition: 棉花、石油、煤炭、金属等商品的易货或交易 @zh-hans
in scheme: Media Topic
created: 2009-10-22T02:00:00+00:00
modified: 2024-03-28T12:00:00+00:00
broader: market and exchange
narrower: energy market
narrower: metal
narrower: soft commodities market

debt market
type: Concept
preferred label: Obligationsmarknad @se
preferred label: Kapitalmarkt @de
preferred label: سوق الديون @ar
preferred label: Marché obligataire @fr
preferred label: Mercados de deuda @es
preferred label: mercado de dívida @pt-pt
preferred label: gældsmarked @dk
preferred label: 债券市场 @zh-hans
preferred label: lånemarked @no-nb
preferred label: lånemarknad @no-nn
definition: Markt für den Handel mit Schuldeninstrumentarien wie Wertpapiere, Banksicherheiten, Bargeld etc. @de
definition: Market for debt instruments such as bonds, certificates of deposit, banker's acceptances and Treasury bills
definition: Den del av kreditmarknaden som avser lån som vid sitt utgivande har en löptid på minst ett år. @se
definition: Mercado para negociar instrumentos de dívida como obrigações, certificados de depósito, aprovações bancárias, obrigações do tesouro, notas, promissórias, etc. @pt-pt
definition: Mercado para negociar instrumentos de dívida como obrigações, certificados de depósito, aprovações bancárias, obrigações do tesouro, notas, promissórias etc. @pt-br
definition: Den del af kreditmarkedet, der vedrører lån, der har en løbetid på mindst et år på udstedelsestidspunktet. @dk
definition: 交易债券、信用违约掉期、银行承兑汇票、国库券、票据、借据等债务工具的市场 @zh-hans
in scheme: Media Topic
created: 2009-10-22T02:00:00+00:00
modified: 2024-03-28T12:00:00+00:00
broader: market and exchange

foreign exchange market
type: Concept
preferred label: Devisenmarkt @de
preferred label: Valutamarknad @se
preferred label: Marché des changes @fr
preferred label: Mercados cambiario @es
preferred label: سوق صرف العملات @ar
preferred label: mercado cambial @pt-pt
preferred label: valutamarked @dk
preferred label: 外汇市场 @zh-hans
preferred label: valutamarknad @no-nn
definition: The market for international currency
definition: Den handel med valutor i vilken valutakurser bestäms. @se
definition: Der Welthandel mit Schekel, Dinar, Euro, Dollar etc. auf geregelten Märkten @de
definition: Troca de divisas em todo o mundo, através de mercados regulados. @pt-pt
definition: Handel med valutaer, hvori valutakurser bestemmes. @dk
definition: 通过受管制的市场在世界各地进行谢克尔、第纳尔、欧元、美元等的交易 @zh-hans
in scheme: Media Topic
created: 2009-10-22T02:00:00+00:00
modified: 2024-03-28T12:00:00+00:00
broader: market and exchange

loan market
type: Concept
preferred label: سوق القروض @ar
preferred label: Marché monétaire @fr
preferred label: Lånemarknad @se
preferred label: Mercado de préstamos @es
preferred label: Kreditmarkt @de
preferred label: mercado de empréstimos @pt-pt
preferred label: lånemarked @dk
preferred label: 贷款市场 @zh-hans
preferred label: pengemarked @no-nb
preferred label: pengemarknad @no-nn
definition: Marknad där pengar kan lånas till bestämda räntesatser. @se
definition: The market where financial organisations provide loans to borrowers and sell them on to investors
definition: Markt, auf dem Geld erhältlich ist zu bestimmten Leihkonditionen @de
definition: Mercado onde o dinheiro está disponível para empréstimos, a determinadas taxas de juro. @pt-pt
definition: Marked, hvor penge kan lånes til fast rente. @dk
definition: 可按一定利率借钱的市场 @zh-hans
definition: The market where financial organizations provide loans to borrowers and sell them on to investors
in scheme: Media Topic
created: 2009-10-22T02:00:00+00:00
modified: 2024-03-28T12:00:00+00:00
broader: market and exchange

energy market
type: Concept
preferred label: طاقة @ar
preferred label: Energie @de
preferred label: Marché de l'énergie @fr
preferred label: Mercado de energía @es
preferred label: Energimarknad @se
preferred label: mercado da energia @pt-pt
preferred label: energibørs @dk
preferred label: 能源市场 @zh-hans
preferred label: energimarked @no-nb
preferred label: energimarknad @no-nn
definition: Energiehandel und Energiemarkt. @de
definition: Handelsplats för el, gas, kol, olja och utsläppsrätter för koldioxid. @se
definition: The market for commodities such as electricity, heat, and fuel products
definition: Comércio e mercados energéticos. @pt-pt
definition: Handelssted for elektricitet, gas, kul, olie og kuldioxid. @dk
definition: 能源交易及市场 @zh-hans
in scheme: Media Topic
created: 2009-10-22T02:00:00+00:00
modified: 2024-03-28T12:00:00+00:00
broader: commodities market

metal
type: Concept
preferred label: Metales @es
preferred label: معادن @ar
preferred label: Metallmarknad @se
preferred label: Metall @de
preferred label: Marché des métaux @fr
preferred label: metalbørs @dk
preferred label: 金属 @zh-hans
preferred label: metallmarked @no-nb
preferred label: metallmarknad @no-nn
definition: Märkte um Metalle wie Kupfer, Aluminium, Stahl und Zink etc. zu handeln @de
definition: Handelsplats för metaller såsom koppar, stål, aluminium, zink med mera. @se
definition: Markets for trading base metals such as copper, aluminium, steel, zinc etc
definition: Mercados para comercializar metais básicos como cobre, alumínio, aço, zinco, etc. @pt-pt
definition: Mercados para comercializar metais básicos como cobre, alumínio, aço, zinco etc. @pt-br
definition: Handelssted for metaller som kobber, stål, aluminium, zink og mere. @dk
definition: 铜、铝、钢铁、锌等 @zh-hans
definition: Markets for trading base metals such as copper, aluminum, steel, zinc etc
in scheme: Media Topic
created: 2009-10-22T02:00:00+00:00
modified: 2021-02-18T12:00:00+00:00
broader: commodities market

soft commodities market
type: Concept
preferred label: Marchés agricoles @fr
preferred label: سلعة اساسية @ar
preferred label: Mjuk råvarumarknad @se
preferred label: Obligation @de
preferred label: Materias primas agrícolas @es
preferred label: produtos agrícolas @pt-pt
preferred label: børs for bløde råvarer @dk
preferred label: 软商品 @zh-hans
preferred label: myke råvarer @no-nb
preferred label: mjuke råvarer @no-nn
definition: Market for commodities such as cotton, sugar, sorghum, soybeans
definition: Handelsplats för råvaror som odlas, såsom bomull, socker, sojabönor med mera. @se
definition: Handel mit Rohstoffen wie Baumwolle, Zucker, Zuckerrohr, Sojabohnen etc. @de
definition: Transação de matérias-primas como algodão, açúcar, sorgo, soja, etc. @pt-pt
definition: Transação de matérias-primas como algodão, açúcar, sorgo, soja etc. @pt-br
definition: Handelssted for dyrkede råvarer, såsom bomuld, sukker, sojabønner og mere. @dk
definition: 如棉花、糖、高粱、大豆等 @zh-hans
change note: Retired. Use medtop:20000386 commodity market instead.
in scheme: Media Topic
created: 2009-10-22T02:00:00+00:00
retired: 2023-10-02T12:00:00+00:00
modified: 2024-03-28T12:00:00+00:00
broader: commodities market

loans and lending
type: Concept
preferred label: Lån @se
preferred label: Kredit @de
preferred label: قروض @ar
preferred label: Prêts @fr
preferred label: Préstamos @es
preferred label: empréstimos @pt-pt
preferred label: lån @dk
preferred label: 贷款 @zh-hans
preferred label: lån og gjeld @no-nb
preferred label: lån og skuld @no-nn
definition: An agreement by an individual or institution to borrow money with an agreed interest rate and time for its return
definition: Eine Übereinkunft zwischen zwei Einzelpersonen oder Institutionen für einen begrenzten Zeitraum Geld zu verleihen zu einer vereinbarten Rate innerhalb eines Rückzahlungszeitraums @de
definition: Innehav av annans egendom för eget bruk med skyldighet för låntagaren att återställa det lånade föremålet eller motsvarande värde till en bestämd ränta och vid en bestämd tidpunkt.. @se
definition: Acordo por meio do qual um indivíduo ou uma instituição emprestam dinheiro a outro, mediante uma taxa de juro e um período para a sua devolução. @pt-pt
definition: Acordo por meio do qual um indivíduo ou uma instituição emprestam dinheiro a outro, mediante uma taxa de juro e um período para sua devolução. @pt-br
definition: En aftale fra en enkeltperson eller institution om midlertidigt at sprede penge til en anden med en aftalt sats og tidspunkt for tilbagebetaling. @dk
definition: 由一个人或机构以约定的回报率和时间向另一个人或机构临时分拨资金的协议 @zh-hans
in scheme: Media Topic
created: 2009-10-22T02:00:00+00:00
modified: 2024-03-28T12:00:00+00:00
broader: financial service

derivatives
type: Concept
preferred label: Derivat @se
preferred label: Produits dérivés @fr
preferred label: Derivate @de
preferred label: Derivados @es
preferred label: اوراق مالية مشتقة @ar
preferred label: derivados financeiros @pt-pt
preferred label: derivater @dk
preferred label: 衍生证券 @zh-hans
preferred label: derivat @no-nn
definition: Financial instruments such as futures, swaps and options that depend on an underlying instrument such as a commodity, bond, equity or currency
definition: Värdepapper, t ex optioner, vars värde påverkas av värdet på ett annat värdepapper, t ex aktier. @se
definition: Finanzinstrumente, wie Futures, Swaps und Optionen, die für das Risikomanagement genutzt werden und deren Wert sich nach den Kursschwankungen oder den Preiserwartungen richten, wie Rohstoffe, festverzinsliche Wertpapiere, Dividende @de
definition: Instrumentos financeiros como futuros, intercâmbios e opções, usados na gestão de investimentos de risco, e cujas características e valor dependem das características e valor de um instrumento subjacente, como uma matéria-prima, obrigação ou moeda. @pt-pt
definition: Værdipapirer, fx optioner, hvis værdi påvirkes af værdien af en anden værdi, såsom aktier. @dk
definition: 用于风险管理的金融工具，如期货、掉期和期权，其特征和价值取决于基础工具(如商品、债券、股票或货币)的特征和价值。 @zh-hans
in scheme: Media Topic
created: 2009-10-22T02:00:00+00:00
modified: 2023-03-31T12:00:00+00:00
broader: stocks and securities

stock recommendation
type: Concept
preferred label: Aktienempfehlung @de
preferred label: Aktieråd @se
preferred label: recomendação de ações @pt-pt
preferred label: aktieanbefaling @dk
preferred label: 股票建议 @zh-hans
preferred label: aksjeanbefaling @no-nb
preferred label: Recommandation boursière @fr
preferred label: Recomendación de acciones @es
preferred label: توصية في البورصة @ar
preferred label: aksjetilråding @no-nn
definition: Empfehlung eines Analysten für bestimmte Aktien. Kann das Kursziel des Analysten für die Aktie beinhalten. @de
definition: An analyst's recommendation for particular stocks. May include the analyst s price target for the stock.
definition: En analytikers rekommendation kring en specifik aktie. @se
definition: Recomendação de um analista para ações específicas. Pode incluir o preço-alvo do analista para uma ação. @pt-pt
definition: En analytikers anbefalinger for bestemte aktier. Kan inkludere analytikerens prismål for aktien. @dk
definition: 分析师对特定股票的推荐。可能包括分析师对该股的目标价 @zh-hans
definition: An analyst's recommendation for particular stocks. May include the analyst*s price target for the stock.
change note: Retired. Use medtop:20000396 stocks and/or genre:Analysis instead.
in scheme: Media Topic
created: 2012-10-04T12:00:00+00:00
retired: 2023-03-31T12:00:00+00:00
modified: 2023-03-31T12:00:00+00:00
broader: stocks and securities
narrower: buy recommendation
narrower: hold recommendation
narrower: sell recommendation

hot stock
type: Concept
preferred label: Aktierusning @se
preferred label: Gefragte Aktie @de
preferred label: populære aktier @dk
preferred label: 热门股票 @zh-hans
preferred label: populære aksjer @no-nb
preferred label: Actions en hausse (hot stock) @fr
preferred label: Hot stock @es
preferred label: ارتفاع سعر أسهم @ar
preferred label: populære aksjar @no-nn
definition: Remarkable price movements of a particular stock.
definition: Bemerkenswerte Kursbewegungen einer bestimmten Aktie. @de
definition: Anmärkningsvärd prisrörelse hos en specifik aktie. @se
definition: Movimentos de preço assinaláveis de determinada ação. @pt-pt
definition: Bemærkelsesværdige kursbevægelser på en bestemt aktie. @dk
definition: 特定股票价格的显著波动 @zh-hans
change note: Retired. Use medtop:20000396 stocks and/or genre:Analysis instead.
in scheme: Media Topic
created: 2012-10-04T12:00:00+00:00
retired: 2023-03-31T12:00:00+00:00
modified: 2023-03-31T12:00:00+00:00
broader: stocks and securities

primary education
type: Concept
preferred label: École primaire @fr
preferred label: مدارس ابتدائية @ar
preferred label: Escuela primaria @es
preferred label: Grundschule @de
preferred label: Låg- och mellanstadium @se
preferred label: escolas de 1.º ciclo @pt-pt
preferred label: escolas de ensino fundamental, 1ª à 5ª série @pt-br
preferred label: grundskole @dk
preferred label: 小学 @zh-hans
preferred label: grunnskole @no-nb
preferred label: grunnskule @no-nn
definition: Schulen für die Altersgruppe vom Kindergartenalter bis zu den 11 oder 12-jährigen. @de
definition: De två inledande, treåriga stadierna av grundskolan, årskurserna 1-6 samt F-klass. @se
definition: Education and schools designed to provide students with fundamental skills in reading, writing and mathematics and to establish a solid foundation for later learning
definition: Escola a partir dos 5-6 anos até aos 10 anos. @pt-pt
definition: Escola a partir dos 5-6 anos até os 10 anos. @pt-br
definition: Grundskolen på 10 år (børnehaveklasse efterfulgt af 1.-9. klasse), med 10. klasse som et frivilligt år. @dk
definition: 从幼儿园到11岁或12岁的学校 @zh-hans
definition: Education and schools designed to provide students with fundamental skills in reading, writing and mathematics and to establish a solid foundation for later learninEducation and schools designed to provide students with fundamental skills in reading, writing and mathematics and to establish a solid foundation for later learning
in scheme: Media Topic
created: 2009-10-22T02:00:00+00:00
modified: 2021-09-30T12:00:00+00:00
broader: school

further education
type: Concept
preferred label: Vidareutbildning @se
preferred label: تعليم اضافي @ar
preferred label: Enseignement post-scolaire @fr
preferred label: Weiterbildung @de
preferred label: Estudios adicionales @es
preferred label: educação contínua @pt-pt
preferred label: videreuddannelse @dk
preferred label: 继续教育 @zh-hans
preferred label: videreutdanning @no-nb
preferred label: vidareutdanning @no-nn
definition: All form av utbildning utöver grundutbildningen på olika utbildningsnivåer. @se
definition: Any form of education beyond basic education of several levels
definition: Jede Form der Ausbildung auf verschiedenen Ebenen, neben der Grundausbildung. @de
definition: Qualquer forma de educação que vai além da escolaridade básica. @pt-pt
definition: Alle former for uddannelse ud over grunduddannelse på forskellige uddannelsesniveauer. @dk
definition: 各级基础教育以外的任何形式的教育 @zh-hans
change note: Retired on 2021-09-30T12:00:00+00:00. Use medtop:20000403 adult and continuing education or medtop:20001216 vocational education
in scheme: Media Topic
created: 2009-10-22T02:00:00+00:00
retired: 2021-09-30T12:00:00+00:00
modified: 2021-09-30T12:00:00+00:00
broader: school

adult and continuing education
type: Concept
preferred label: تعليم الراشدين @ar
preferred label: Vuxenutbildning @se
preferred label: Formation @fr
preferred label: Erwachsenenbildung @de
preferred label: Educación de adultos @es
preferred label: educação de adultos @pt-pt
preferred label: voksenuddannelse @dk
preferred label: 成人教育 @zh-hans
preferred label: voksenopplæring @no-nb
preferred label: vaksenopplæring @no-nn
definition: Ausbildung für ältere Lernende außerhalb der gewöhnlichen Altersgruppe der 5-25-jährigen. @de
definition: Education for adults who have left the formal education system that offers new forms of knowledge or skills, including professional certificates and online courses provided by companies such as Codeacademy or Udemy
definition: Samlingsnamn för ett flertal former av utbildning för vuxna människor. @se
definition: Educação fornecida a estudantes mais velhos do que o grupo usual entre os 5 e os 25 anos. @pt-pt
definition: Samlingsnavn for en række voksenuddannelsesprogrammer. @dk
definition: 为超过25岁的年龄较大的群体提供的教育 @zh-hans
in scheme: Media Topic
created: 2009-10-22T02:00:00+00:00
modified: 2024-07-01T12:00:00+00:00
broader: school

upper secondary education
type: Concept
preferred label: Lycées @fr
preferred label: Gymnasium @se
preferred label: Liceo o secundaria @es
preferred label: مدارس ثانوية @ar
preferred label: escolas secundárias @pt-pt
preferred label: escolas de ensino médio @pt-br
preferred label: gymnasium @dk
preferred label: 高级中学 @zh-hans
preferred label: videregående skole @no-nb
preferred label: vidaregåande skule @no-nn
definition: En skolform för teoretisk utbildning mellan grundskola och universitet eller högskola. @se
definition: Education and schools preparing students for tertiary education or providing skills relevant to employment through a curriculum with an increased range of subject options and streams
definition: Universitätsvorbereitung für die 16 bis 18 oder 19-jährigen mit Abiturabschluss. @de
definition: Educação pré-universitária, entre 15 e 17-18 anos. @pt-pt
definition: En skoleform til teoretisk uddannelse mellem grundskole og universitet. @dk
definition: 青少年大学前的教育 @zh-hans
in scheme: Media Topic
created: 2009-10-22T02:00:00+00:00
modified: 2021-09-30T12:00:00+00:00
broader: school

college and university
type: Concept
preferred label: Educación superior @es
preferred label: Hochschule @de
preferred label: Högre utbildning @se
preferred label: تعليم عالي @ar
preferred label: Éducation supérieure @fr
preferred label: ensino superior @pt-pt
preferred label: videregående uddannelse @dk
preferred label: 高等教育 @zh-hans
preferred label: høyere utdanning @no-nb
preferred label: høgare utdanning @no-nn
definition: Utbildning vid universitet, akademier, högskolor, seminarier, konservatorier och liknande institutioner, som oftast resulterar i en examen. @se
definition: Ausbildung oberhalb des zweiten Levels, meist erwartet von Fachhochschulen und Universitäten, die in einer professionellen Qualifikation oder einem akademischen Grad führt @de
definition: Institutions of higher learning that provide degrees in a course of study at the undergraduate, postgraduate or doctorate level
definition: Educação acima do ensino secundário, geralmente fornecida por faculdades e universidades. @pt-pt
definition: Educação acima do ensino médio, geralmente fornecida por faculdades e universidades. @pt-br
definition: Uddannelse på universiteter, akademier, gymnasier, seminarer, konservatorier og lignende institutioner, som normalt resulterer i en grad. @dk
definition: 中等以上的教育，通常由高等院校提供的用于取得专业资格或学位的教育 @zh-hans
in scheme: Media Topic
created: 2009-10-22T02:00:00+00:00
modified: 2021-09-30T12:00:00+00:00
broader: school
narrower: college
narrower: university
broad match: http://cv.iptc.org/newscodes/subjectcode/05000000

lower secondary education
type: Concept
preferred label: Collège @fr
preferred label: Colegio de secundaria @es
preferred label: Högstadium @se
preferred label: مدارس متوسطة @ar
preferred label: Haupt-und Realschule @de
preferred label: escolas de 2.º ciclo e 3.º ciclo @pt-pt
preferred label: escolas de ensino fundamental, 6ª à 9ª série @pt-br
preferred label: mellemskole @dk
preferred label: 初级中学 @zh-hans
preferred label: ungdomsskole @no-nb
preferred label: ungdomsskule @no-nn
definition: Education and schools that build on primary education with a more subject-oriented curriculum. Schools may be called middle schools or junior highs in the United States.
definition: Schule für die Altersgruppe der 11 bis 15-jährigen. @de
definition: Grundskolans avslutande treåriga stadium omfattande årskurserna 7-9. @se
definition: Escola de transição, entre as escolas de 1.º ciclo e as escolas secundárias, entre 10 e 15 anos. @pt-pt
definition: Escola de transição, anterior à escola de ensino médio, entre 10 e 15 anos. @pt-br
definition: Grundskolens sidste treårige trin bestående af klasse 7-9. @dk
definition: 从小学到高中的过渡学校，入学年龄12岁至13岁 @zh-hans
in scheme: Media Topic
created: 2009-10-22T02:00:00+00:00
modified: 2021-09-30T12:00:00+00:00
broader: school

early childhood education
type: Concept
preferred label: Preescolar @es
preferred label: حضانة @ar
preferred label: Förskola @se
preferred label: Vorschule/Kindergarten @de
preferred label: Maternelle @fr
preferred label: pré-escolar @pt-pt
preferred label: børnehaveklasse/0. klasse @dk
preferred label: 学前教育 @zh-hans
preferred label: barnehage/førskole @no-nb
preferred label: barnehage/førskule @no-nn
definition: Education for children under the national compulsory education age
definition: Pedagogisk verksamhet för inskrivna barn i åldern 1–5 år. @se
definition: Erziehung für Kinder unterhalb des nationalen regulären Schulalters. @de
definition: Educação para crianças abaixo da idade da escolaridade obrigatória. @pt-pt
definition: Uddannelsesaktiviteter for tilmeldte børn i alderen 1-5 år. @dk
definition: 全民义务教育入学年龄以下儿童的教育 @zh-hans
in scheme: Media Topic
created: 2009-10-22T02:00:00+00:00
modified: 2021-09-30T12:00:00+00:00
broader: school

religious school
type: Concept
preferred label: religiøs skole @dk
preferred label: religiøse skoler @no-nb
preferred label: escolas religiosas @pt-br
preferred label: Religiösa skolor @se
preferred label: 教会学校 @zh-hans
preferred label: Religionsschulen @de
preferred label: Écoles religieuses @fr
preferred label: Escuelas religiosas @es
preferred label: مدرسة دينية @ar
preferred label: religiøse skular @no-nn
definition: Skoler, der tilbyder undervisning om religion eller ledes af principperne i en bestemt religiøs tro. @dk
definition: School that has a religious component in its operations or its curriculum
definition: Escolas que ensinam ou são guiadas pelos princípios de uma determinada fé religiosa. @pt-br
definition: Skolor där undervisningen handlar om och är styrd av en viss trosinriktning. @se
definition: 提供关于特定宗教信仰的指导或受特定宗教信仰的原则指导的学校 @zh-hans
definition: Schulen, die Unterricht über einen bestimmten religiösen Glauben anbieten oder sich von den Prinzipien dieses Glaubens leiten lassen @de
in scheme: Media Topic
created: 2019-04-06T12:00:00+00:00
modified: 2021-09-30T12:00:00+00:00
broader: school

state school
type: Concept
preferred label: Kommunal skola @se
preferred label: escolas públicas @pt-pt
preferred label: folkeskole @dk
preferred label: 公立学校 @zh-hans
preferred label: offentlig skole @no-nb
preferred label: Öffentliche Schulen @de
preferred label: public school
preferred label: Écoles publiques @fr
preferred label: Escuelas públicas @es
preferred label: مدارس حكومية @ar
preferred label: offentleg skule @no-nn
definition: Schools maintained by public funds, usually government-imposed taxes
definition: En kommunal skola är öppen för alla och ingår i det offentliga skolväsendet i Sverige @se
definition: Escolas financiadas por fundos públicos, geralmente impostos cobrados pelo governo. @pt-pt
definition: En kommunal skole som er åben for alle og er en del af det offentlige skolesystem i Danmark. @dk
definition: 由公共基金通常是政府税收开办的学校 @zh-hans
definition: Schulen, die aus öffentlichen Mitteln, in der Regel von der Regierung auferlegte Steuern, unterhalten werden @de
in scheme: Media Topic
created: 2019-04-06T12:00:00+00:00
modified: 2021-09-30T12:00:00+00:00
broader: school

private school
type: Concept
preferred label: Privatskola @se
preferred label: escolas privadas @pt-pt
preferred label: privatskole @dk
preferred label: 私立学校 @zh-hans
preferred label: Privatschulen @de
preferred label: Écoles privées @fr
preferred label: Escuelas privadas @es
preferred label: مدرسة خاصة @ar
preferred label: privatskule @no-nn
definition: Schools maintained by private funds and organisations
definition: En typ av skola som inte administreras av lokala, regionala eller nationella myndigheter. Privatskolan förbehåller sig rätten att välja de elever som tas in på skolan och finansieras genom avgifter snarare än offentlig finansiering @se
definition: Escolas financiadas por organizações e fundos privados. @pt-pt
definition: En type skole, der ikke administreres af lokale, regionale eller nationale myndigheder. Den private skole forbeholder sig retten til at vælge de studerende, der er optaget på skolen og finansieres af gebyrer snarere end offentlig finansiering. @dk
definition: 由私人基金和组织开办的学校 @zh-hans
definition: Schulen, die von privaten Fonds und Organisationen unterhalten werden @de
definition: Schools maintained by private funds and organizations
in scheme: Media Topic
created: 2019-04-06T12:00:00+00:00
modified: 2021-09-30T12:00:00+00:00
broader: school

independent school
type: Concept
preferred label: Friskola @se
preferred label: escolas independentes @pt-pt
preferred label: uafhængig skole/friskole @dk
preferred label: 独立学校 @zh-hans
preferred label: friskoler @no-nb
preferred label: Freie Schulen @de
preferred label: independent and charter school
preferred label: Écoles indépendantes @fr
preferred label: Escuelas independientes @es
preferred label: مدارس مستقلة @ar
preferred label: friskular @no-nn
definition: Schools funded by money from taxes via government, but run by companies, organisations or cooperatives
definition: En skola som inte drivs av offentliga sektorn, men som huvudsakligen finansieras av skattemedel @se
definition: Escolas financiadas por dinheiro de impostos através do governo, mas administradas por empresas, organizações ou cooperativas. @pt-pt
definition: En skole, der ikke drives af den offentlige sektor, men som hovedsageligt finansieres af skattemidler. @dk
definition: 由政府税收资助，但由公司、组织或合作社经营的学校 @zh-hans
definition: Schulen, die mit Steuergeldern über die Regierung finanziert, aber von Unternehmen, Organisationen oder Genossenschaften betrieben werden @de
definition: Schools funded by money from taxes via government, but run by companies, organizations or cooperatives
in scheme: Media Topic
created: 2019-04-06T12:00:00+00:00
modified: 2021-09-30T12:00:00+00:00
broader: school

college
type: Concept
preferred label: Lycées professionnels @fr
preferred label: كلية @ar
preferred label: Fachhochschule @de
preferred label: Högskola @se
preferred label: Colegio universitario @es
preferred label: faculdade @pt-pt
preferred label: 学院 @zh-hans
preferred label: høgskole @no-nb
preferred label: høgskule @no-nn
definition: Institution of higher learning, its specific scope is set differently in different countries
definition: Läroanstalt för högre utbildning och forskning, där det i princip krävs avslutade gymnasiestudier för att komma in. @se
definition: Institution der Lehre auf höherer Ebene, spezielle Form variiert von Land zu Land @de
definition: Instituição de ensino superior cujo escopo específico é definido de forma diferente consoante o país. @pt-pt
definition: Uddannelsesinstitution for videregående uddannelse og forskning, som i princippet kræver afsluttede gymnasiestudier for at komme ind. @dk
definition: 高等学校，其具体范围在不同国家有不同的规定 @zh-hans
change note: Retired. Use medtop:20000405 college and university
in scheme: Media Topic
created: 2009-10-22T02:00:00+00:00
retired: 2021-09-30T12:00:00+00:00
modified: 2021-09-30T12:00:00+00:00
broader: college and university
broad match: http://cv.iptc.org/newscodes/subjectcode/05000000

university
type: Concept
preferred label: Universitet @se
preferred label: Université @fr
preferred label: Universidad @es
preferred label: جامعة @ar
preferred label: Universität @de
preferred label: universidades @pt-pt
preferred label: universitet @dk
preferred label: 大学 @zh-hans
definition: Institution der Lehre auf höherer Ebene, geeignet um Doktoren- und Professorentitel etc. zu verleihen. @de
definition: Institutions of higher learning capable of providing doctorate degrees
definition: Inrättning för forskning och högre eftergymnasial utbildning inom de viktigaste traditionella kunskapsområdena. @se
definition: Instituições de ensino superior capazes de atribuir grau de doutoramento. @pt-pt
definition: Instituições de ensino superior capazes de atribuir grau de doutorado. @pt-br
definition: Forskning og videregående uddannelse inden for de vigtigste traditionelle vidensområder. @dk
definition: 能提供博士学位的高等学校 @zh-hans
change note: Retired. Use medtop:20000405 college and university
in scheme: Media Topic
created: 2009-10-22T02:00:00+00:00
retired: 2021-09-30T12:00:00+00:00
modified: 2021-09-30T12:00:00+00:00
broader: college and university

global warming
type: Concept
preferred label: Réchauffement climatique @fr
preferred label: Klimaerwärmung @de
preferred label: Calentamiento global @es
preferred label: Global uppvärmning @se
preferred label: احتباس حراري @ar
preferred label: aquecimento global @pt-pt
preferred label: global opvarmning @dk
preferred label: 全球气候变暖 @zh-hans
preferred label: global oppvarming @no-nb
definition: This category includes all issues relating to global warming including temperature research, remote sensing on temperature trends, debate on global warming, ways to reduce emissions and carbon trading.
definition: Den konstaterade ökningen av medeltemperaturen på jordytan sedan slutet av 1800-talet. @se
definition: Diese Kategorie umfasst alle Probleme, in Bezug auf die globale Erwärmung, inklusive Klimaforschung, Ferndiagnose von Temperaturentwicklungen, Debatten um die Erderwärmung und Wege die Schadstoffemission und den Kohlenstoffgehalt zu verringern. @de
definition: Esta categoria inclui todos os assuntos relativos ao aquecimento global, incluindo investigação de temperaturas, deteção remota de tendências de temperaturas, debate sobre o aquecimento global, formas de reduzir emissões e comércio de carbono. @pt-pt
definition: Esta categoria inclui todos os assuntos relativos ao aquecimento global, incluindo investigação de temperaturas, sensoriamento remoto de tendências de temperaturas, debate sobre o aquecimento global, formas de reduzir emissões e comércio de carbono. @pt-br
definition: Det bemærkede stigning i gennemsnitstemperaturen på jordoverfladen siden slutningen af det 19. århundrede. @dk
definition: 这一分类包括与全球变暖有关的所有问题，包括气温研究、对温度变化趋势的遥感、关于全球变暖的讨论、减少排放的方法和碳交易 @zh-hans
change note: Retired. Use medtop:20000418 climate change instead.
in scheme: Media Topic
created: 2009-10-22T02:00:00+00:00
retired: 2025-06-30T12:00:00+00:00
modified: 2025-06-30T12:00:00+00:00
broader: climate change

energy saving
type: Concept
preferred label: Ahorro de energía @es
preferred label: Energibesparing @se
preferred label: Économies d'énergie @fr
preferred label: توفير الطاقة @ar
preferred label: Energiesparen @de
preferred label: poupança de energia @pt-pt
preferred label: energibesparelse @dk
preferred label: 节能 @zh-hans
preferred label: energiøkonomisering @no-nb
definition: Minskning av energianvändningen genom att avstå från tjänster och nyttigheter, t ex genom sänkning av inomhustemperaturen. @se
definition: Conservation of electrical, and other power sources
definition: Erhaltung elektronischer und anderer Energiequellen. @de
definition: Conservação da eletricidade e de outras fontes de energia. @pt-pt
definition: Reduktion af energiforbruget ved at afstå fra tjenester og værktøjer, f.eks. Ved at sænke indetemperaturen. @dk
definition: 节约电力和其他能源 @zh-hans
change note: Retired. Use medtop:20001374 sustainability instead.
in scheme: Media Topic
created: 2009-10-22T02:00:00+00:00
retired: 2025-06-30T12:00:00+00:00
modified: 2025-06-30T12:00:00+00:00
broader: conservation

nature preserve
type: Concept
preferred label: Nationalparker och naturreservat @se
preferred label: حدائق @ar
preferred label: Parcs naturels @fr
preferred label: Naturschutzgebiet @de
preferred label: Parques @es
preferred label: parques @pt-pt
preferred label: naturpark og reservat @dk
preferred label: 公园 @zh-hans
preferred label: parker @no-nb
preferred label: parkar @no-nn
definition: Land set aside for conservation and preservation of flora and fauna, such as national, state and provincial parks
definition: Områden med värdefulla naturmiljöer som med lagar skyddas från exploatering. @se
definition: Areale die für den Naturschutz geschaffen werden @de
definition: Áreas reservadas para preservação. @pt-pt
definition: Områder med værdifulde naturlige miljøer, der er beskyttet af love mod udnyttelse. @dk
definition: 为保护环境而留出的区域 @zh-hans
in scheme: Media Topic
created: 2009-10-22T02:00:00+00:00
modified: 2025-06-30T12:00:00+00:00
broader: conservation

environmental policy
type: Concept
preferred label: Umweltpolitik @de
preferred label: Politique de l'environnement @fr
preferred label: Política ambiental @es
preferred label: سياسات بيئية @ar
preferred label: Miljöpolitik @se
preferred label: políticas ambientais @pt-pt
preferred label: miljøpolitik @dk
preferred label: 环境政治 @zh-hans
preferred label: miljøpolitikk @no-nb
definition: Government programs and policies related to environmental issues, such as pollution, renewable energy and conservation
definition: Politiska program gällande miljö och klimat såsom miljöskydd, föroreningar, förnybar energi och bevarandefrågor. @se
definition: Die Debatte um umweltpolitische Fragen @de
definition: Debate sobre política ambiental. @pt-pt
definition: Politiske foranstaltninger, der sigter mod at forhindre overudnyttelse og ødelæggelse af miljøet. @dk
definition: 关于环境政策的讨论 @zh-hans
in scheme: Media Topic
created: 2009-10-22T02:00:00+00:00
modified: 2025-03-31T12:00:00+00:00
broader: government policy

air pollution
type: Concept
preferred label: تلوث جو @ar
preferred label: Contaminación del aire @es
preferred label: Luftföroreningar @se
preferred label: Luftverschmutzung @de
preferred label: Pollution de l'air @fr
preferred label: poluição atmosférica @pt-pt
preferred label: luftforurening @dk
preferred label: 空气污染 @zh-hans
preferred label: luftforurensning @no-nb
preferred label: luftforureining @no-nn
definition: Feste und gasförmige Stoffe, die die Qualität der Luft, die wir atmen beeinflusst @de
definition: Contaminants affecting the quality of the air
definition: Ämnen som förekommer i atmosfären i så stor mängd att det kan skada människor, djur, växter eller föremål. @se
definition: Matéria sólida ou gasosa que afeta a qualidade do ar que respiramos. @pt-pt
definition: Stoffer, der er til stede i atmosfæren i en så stor mængde, at det kan skade mennesker, dyr, planter eller genstande. @dk
definition: 影响我们呼吸的空气质量的固态或气态物质 @zh-hans
in scheme: Media Topic
created: 2009-10-22T02:00:00+00:00
modified: 2025-10-09T12:00:00+00:00
broader: environmental pollution

environmental clean-up
type: Concept
preferred label: Miljösanering @se
preferred label: Descontaminación @es
preferred label: تنظيف البيئة @ar
preferred label: Umweltsäuberung @de
preferred label: Dépollution @fr
preferred label: limpeza ambiental @pt-pt
preferred label: miljøoprensning @dk
preferred label: 环境清理 @zh-hans
preferred label: miljøopprydding @no-nb
definition: Åtgärder som syftar till att befria en plats från något skadligt och göra den beboelig igen, antingen för människor eller djur. @se
definition: Prozess bei dem verseuchte Gebiete von schädlichem Material gereinigt werden, sodass diese wieder bewohnbar sind für Menschen und Tiere. @de
definition: The removal of hazardous materials from contaminated areas
definition: Processos através dos quais áreas contaminadas são limpas de materiais perigosos, para que possam ser novamente habitadas por pessoas ou animais. @pt-pt
definition: Foranstaltninger, der sigter mod at befri et sted fra noget skadeligt og gøre det beboeligt igen, enten for mennesker eller dyr. @dk
definition: 对受污染区域的有害物质进行清理，以便人们或动物再次居住的过程 @zh-hans
in scheme: Media Topic
created: 2009-10-22T02:00:00+00:00
modified: 2025-10-09T12:00:00+00:00
broader: environmental pollution

hazardous material
type: Concept
preferred label: Farligt avfall @se
preferred label: Giftstoff @de
preferred label: Materiales tóxicos @es
preferred label: Matières dangereuses @fr
preferred label: مواد خطيرة @ar
preferred label: materiais perigosos @pt-pt
preferred label: farligt affald @dk
preferred label: 有害物质 @zh-hans
preferred label: farlig gods @no-nb
preferred label: farleg gods @no-nn
definition: Avfall som bedömts utgöra ett särskilt starkt hot mot miljön och därför måste omhändertas med särskild försiktighet och under särskilda bestämmelser. @se
definition: Materialien, die für Mensch und Tier gefährlich sind, wenn diese mit ihnen in Kontakt kommen. Umfasst Radioaktivität, giftige Gase, Chemikalien, Schwermetalle, PCBs, und bestimmte pflanzliche Produkte. @de
definition: Materials that are harmful to humans or animals if they are exposed to them, such as radiation, poison gases, chemicals, heavy metals, PCBs, mircoplastics and certain plant products
definition: Materiais perigosos para o homem e para os animais quando expostos a eles. Inclui radiação, gases venenosos, químicos, metais pesados, PCB e certos produtos vegetais. @pt-pt
definition: Materiais perigosos para o homem e para os animais quando expostos a eles. Inclui radiação, gases venenosos, químicos, metais pesados, PCB, certos produtos vegetais etc. @pt-br
definition: Materialer, der er skadelige for mennesker og dyr, hvis de udsættes for dem. Omfatter stråling, giftgasser, kemikalier, tungmetaller, PCB og visse planteprodukter. @dk
definition: 指人类或动物暴露其中会造成危害的物质，包括辐射、有毒气体、化学品、重金属、多氯联苯，和某些植物产品 @zh-hans
in scheme: Media Topic
created: 2009-10-22T02:00:00+00:00
modified: 2025-10-09T12:00:00+00:00
broader: environmental pollution

waste material
type: Concept
preferred label: Avfall @se
preferred label: Residuos @es
preferred label: Abfall @de
preferred label: Déchets @fr
preferred label: نفايات @ar
preferred label: resíduos @pt-pt
preferred label: affald og genanvendelse @dk
preferred label: 废物 @zh-hans
preferred label: avfall @no-nb
definition: Skräpets påverkan på miljön, inklusive återvinning. @se
definition: The environmental impact of waste, including recycling efforts
definition: Umweltbelastung durch Müll, inklusive Wiederverwertung @de
definition: Impacto ambiental do lixo, incluindo os esforços de reciclagem. @pt-pt
definition: Miljøpåvirkning af affald, herunder genanvendelsesindsats. @dk
definition: 如垃圾对环境的影响，包括垃圾回收工作 @zh-hans
in scheme: Media Topic
created: 2009-10-22T02:00:00+00:00
modified: 2025-10-09T12:00:00+00:00
broader: environmental pollution

water pollution
type: Concept
preferred label: Pollution de l'eau @fr
preferred label: Contaminación del agua @es
preferred label: Vattenföroreningar @se
preferred label: تلوث مياه @ar
preferred label: Wasserverschmutzung @de
preferred label: poluição da água @pt-pt
preferred label: vandforurening @dk
preferred label: 水污染 @zh-hans
preferred label: vannforurensning @no-nb
preferred label: vassforureining @no-nn
definition: Contaminants affecting the quality of water
definition: Ämnen som förekommer i vatten i så stor mängd att det kan skada människor, djur och växter. @se
definition: Feste und flüssige Stoffe, die die Qualität des Wassers verschlechtern, was als Trinkwasser oder zur Bewässerung genutzt werden könnte. @de
definition: Sólidos ou líquidos que contaminam a qualidade da água que podia ser usada para beber ou regar. @pt-pt
definition: Stoffer, der er til stede i vand i en så stor mængde, at det kan skade mennesker, dyr og planter. @dk
definition: 破坏饮用或灌溉用水水质的固体或液体 @zh-hans
in scheme: Media Topic
created: 2009-10-22T02:00:00+00:00
modified: 2025-10-09T12:00:00+00:00
broader: environmental pollution

energy resources
type: Concept
preferred label: Énergie @fr
preferred label: موارد طاقة @ar
preferred label: Energiresurser @se
preferred label: Recursos energéticos @es
preferred label: Rohstoff @de
preferred label: recursos energéticos @pt-pt
preferred label: energiressource @dk
preferred label: 能源资源 @zh-hans
preferred label: energikilde @no-nb
preferred label: energikjelde @no-nn
definition: Rohstoffe wie Kohle, Gas, Wind, Sonne, die genutzt werden um Wärme, Elektrizität und Strom zu erzeugen. @de
definition: Such resources as coal, gas, wind, sunlight etc., used to generate heat, electricity and power
definition: Resurser såsom kol, gas, vind, solljus och så vidare, som används för att generera värme och el. @se
definition: Recursos como carvão, gás, vento, luz solar, etc., usados para produzir calor, eletricidade e energia. @pt-pt
definition: Recursos como carvão, gás, vento, luz solar etc., usados para produzir calor, eletricidade e energia. @pt-br
definition: Ressourcer som kul, gas, vind, sollys osv., Der bruges til at generere varme, elektricitet og strøm. @dk
definition: 指用于生成热、电和动力的资源，如煤、天然气、风能、阳光等 @zh-hans
change note: Retired. Use the relevant term from the business branch instead.
in scheme: Media Topic
created: 2009-10-22T02:00:00+00:00
retired: 2025-06-30T12:00:00+00:00
modified: 2025-06-30T12:00:00+00:00
broader: natural resource

land resources
type: Concept
preferred label: Réserve naturelle @fr
preferred label: Recursos terrestres @es
preferred label: ثروات باطنية @ar
preferred label: Landresurser @se
preferred label: Land @de
preferred label: recursos terrestres @pt-pt
preferred label: jordressource @dk
preferred label: 土地资源 @zh-hans
preferred label: landressurs @no-nb
preferred label: landressursar @no-nn
definition: Der Teil eines Landes oder Staates, der oberhalb des Wassers liegt und zur Verfügung steht, sowohl für Profitzwecke als auch zur öffentlichen Nutzung @de
definition: That portion of a nation or state that is above water and available for development either for profit or for the general good of the public
definition: Den del av ett land som är över vattenytan och tillgänglig för utveckling, antingen i vinstdrivande syfte eller för allmänhetens bästa. @se
definition: Porção de uma nação ou estado que está acima do nível da água e disponível para o desenvolvimento de lucros ou para o bem geral do público. @pt-pt
definition: Den del af et land, der er over vandoverfladen og tilgængelig til udvikling, enten med fortjeneste for øje eller til gavn for almenheden. @dk
definition: 一个国家或州的位于水以上的部分，为了盈利或公共利益可以进行开发 @zh-hans
change note: Retired. Use the relevant term for what is happening on the land, such as commercial real estate, housing and urban planning policy, etc.
in scheme: Media Topic
created: 2009-10-22T02:00:00+00:00
retired: 2025-06-30T12:00:00+00:00
modified: 2025-06-30T12:00:00+00:00
broader: natural resource

population growth
type: Concept
preferred label: Befolkningstillväxt @se
preferred label: Crecimiento demográfico @es
preferred label: نمو سكاني @ar
preferred label: Croissance de la population @fr
preferred label: Bevölkerungsentwicklung @de
preferred label: crescimento demográfico @pt-pt
preferred label: befolkningstilvækst @dk
preferred label: 人口增长 @zh-hans
preferred label: befolkningsvekst @no-nb
definition: Wachstum und Entwicklung der Menschen innerhalb einer natürlichen Umgebung. @de
definition: Ökning av folkmängden i ett givet område. @se
definition: People and their growth and development within a natural setting
definition: As pessoas, o seu crescimento e desenvolvimento dentro do seu ambiente natural. @pt-pt
definition: As pessoas, seu crescimento e desenvolvimento dentro de seu ambiente natural. @pt-br
definition: Stigning i befolkningen i et givet område. @dk
definition: 人及其在自然环境中的成长和发展 @zh-hans
change note: Retired. Use population and census (medtop:20000774) instead.
in scheme: Media Topic
created: 2009-10-22T02:00:00+00:00
retired: 2025-06-30T12:00:00+00:00
modified: 2025-06-30T12:00:00+00:00
broader: natural resource

renewable energy
type: Concept
preferred label: طاقة متجددة @ar
preferred label: Energías renovables @es
preferred label: Förnybar energi @se
preferred label: Énergies renouvelables @fr
preferred label: Erneuerbare Energien @de
preferred label: energias renováveis @pt-pt
preferred label: vedvarende energi @dk
preferred label: 可再生能源 @zh-hans
preferred label: fornybar energi @no-nb
definition: The environmental impact of renewable energy, including solar, wind, hydro, biomass and geothermal
definition: Artikel über das Vorkommen von erneuerbaren Energien in der Umwelt, wie Solar, Wind, Wasser, Biomasse und Erdwärme @de
definition: Energikällor som direkt eller indirekt baseras på solinstrålning och därigenom fortlöpande förnyas i samma takt som de används, t ex solkraft, vindkraft, vattenkraft och geotermisk energi. @se
definition: Impacto ambiental das energias renováveis, incluindo energia solar, eólica, hidroenergia, biomassa e energia geotérmica. @pt-pt
definition: Histórias sobre o impacto ambiental das energias renováveis, incluindo energia solar, eólica, hidrenergia, biomassa e energia geotérmica. @pt-br
definition: Energikilder, der direkte eller indirekte er baseret på solstråling og derved kontinuerligt fornyes i samme hastighed som de bruges, f.eks. Solenergi, vindkraft, vandkraft og geotermisk energi. @dk
definition: 可再生能源对环境的影响，包括太阳能、风能、水能、生物质能发电和地热能 @zh-hans
change note: Retired. Use medtop:20000431 energy resources for environmental impacts or medtop:20000257 renewable energy for the general concept.
in scheme: Media Topic
created: 2009-10-22T02:00:00+00:00
retired: 2023-03-31T12:00:00+00:00
modified: 2023-03-31T12:00:00+00:00
broader: natural resource

water
type: Concept
preferred label: Distribution de l'eau @fr
preferred label: Wasser @de
preferred label: مياه @ar
preferred label: Agua @es
preferred label: Vatten @se
preferred label: água @pt-pt
preferred label: vand @dk
preferred label: 水资源 @zh-hans
preferred label: vann @no-nb
preferred label: vatn @no-nn
definition: Miljöfrågor som avser vatten, inklusive hav, sjöar, floder, glaciärer och is. @se
definition: Environmental issues about bodies of water, including oceans, lakes, streams and reservoirs, as well as ice, glaciers and forms of precipitation
definition: Umweltprobleme von Wassereinheiten, inklusive Meere, Seen, Flüsse und Reservoire, sowie Eis, Gletscher und Formen des Niederschlags @de
definition: Questões ambientais sobre massas de água, incluindo oceanos, lagos, ribeiros e reservatórios, mas também gelo, glaciares e formas de precipitação. @pt-pt
definition: Questões ambientais sobre massas de água, incluindo oceanos, lagos, ribeiros e reservatórios, mas também gelo, geleiras e formas de precipitação. @pt-br
definition: Miljøspørgsmål vedrørende vand, herunder hav, søer, floder, gletsjere og is. @dk
definition: 关于水体的环境问题，包括海洋、湖泊、溪流和水库，以及冰、冰川和降水形式 @zh-hans
change note: Retired. Use medtop:20000270 water supply, medtop:20000438 ocean, medtop:20000439 river or other more specific term.
in scheme: Media Topic
created: 2009-10-22T02:00:00+00:00
retired: 2025-10-09T12:00:00+00:00
modified: 2021-02-18T12:00:00+00:00
broader: natural resource

forest
type: Concept
preferred label: غابات @ar
preferred label: Forêts @fr
preferred label: Wald @de
preferred label: Bosques @es
preferred label: Skogar @se
preferred label: florestas @pt-pt
preferred label: skov @dk
preferred label: 森林 @zh-hans
preferred label: skog @no-nb
definition: Öffentliche Baumgebiete, die sowohl zur Erholung oder für kommerzielle Zwecke genutzt werden. @de
definition: Större område, som är tätt bevuxet med träd, vilt eller planterat. @se
definition: Open areas of trees either available for public enjoyment, or for commercial purposes
definition: Zonas abertas arborizadas para divertimento público ou fins comerciais. @pt-pt
definition: Åbne områder med træer, der enten er tilgængelige til offentlig fornøjelse eller til kommercielle formål. @dk
definition: 可供公众享用或商业用途的树木开放区 @zh-hans
in scheme: Media Topic
created: 2009-10-22T02:00:00+00:00
modified: 2025-06-30T12:00:00+00:00
broader: nature

mountain
type: Concept
preferred label: Montañas @es
preferred label: Berg @se
preferred label: جبال @ar
preferred label: Montagnes @fr
preferred label: montanhas @pt-pt
preferred label: bjerg @dk
preferred label: 山脉 @zh-hans
preferred label: fjell @no-nb
definition: Större upphöjning av jordytan, vanligtvis bestående av sten, helst med jämförelsevis branta sidor eller med avsevärd höjd över omgivningen. @se
definition: Elevated land masses formed over the ages either by erosion, volcanic eruption, or movement of massive geographical formations called plates
definition: Erhöhte Landmassen, die sich über die Jahre durch Erosion, Vulkanausbrüche, oder aus der Bewegung massiver geografischer Formationen, Platten genannt, gebildet haben. @de
definition: Elevações de terreno, formadas ao longo dos tempos por erosão, erupção vulcânica ou movimento de grandes formações geográficas chamadas placas. @pt-pt
definition: Forhøjede landmasser dannet gennem tiderne enten ved erosion, vulkanudbrud eller bevægelse af massive geografiske formationer kaldet plader. @dk
definition: 由侵蚀、火山爆发或称为板块的大规模地理构造运动而形成的隆起的陆地 @zh-hans
in scheme: Media Topic
created: 2009-10-22T02:00:00+00:00
modified: 2025-06-30T12:00:00+00:00
broader: nature

ocean
type: Concept
preferred label: Océanos @es
preferred label: محيطات @ar
preferred label: Océans @fr
preferred label: Ozean @de
preferred label: Hav @se
preferred label: oceanos @pt-pt
preferred label: have @dk
preferred label: 大洋 @zh-hans
preferred label: hav @no-nb
definition: Det sammanhängande vattenområde som omger jordens kontinenter, vanligtvis synonymt med världshavet eller oceanerna. @se
definition: Salzwassermassen, die Kontinente oder andere große geografische Landmassen trennen. Kleinere Formen sind, Meere, Seen und Teiche @de
definition: The body of salt water that covers nearly three fourths of the surface of the earth
definition: Massas de água salgada que separam continentes ou outras massas geográficas grandes. Inclui formas mais pequenas como mares, lagos ou lagoas. @pt-pt
definition: Det sammenhængende vandområde, der omgiver jordens kontinenter, normalt synonymt med verdenshavet eller verdenshavene. @dk
definition: 分隔大陆或其它主要地理区域的盐水域。较小的形式是海、湖泊或池塘等 @zh-hans
in scheme: Media Topic
created: 2009-10-22T02:00:00+00:00
modified: 2025-06-30T12:00:00+00:00
broader: nature

river
type: Concept
preferred label: Fluß @de
preferred label: انهار @ar
preferred label: Floder, älvar och åar @se
preferred label: Rivières @fr
preferred label: Ríos @es
preferred label: rios @pt-pt
preferred label: flod og å @dk
preferred label: 河流 @zh-hans
preferred label: elv @no-nb
definition: Större rinnande vattendrag med i stort sett parallella sidor, vanligtvis med funktionen att avvattna en sjö eller dylikt. @se
definition: Fließende Wassermassen durch Land begrenzt, die aus Quellen in der Erde entstehen, sich durch Landflächen schlängeln und mit anderen Wasserläufen verbinden. Kleine Formen sind Bäche, Rinnsale und Ströme. @de
definition: Moving water areas bounded by land that extend from earth sources and meander through land areas to join with other water areas
definition: Água corrente limitada por terra, que se estende das nascentes e serpenteia por terra até se unir a outras massas de água. Inclui formas mais pequenas, como afluentes, regatos, ribeiros, etc. @pt-pt
definition: Água corrente limitada por terra, que se estende das nascentes e serpenteia por terra até se unir a outras massas de água. Inclui formas mais pequenas, como afluentes, regatos, ribeirões etc. @pt-br
definition: Bevægelse af vandområder afgrænset af jord, der strækker sig fra jordkilder og bugter gennem landområder for at samle sig med andre vandområder. I mindre former er de bæk, klinker, vandløb osv.. @dk
definition: 以陆地为界的流动水域，其从源头延伸，蜿蜒流过陆地，与其他水域汇合。较小的形式是小河、溪流等 @zh-hans
in scheme: Media Topic
created: 2009-10-22T02:00:00+00:00
modified: 2025-06-30T12:00:00+00:00
broader: nature

wetland
type: Concept
preferred label: Feuchtgebiet @de
preferred label: Marais @fr
preferred label: Pantanos @es
preferred label: اراضي رطبة @ar
preferred label: Våtmarker @se
preferred label: zonas húmidas @pt-pt
preferred label: zonas úmidas @pt-br
preferred label: vådområde @dk
preferred label: 湿地 @zh-hans
preferred label: våtmark @no-nb
definition: Gebiete die im Allgemeinen feucht sind und weder unter Wasser liegen, noch trockenes Land sind. Oft wasserführend für die Wasserqualität oder Wildnis. @de
definition: Ett område i naturen som hela tiden eller ibland är dränkt i vatten. @se
definition: Areas generally marshy and not either under water or dry land. Often related to aquifers for water quality and/or wildlife
definition: Áreas geralmente pantanosas e que não estão debaixo de água, nem em terra seca. Frequentemente em relação a aquíferos para a qualidade da água e/ou vida selvagem. @pt-pt
definition: Áreas geralmente pantanosas e que não estão debaixo de água, nem em terra seca. Frequentemente em relação com aquíferos para a qualidade da água e/ou vida selvagem. @pt-br
definition: Et område i naturen, som konstant eller undertiden, er nedsænket i vand. @dk
definition: 通常是沼泽区域，既不在水下也不在陆地上。经常与含水层的水质和/或野生动物有关 @zh-hans
in scheme: Media Topic
created: 2009-10-22T02:00:00+00:00
modified: 2025-06-30T12:00:00+00:00
broader: nature

ecosystem
type: Concept
preferred label: Ekosystem @se
preferred label: Ökosystem @de
preferred label: نظام بيئي @ar
preferred label: Écosystème @fr
preferred label: Ecosistema @es
preferred label: ecossistema @pt-pt
preferred label: økosystem @dk
preferred label: 生态系统 @zh-hans
definition: Ein System von Pflanzen, Tieren und Bakterien zusammenhängend in physikalischer und chemischer Umgebung @de
definition: Enhet som innefattar alla organismer och deras omgivning inom ett område t ex en sjö eller en skog. @se
definition: Interacting organisms, such as plants, animals, and bacteria, and their environment
definition: Sistema de plantas, animais e bactérias inter-relacionados no seu ambiente físico e químico. @pt-pt
definition: Sistema de plantas, animais e bactérias inter-relacionados em seu ambiente físico e químico. @pt-br
definition: Enhed, der inkluderer alle organismer og deres miljø i et område såsom en sø eller en skov. @dk
definition: 植物、动物和细菌在其物理/化学环境中相互关联的系统 @zh-hans
in scheme: Media Topic
created: 2009-10-22T02:00:00+00:00
modified: 2025-10-09T12:00:00+00:00
broader: nature

endangered species
type: Concept
preferred label: Artenschutz @de
preferred label: Utrotningshotade arter @se
preferred label: Especies en peligro @es
preferred label: Espèce menacée @fr
preferred label: انواع مهددة @ar
preferred label: espécies ameaçadas @pt-pt
preferred label: truet art @dk
preferred label: 濒危物种 @zh-hans
preferred label: truede arter @no-nb
preferred label: sterkt trua artar @no-nn
definition: Species in danger of disappearing due to factors such as changes in environment, hunting, human encroachment on their environment or changes in climate
definition: Arter som riskerar att inom en nära framtid helt försvinna från ett bestämt område eller från hela jorden, i strikt bemärkelse på grund av aktiv förföljelse från människan. @se
definition: Die Arten der Wildnis, die vom Aussterben bedroht sind, meist aufgrund sich ändernder Umweltbedingungen, Jagd oder Wetter @de
definition: Espécies em risco de extinção, em grande parte devido a alterações no ambiente, à caça ou ao clima. @pt-pt
definition: Arter, der sandsynligvis forsvinder fuldstændigt i en nær fremtid fra et bestemt område eller fra hele jorden, dels på grund af aktiv forfølgelse fra mennesker eller ændringer i miljø og vejr. @dk
definition: 主要是因为环境、狩猎或气候的变化面临灭绝危险的物种 @zh-hans
in scheme: Media Topic
created: 2009-10-22T02:00:00+00:00
modified: 2025-10-09T12:00:00+00:00
broader: nature

invasive species
type: Concept
preferred label: Especies invasoras @es
preferred label: Espèces envahissantes @fr
preferred label: Invasiva arter @se
preferred label: انواع غازية @ar
preferred label: Invasive Arten @de
preferred label: espécies invasoras @pt-pt
preferred label: espécie invasora @pt-br
preferred label: invasiv art @dk
preferred label: 外来入侵物种 @zh-hans
preferred label: fremmede arter @no-nb
preferred label: framande artar @no-nn
definition: Icke ursprungliga arter vilka påverkar det ekosystem som arterna koloniserar. @se
definition: Nicht-einheimische Pflanzen, Tiere und andere Organismen, die einheimische Arten oft vertreiben @de
definition: Non-native plants, animals or other organisms that cause harm to native species by outcompeting them, altering native habitats or disrupting ecosystems
definition: Plantas, animais ou outros organismos não nativos que tendem a sobrepor-se às espécies nativas. @pt-pt
definition: Ikke-oprindelige arter, der påvirker økosystemet, ved at skade de oprindelige arter. @dk
definition: 趋向于取代本地物种的非本地的植物、动物和其他生物 @zh-hans
in scheme: Media Topic
created: 2009-10-22T02:00:00+00:00
modified: 2025-10-09T12:00:00+00:00
broader: nature

animal
type: Concept
preferred label: Animales @es
preferred label: Tier @de
preferred label: Djur @se
preferred label: Animaux @fr
preferred label: حيوان @ar
preferred label: animais @pt-pt
preferred label: dyr @dk
preferred label: 动物 @zh-hans
definition: All animals, including pets, wildlife, insects, and livestock
definition: Nyheter om djur där fokus ligger på känslomässiga saker. @se
definition: Tiere mit Blick auf emotionale Aspekte @de
definition: Itens sobre animais, com foco em facetas emocionais. @pt-pt
definition: Nyheder om dyr. @dk
definition: 关注情感层面的动物条目 @zh-hans
in scheme: Media Topic
created: 2009-10-22T02:00:00+00:00
modified: 2025-10-09T12:00:00+00:00
broader: nature
narrower: animal disease
narrower: pest and pest control

flowers and plants
type: Concept
preferred label: Pflanze @de
preferred label: Plantas @es
preferred label: Växter @se
preferred label: Plantes @fr
preferred label: نبتة @ar
preferred label: plantas @pt-pt
preferred label: plante @dk
preferred label: 植物 @zh-hans
preferred label: planter og blomster @no-nb
definition: All plants, including flowers, trees, and shrubs
definition: Pflanzen mit Blick auf emotionale Aspekte @de
definition: Nyheter om växter där fokus är på känslomässiga saker. @se
definition: Itens sobre plantas, com foco em facetas emocionais. @pt-pt
definition: Nyheder om planter. @dk
definition: 植物关于感情方面的条目 @zh-hans
in scheme: Media Topic
created: 2009-10-22T02:00:00+00:00
modified: 2025-10-09T12:00:00+00:00
broader: nature
narrower: plant disease

cancer
type: Concept
preferred label: Cancer @fr
preferred label: سرطان @ar
preferred label: Cáncer @es
preferred label: Krebs @de
preferred label: cancro @pt-pt
preferred label: câncer @pt-br
preferred label: kræft @dk
preferred label: 癌症 @zh-hans
preferred label: kreft @no-nb
definition: Eine ernsthafte und meist tödliche Krankheit, bei der sich Zellen zu Tumoren entwickeln @de
definition: En svår tumörsjukdom med okontrollerad celltillväxt varvid de nya cellerna förstör den omgivande vävnaden, ofta dödlig. @se
definition: A serious and often fatal disease caused when normal cells mutate into tumours
definition: Doença grave e muitas vezes fatal, com origem na mutação de células normais em tumores. @pt-pt
definition: En alvorlig tumorsygdom med ukontrolleret cellevækst, hvorved de nye celler ødelægger det omgivende væv, ofte dødeligt. @dk
definition: 正常细胞突变为肿瘤时引起的一种严重且通常是致命的疾病 @zh-hans
definition: A serious and often fatal disease caused when normal cells mutate into tumors
definition: Ein alvorleg og ofte dødeleg sjukdom der normale celler muterer eller deler seg ukontrollert. @no-nn
definition: En alvorlig sykdom - ofte med dødelig utfall - der normalle celler muteres eller deler seg ukontrollert. @no-nb
in scheme: Media Topic
created: 2009-10-22T02:00:00+00:00
modified: 2021-02-18T12:00:00+00:00
broader: disease and condition

communicable disease
type: Concept
preferred label: Maladies contagieuses @fr
preferred label: Enfermedades contagiosas @es
preferred label: Smittsamma sjukdomar @se
preferred label: Ansteckende Krankheit @de
preferred label: مرض معد @ar
preferred label: doenças transmissíveis @pt-pt
preferred label: smitsom sygdom @dk
preferred label: 传染病 @zh-hans
preferred label: smittsomme sykdommer @no-nb
preferred label: infeksjonssjukdom @no-nn
definition: Diseases that can be transmitted from one person or animal to another
definition: Krankheiten, die von einem Menschen oder Tier zu einem anderen übertragen werden können @de
definition: Sjukdomar som kan överföras från en människa till en annan. @se
definition: Doenças que podem ser transmitidas de um indivíduo (pessoa ou animal) a outro. @pt-pt
definition: Sygdomme, der kan overføres fra en person eller et dyr til en anden. @dk
definition: 可以从一个人或动物传染给另一个人或动物的疾病 @zh-hans
definition: Sjukdommar som kan overførast frå eitt menneske eller dyr til eit anna. @no-nn
definition: Sykdommer som kan overføres fra ett menneske eller dyr til et annet. @no-nb
in scheme: Media Topic
created: 2009-10-22T02:00:00+00:00
modified: 2021-02-18T12:00:00+00:00
broader: disease and condition
narrower: epidemic and pandemic
narrower: viral disease

heart disease
type: Concept
preferred label: امراض قلب @ar
preferred label: Enfermedades cardíacas @es
preferred label: Herzkrankheit @de
preferred label: Hjärt- och kärlsjukdomar @se
preferred label: Maladie cardiaque @fr
preferred label: doença cardíaca @pt-pt
preferred label: hjertekarsygdomme @dk
preferred label: 心脏病 @zh-hans
preferred label: hjerte- og karsykdom @no-nb
preferred label: hjarte- og karsjukdom @no-nn
definition: Samlingsbenämning på sjukdomar som drabbar hjärtat, blodkärlen eller bådadera. @se
definition: Eine verbreitete und ernsthafte Krankheit, verursacht durch die Verengung der Gefäße, die das Herz versorgen. @de
definition: Diseases and conditions affecting the heart such as heart attacks, the narrowing of arteries, arrhythmia or cardiomyopathy
definition: Doença degenerativa grave causada pelo estreitamento das artérias que alimentam o coração. @pt-pt
definition: En samlet betegnelse for sygdomme, der påvirker hjertet, blodkarrene eller begge dele. @dk
definition: 由于心脏供血的动脉狭窄引起的严重退化性疾病 @zh-hans
in scheme: Media Topic
created: 2009-10-22T02:00:00+00:00
modified: 2022-06-14T12:00:00+00:00
broader: disease and condition

illness
type: Concept
preferred label: مرض @ar
preferred label: Leiden @de
preferred label: Maladie @fr
preferred label: Enfermedades @es
preferred label: Åkommor @se
preferred label: doenças @pt-pt
preferred label: outras doenças @pt-br
preferred label: øvrig sygdom @dk
preferred label: 疾病 @zh-hans
preferred label: øvrig sykdom @no-nb
preferred label: annan sjukdom @no-nn
definition: Non-specific maladies such as stomach aches, headaches, flat feet, lumbago
definition: Ospecificerade sjukdomar, såsom magknip, huvudvärk, ryggskott och liknande. @se
definition: Unspezifische Krankheiten wie Magenschmerzen, Kopfschmerzen, Plattfüße, Hexenschuss. @de
definition: Doenças não específicas como dores de estômago, dores de cabeça, pé chato, lumbago. @pt-pt
definition: Doenças não específicas como dores de estômago, dores de cabeça, pé plano, lumbago. @pt-br
definition: Ikke-specifikke sygdomme såsom mavepine, hovedpine, flade fødder og lumbago. @dk
definition: 非特定疾病，如胃痛、头痛、平脚、腰痛 @zh-hans
change note: Retired. Use a more specific term or medtop:20000446 disease and condition instead.
in scheme: Media Topic
created: 2009-10-22T02:00:00+00:00
retired: 2022-06-14T12:00:00+00:00
modified: 2022-06-14T12:00:00+00:00
broader: disease and condition

injury
type: Concept
preferred label: Blessure @fr
preferred label: Lesiones @es
preferred label: اصابة @ar
preferred label: Invalidität @de
preferred label: Kroppsskador @se
preferred label: traumatismos @pt-pt
preferred label: fysisk skade @dk
preferred label: 受伤 @zh-hans
preferred label: skade @no-nb
definition: Eine traumatische körperliche Beeinträchtigung, verursacht durch äußerliche Gewalteinwirkung. @de
definition: Ett traumatiskt, kroppsligt tillstånd vanligen orsakat av yttre våld. @se
definition: Harm caused to the human body by external forces such as falls, weapons or accidents
definition: Condição traumática do corpo, geralmente causada por forças externas. @pt-pt
definition: Fysiske skader på kroppen. @dk
definition: 通常由外力引起的人体创伤 @zh-hans
in scheme: Media Topic
created: 2009-10-22T02:00:00+00:00
modified: 2022-06-14T12:00:00+00:00
broader: disease and condition

medical condition
type: Concept
preferred label: شروط طبية @ar
preferred label: Condiciones médicas @es
preferred label: Krankheitsverlauf @de
preferred label: État de santé @fr
preferred label: Medicinska tillstånd @se
preferred label: condições médicas @pt-pt
preferred label: medicinsk tilstand @dk
preferred label: 病况 @zh-hans
preferred label: medisinsk tilstand @no-nb
definition: Olika nivåer av sjukdom eller skada. @se
definition: Verschiedene Stadien von Krankheit, Leiden oder Verletzung. @de
definition: An abnormal condition that affects the structure and functioning of the body, such as chronic pain, high blood pressure or osteoporosis
definition: Estados de evolução de doenças ou feridas. @pt-pt
definition: Forskellige niveauer af sygdomme eller skader. @dk
definition: 不同阶段的疾病或损伤 @zh-hans
in scheme: Media Topic
created: 2009-10-22T02:00:00+00:00
modified: 2024-07-01T12:00:00+00:00
broader: disease and condition
narrower: obesity

mental health and disorder
type: Concept
preferred label: Psychische Krankheit @de
preferred label: Enfermedades mentales y comportamentales @es
preferred label: اضطراب عقلي وسلوكي @ar
preferred label: Psykisk ohälsa @se
preferred label: Troubles mentaux et comportementaux @fr
preferred label: distúrbios mentais e comportamentais @pt-pt
preferred label: psykisk og adfærdsmæssig lidelse @dk
preferred label: 精神和行为障碍 @zh-hans
preferred label: psykisk helse @no-nb
preferred label: mental health
definition: Tillstånd av psykisk ohälsa som drabbar personligheten, känslolivet och kognitionen. @se
definition: The psychological well-being of an individual and the diseases and disorders that affect mood, thinking and behaviour as well as actions taken to bring improvement and awareness to these conditions
definition: Die Krankheiten, die die Psyche und das Verhalten betreffen @de
definition: Doenças e distúrbios que afetam a mente e o comportamento. @pt-pt
definition: Sygdomme og lidelser, der påvirker sindet og adfærden. @dk
definition: 影响精神和行为的疾病和失调 @zh-hans
in scheme: Media Topic
created: 2009-10-22T02:00:00+00:00
modified: 2022-06-14T12:00:00+00:00
broader: disease and condition
narrower: eating disorder
narrower: depression
narrower: anxiety and stress
broad match: http://cv.iptc.org/newscodes/subjectcode/07000000

poisoning
type: Concept
preferred label: forgiftning @no-nb
preferred label: Förgiftning @se
preferred label: forgifting @no-nn
preferred label: Envenenamiento @es
preferred label: Empoisonnement @fr
preferred label: تسمم @ar
preferred label: Vergiftung @de
definition: When a substance in sufficient quantity adversely affects the body and its functions
definition: När någon får i sig ett ämne i så stor dos att det skadar personen. @se
definition: Wenn eine Substanz in ausreichender Menge den Körper und seine Funktionen nachteilig beeinflusst @de
in scheme: Media Topic
created: 2021-05-05T12:00:00+00:00
modified: 2021-12-21T12:00:00+00:00
broader: disease and condition

developmental disorder
type: Concept
preferred label: Trastorno del desarrollo @es
preferred label: Trouble du développement @fr
preferred label: اضطراب نمائي @ar
preferred label: utviklingsforstyrring @no-nn
preferred label: utviklingsforstyrrelse @no-nb
preferred label: Entwicklungsstörung @de
preferred label: Funktionsnedsättning @se
definition: Conditions due to an impairment in learning, language or behaviour areas, such as autism, Aspergers and dyslexia
definition: Conditions due to an impairment in learning, language or behavior areas, such as autism, Aspergers and dyslexia
definition: Till följd av en medfödd eler förvärvad skada har en människa har nedsatt förmåga att fungera fysiskt eller psykiskt. @se
definition: Bedingungen aufgrund einer Beeinträchtigung in den Bereichen Lernen, Sprache oder Verhalten, wie z. B. Autismus, Asperger und Legasthenie @de
in scheme: Media Topic
created: 2022-06-14T12:00:00+00:00
modified: 2022-06-14T12:00:00+00:00
broader: disease and condition

epidemic and pandemic
type: Concept
preferred label: Epidemie @de
preferred label: وبائي @ar
preferred label: Épidémie @fr
preferred label: Epidemias @es
preferred label: Epidemier @se
preferred label: epidemia @pt-pt
preferred label: epidemi @dk
preferred label: 流行病 @zh-hans
preferred label: epidemier og pandemier @no-nb
definition: A disease that affects a large number of people within a community, population, region or that has spread to multiple countries or continents across the world
definition: Eine Epidemie ist ein sich in einer Gemeinschaft rasch verbreitender Zustand, eine Plage ist eine meist tödliche Krankheit mit epidemischer Verbreitung. @de
definition: Uppkomst av stort antal fall av smittsam sjukdom hos viss befolkning. @se
definition: Uma epidemia é uma condição que se espalha rapidamente numa comunidade. @pt-pt
definition: Fremkomsten af et stort antal infektionssygdomme i en bestemt befolkning. @dk
definition: 一种迅速蔓延可以传染众多人口的疾病 @zh-hans
definition: Eit stort smitteutbrot som rammar store delar av eit samfunn, folkegruppe, region eller land. @no-nn
definition: Et stort smitteutbrudd som rammer store deler av et samfunn, folkegruppe, region eller land. @no-nb
in scheme: Media Topic
created: 2009-10-22T02:00:00+00:00
modified: 2022-06-14T12:00:00+00:00
broader: communicable disease
narrower: plague (disease)
narrower: pandemic
broad match: http://cv.iptc.org/newscodes/subjectcode/07002000

viral disease
type: Concept
preferred label: Maladie virale @fr
preferred label: Viruserkrankung @de
preferred label: Enfermedades virales @es
preferred label: مرض فيروسي @ar
preferred label: Virussjukdomar @se
preferred label: doenças virais @pt-pt
preferred label: virussygdom @dk
preferred label: 病毒性疾病 @zh-hans
preferred label: virussykdom @no-nb
preferred label: virussjukdom @no-nn
definition: Sjukdomar orsakade av den typ av smittämnen som kallas virus. @se
definition: Krankheiten, ausgelöst durch Infektionen innerhalb der Zellen durch Viren. @de
definition: Diseases caused by an infection by viruses
definition: Doenças causadas por uma infeção das células por vírus. @pt-pt
definition: Doenças causadas por uma infecção das células por vírus. @pt-br
definition: Sygdomme forårsaget af infektion i celler af vira. @dk
definition: 由病毒在细胞内感染引起的疾病 @zh-hans
definition: Sjukdommar forårsaka av virusinfeksjon. @no-nn
definition: Sykdommer forårsaket av virusinfeksjon. @no-nb
in scheme: Media Topic
created: 2009-10-22T02:00:00+00:00
modified: 2022-06-14T12:00:00+00:00
broader: communicable disease
narrower: HIV and AIDS
narrower: retrovirus

plague (disease)
type: Concept
preferred label: Pest @se
preferred label: Peste @es
preferred label: Pest (Krankheit) @de
preferred label: وباء @ar
preferred label: peste @pt-pt
preferred label: pest (sygdom) @dk
preferred label: 鼠疫 @zh-hans
preferred label: pest @no-nb
definition: Typ av häftigt förlöpande infektionssjukdom som medför hög feber och stark medtagenhet. @se
definition: A highly infectious epidemic disease caused by the Yersinia pestis bacteria
definition: Eine hochansteckende Seuche, die meist durch Ratten oder Flohbisse übertragen wird @de
definition: Doença epidémica altamente infecciosa causada pela bactéria Yersinia pestis. @pt-pt
definition: Doença epidêmica altamente infecciosa causada pela bactéria Yersinia pestis. @pt-br
definition: En stærkt infektiøs epidemisk sygdom forårsaget af bakterierne Yersinia pestis. @dk
definition: 鼠疫耶尔森菌引起的一种高度传染病 @zh-hans
definition: Svært smittsam pandemisk sjukdom forårsaka av bakterien Yersinia pestis. @no-nn
definition: Svært smittsom pandemisk sykdom forårsaket av bakterien Yersinia pestis @no-nb
change note: Retired. Use medtop:20000449 epidemic and pandemic instead.
in scheme: Media Topic
created: 2009-10-22T02:00:00+00:00
retired: 2022-06-14T12:00:00+00:00
modified: 2022-06-14T12:00:00+00:00
broader: epidemic and pandemic
broad match: http://cv.iptc.org/newscodes/subjectcode/07002000

pandemic
type: Concept
preferred label: Pandemi @se
preferred label: pandemia @pt-pt
preferred label: pandemi @dk
preferred label: 瘟疫 @zh-hans
preferred label: Pandemie @de
preferred label: Pandémie @fr
preferred label: Pandemia @es
preferred label: جائحة @ar
definition: An epidemic of infectious disease that has spread across a large region or even worldwide
definition: Epidemi som får spridning över stora delar av världen och drabbar många människor @se
definition: Epidemia de uma doença infecciosa que se espalhou por uma região ampla ou mesmo por todo o mundo. @pt-pt
definition: En epidemi af smitsom sygdom, der har spredt sig over en stor region eller endda over hele verden. @dk
definition: 大型且具有传染力又会造成死亡的流行病 @zh-hans
definition: Eine Epidemie von Infektionskrankheiten, die sich über eine große Region oder sogar weltweit ausgebreitet hat @de
definition: Ein epidemi eller smitteutbrot som spreier seg over større regionar eller globalt. @no-nn
definition: En epidemi eller smitteutbrudd som sprer seg over større regioner eller globalt. @no-nb
change note: Retired. Use medtop:20000449 epidemic and pandemic instead.
in scheme: Media Topic
created: 2019-04-06T12:00:00+00:00
retired: 2022-06-14T12:00:00+00:00
modified: 2022-06-14T12:00:00+00:00
broader: epidemic and pandemic

HIV and AIDS
type: Concept
preferred label: Aids @se
preferred label: Sida @es
preferred label: SIDA @fr
preferred label: ايدز @ar
preferred label: AIDS @de
preferred label: sida @pt-pt
preferred label: aids @pt-br
preferred label: 艾滋病 @zh-hans
definition: Acquired Immunity Deficiency Syndrome, eine unheilbare Krankheit verursacht durch HIV. @de
definition: En dödlig sjukdom som kännetecknas av svåra skador på immunförsvaret, vilket medför att den drabbade blir extremt känslig för infektioner. Aids orsakas av humant immunbristvirus, HIV, och utgör slutstadiet av en hiv-infektion. @se
definition: HIV, a virus that attacks the body's immune system, and AIDS the disease caused by HIV
definition: Síndrome da Imunodeficiência Adquirida, doença incurável causada pelo vírus da imunodeficiência humana. @pt-pt
definition: Síndrome de Imunodeficiência Adquirida, doença incurável causada pelo vírus da imunodeficiência humana. @pt-br
definition: En dødbringende sygdom, der er kendetegnet ved alvorlig skade på immunsystemet, der får den berørte person til at blive ekstremt modtagelig for infektioner. AIDS er forårsaget af human immundefektvirus, HIV, og er slutstadiet af en HIV-infektion. @dk
definition: 获得性免疫缺陷综合征，一种由人类免疫缺陷病毒引起的无法治愈的疾病 @zh-hans
definition: Ein immunsviktsjukdom forårsaka av hiv-viruset. @no-nn
definition: En immunsviktsykdom forårsaket av hiv-viruset @no-nb
in scheme: Media Topic
created: 2009-10-22T02:00:00+00:00
modified: 2022-06-14T12:00:00+00:00
broader: viral disease

retrovirus
type: Concept
preferred label: Retrovirus @fr
preferred label: فيروس ارتجاعي @ar
preferred label: retrovírus @pt-pt
preferred label: 逆转录酶病毒 @zh-hans
definition: En familj av RNA-virus som orsakar bland annat leukemi och aids. @se
definition: A family of RNA viruses such as those causing leukaemia and AIDS
definition: Familie des RNA Virus, wie der, der Leukämie und Aids verursacht @de
definition: Família de vírus ARN como os que causam leucemia e sida. @pt-pt
definition: Família de vírus RNA como os que causam leucemia e aids. @pt-br
definition: En familie af RNA-vira, såsom dem, der forårsager leukæmi og AIDS. @dk
definition: 一个核糖核酸病毒家族，如引起白血病和艾滋病的病毒 @zh-hans
definition: A family of RNA viruses such as those causing leukemia and AIDS
definition: Ein familie av RNA-virus som forårsakar mellom anna leukemi og aids. @no-nn
definition: En familie av RNA-virus som forårsaker blant annet leukemi og aids. @no-nb
change note: Retired. Use a more specific term or medtop:20000446 disease and condition instead.
in scheme: Media Topic
created: 2009-10-22T02:00:00+00:00
retired: 2022-06-14T12:00:00+00:00
modified: 2022-06-14T12:00:00+00:00
broader: viral disease

obesity
type: Concept
preferred label: Übergewicht @de
preferred label: Obesidad @es
preferred label: Fetma @se
preferred label: Obésité @fr
preferred label: سمنة @ar
preferred label: obesidade @pt-pt
preferred label: fedme @dk
preferred label: 肥胖 @zh-hans
definition: Kroppsvikt som överstiger vad som bedöms vara övre gräns för normal vikt. @se
definition: Zustand des Körpergewichts, der 20 Prozent über dem Normalgewicht liegt, je nach Geschlecht, Alter und Größe und Körperbau. @de
definition: A condition of body weight generally considered 20 percent above the norm for gender, age, height and bone structure
definition: Condição do peso corporal considerada geralmente 20% acima do normal para o género, idade, altura e estrutura óssea. @pt-pt
definition: Condição do peso corporal considerada geralmente 20% acima do normal para o gênero, idade, altura e estrutura óssea. @pt-br
definition: Kropsvægt, der overstiger det, der anses for at være den øvre grænse for normal vægt. @dk
definition: 按照性别、年龄、身高和骨骼结构标准体重超过20%的情况 @zh-hans
in scheme: Media Topic
created: 2009-10-22T02:00:00+00:00
modified: 2022-06-14T12:00:00+00:00
broader: medical condition

eating disorder
type: Concept
preferred label: اضطرابات غذائية @ar
preferred label: Essstörung @de
preferred label: Troubles alimentaires @fr
preferred label: Ätstörning @se
preferred label: Desordenes alimenticios @es
preferred label: distúrbios alimentares @pt-pt
preferred label: transtornos alimentares @pt-br
preferred label: spiseforstyrrelse @dk
preferred label: 进食障碍 @zh-hans
preferred label: eteforstyrringar @no-nn
definition: Anorexia, bulimia, overeating and similar illnesses
definition: Magersucht, Bulimie, Adipositas und vergleichbare Krankheiten @de
definition: Tillstånd som kännetecknas av problem med ätande, aptit och vikt, såsom anorexia, bulimi och hetsätning. @se
definition: Anorexia, bulimia, ingestão abusiva de alimentos e doenças similares. @pt-pt
definition: Anoreksi, bulimi, overspisning og lignende sygdomme. @dk
definition: 厌食、贪食、暴食和类似疾病 @zh-hans
in scheme: Media Topic
created: 2009-10-22T02:00:00+00:00
modified: 2021-02-18T12:00:00+00:00
broader: mental health and disorder

depression
type: Concept
preferred label: Depresión @es
preferred label: Dépression @fr
preferred label: اكتئاب @ar
preferred label: depresjon @no-nn
preferred label: Depression @de
definition: A mental health disorder characterised by persistently depressed mood and loss of interest in activities, causing significant impairment in daily life
definition: A mental health disorder characterized by persistently depressed mood and loss of interest in activities, causing significant impairment in daily life
definition: Ett mer konstant tillstånd av nedstämdhet som innebär att den drabbade personen tappar intresset att göra saker och delta i vardagslivet. @se
definition: Eine psychische Krankheit, die durch eine anhaltend gedrückte Stimmung und den Verlust des Interesses an Aktivitäten gekennzeichnet ist und zu erheblichen Beeinträchtigungen im täglichen Leben führt @de
in scheme: Media Topic
created: 2022-06-14T12:00:00+00:00
modified: 2022-06-14T12:00:00+00:00
broader: mental health and disorder

anxiety and stress
type: Concept
preferred label: Ansiedad y estrés @es
preferred label: Anxiété et stress @fr
preferred label: قلق وضغط نفسي @ar
preferred label: angst og stresslidingar @no-nn
preferred label: angst og stresslidelser @no-nb
preferred label: Angst und Stress @de
preferred label: Ångest och stress @se
definition: A mental health disorder characterised by feelings of worry, anxiousness or fear that are strong enough to interfere with one's daily activities
definition: A mental health disorder characterized by feelings of worry, anxiousness or fear that are strong enough to interfere with one's daily activities
definition: Ett känslomässigt tillstånd där oro och/eller stress innebär störningar i en persons vardag. @se
definition: Eine psychische Störung, die durch Gefühle der Sorge, Ängstlichkeit oder Furcht gekennzeichnet ist, die stark genug sind, um die täglichen Aktivitäten zu beeinträchtigen @de
in scheme: Media Topic
created: 2022-06-14T12:00:00+00:00
modified: 2022-06-14T12:00:00+00:00
broader: mental health and disorder

hospital
type: Concept
preferred label: Krankenhaus @de
preferred label: Sjukhus och kliniker @se
preferred label: Hospitales y clínicas @es
preferred label: Hôpitaux et cliniques @fr
preferred label: مستشفيات وعيادات @ar
preferred label: hospitais @pt-pt
preferred label: 医院 @zh-hans
preferred label: sykehus @no-nb
preferred label: sjukehus @no-nn
definition: Medical facilities for the treatment of illnesses and injury
definition: Medizinische Einrichtung zur Behandlung von Krankheiten und Verletzungen. @de
definition: Medicinska inrättningar för behandling av sjuka och skadade. @se
definition: Instalações médicas para o tratamento de doenças e feridas. @pt-pt
definition: Medicinske faciliteter til behandling af sygdomme og skader. @dk
definition: 治疗疾病和损伤的医疗场所 @zh-hans
in scheme: Media Topic
created: 2009-10-22T02:00:00+00:00
modified: 2021-05-05T12:00:00+00:00
broader: health facility

healthcare clinic
type: Concept
preferred label: Primärvård @se
preferred label: centro de saúde @pt-pt
preferred label: sundhedsklinik og lægehus @dk
preferred label: 诊所 @zh-hans
preferred label: primærhelsetjeneste @no-nb
preferred label: Gesundheitsklinik @de
preferred label: Clinique @fr
preferred label: Clínica @es
preferred label: عيادة @ar
preferred label: primærhelseteneste @no-nn
definition: Local medical facility or doctor's office associated with a general medicine practice, staffed by one or many doctors, focusing on outpatient treatment or giving recommendations to visit a specialist or hospital
definition: Vårdinrättningar där personer med medicinska problem kan söka en första kontakt med sjukvården. Antingen för direkt åtgärde eller remiss för vidare behandling. @se
definition: Unidade médica local ou consultório médico associado a uma prática de medicina geral, com um ou vários médicos, que se dedica ao tratamento ambulatório ou reencaminha para um especialista ou hospital. @pt-pt
definition: Unidade médica local ou consultório médico associado a uma prática de medicina geral, com um ou vários médicos, que se dedica ao tratamento ambulatorial ou reencaminha para um especialista ou hospital. @pt-br
definition: Sundhedsklinik eller lægehus, hvor mennesker med medicinske problemer kan søge indledende kontakt med sundhedsvæsenet. Enten til direkte handling eller henvisning til videre behandling. @dk
definition: 由一名或多名医生组成的与普通医疗业务有关的本地医疗机构或医生办公室，主要负责门诊治疗或提出去专科医院或医院就诊的建议 @zh-hans
definition: Örtliche medizinische Einrichtung oder Arztpraxis in Verbindung mit einer allgemeinmedizinischen Praxis, die mit einem oder mehreren Ärzten besetzt ist, sich auf ambulante Behandlung konzentriert oder Empfehlungen für den Besuch eines Facharztes oder Krankenhauses ausspricht @de
in scheme: Media Topic
created: 2019-04-06T12:00:00+00:00
modified: 2021-07-12T12:00:00+00:00
broader: health facility

diet
type: Concept
preferred label: نظام غذائي @ar
preferred label: Dieta @es
preferred label: Régime @fr
preferred label: Diet @se
preferred label: Diät @de
preferred label: dieta @pt-pt
preferred label: diæt @dk
preferred label: 节食 @zh-hans
preferred label: kosthold @no-nb
preferred label: kosthald @no-nn
definition: Ways of eating to benefit health or treat a condition, such as plant-based, low-salt, high-fibre or gluten-free
definition: Kontrollierter Konsum von Nahrungsmitteln @de
definition: Sammansättning av kost under längre period, särskilt sådan som är fastställd av medicinska skäl. @se
definition: Consumo controlado de comida. @pt-pt
definition: Sammensætning af kost over en længere periode, især dem, der er fastlagt af medicinske grunde. @dk
definition: 控制食品摄入 @zh-hans
in scheme: Media Topic
created: 2009-10-22T02:00:00+00:00
modified: 2022-06-14T12:00:00+00:00
broader: health treatment and procedure
narrower: dietary supplement

non-prescription drug
type: Concept
preferred label: Medicamentos @es
preferred label: Mediciner @se
preferred label: Médicaments @fr
preferred label: ادوية طبية @ar
preferred label: Medizinische Droge @de
preferred label: fármacos @pt-pt
preferred label: medicinsk lægemiddel @dk
preferred label: 药物 @zh-hans
preferred label: reseptfrie legemidler @no-nb
preferred label: reseptfrie legemiddel @no-nn
definition: Chemische Substanzen, die für die Diagnose, Behandlung oder Prävention von physischen und psychischen Krankheiten genutzt werden @de
definition: Medel mot kroppsliga eller psykiska besvär, auktoriserade av läkarvetenskapen. @se
definition: Chemical substances used in the treatment or prevention of physical or mental condition or disease
definition: Substâncias químicas usadas no diagnóstico, tratamento ou prevenção de doenças físicas e mentais. @pt-pt
definition: Lægemiddel mod fysiske eller mentale lidelser, godkendt af lægevidenskaben. @dk
definition: 用于诊断、治疗或预防身心疾病的化学物质 @zh-hans
in scheme: Media Topic
created: 2009-10-22T02:00:00+00:00
modified: 2022-06-14T12:00:00+00:00
broader: health treatment and procedure
broad match: http://cv.iptc.org/newscodes/subjectcode/07000000

prescription drug
type: Concept
preferred label: Medicamento bajo prescripción médica @es
preferred label: Prescription médicale @fr
preferred label: ادوية موصوفة طبيا @ar
preferred label: Receptbelagda mediciner @se
preferred label: Droge auf Rezept @de
preferred label: medicamentos sujeitos a receita médica @pt-pt
preferred label: medicamentos sujeitos a prescrição médica @pt-br
preferred label: receptpligtig medicin @dk
preferred label: 处方药 @zh-hans
preferred label: reseptbelagte legemidler @no-nb
preferred label: prescription drugs
preferred label: reseptbelagde legemiddel @no-nn
definition: Mediciner som bara kan köpas med läkares tillstånd. @se
definition: Drogen, die ausschließlich mit der Erlaubnis des Arztes verabreicht werden dürfen @de
definition: Drugs that can be obtained only with a doctor's authorisation
definition: Medicamentos que só podem ser comprados com autorização médica. @pt-pt
definition: Lægemiddel, der kun kan købes med tilladelse fra lægen. @dk
definition: 只有医生授权才能购买的药物 @zh-hans
in scheme: Media Topic
created: 2009-10-22T02:00:00+00:00
modified: 2022-06-14T12:00:00+00:00
broader: health treatment and procedure

medical test
type: Concept
preferred label: Exámen/procedimiento médico @es
preferred label: Medizinische Untersuchung @de
preferred label: Protocole médical @fr
preferred label: اجراءات/فحوص طبية @ar
preferred label: Medicinska tester @se
preferred label: meios complementares de diagnóstico e terapêutica @pt-pt
preferred label: meios complementares de diagnóstico @pt-br
preferred label: medicinsk kontrol og prøve @dk
preferred label: 医疗程序/测试 @zh-hans
preferred label: medisinsk testing @no-nb
definition: Diagnostic procedure, such as stress test, blood test, CAT scan or MRI
definition: Medicinska analysprocedurer såsom blodprov, stresstester, skiktröntgen, magnetisk resonanstomografi med mera. @se
definition: Jede Variation der Behandlung wie Stresstests, Katheterisieren, Bluttests, CT oder MCR. @de
definition: Variedade de tratamentos, como testes de stress, cateterização, análises ao sangue, tomografia axial computadorizada, ressonância magnética, etc. @pt-pt
definition: Variedade de tratamentos, como testes de estresse, cateterização, exames de sangue, tomografia computadorizada, ressonância magnética etc. @pt-br
definition: Medicinske analyseprocedurer såsom blodprøver, stresstest, røntgenstråler, MR-scanning og mere. @dk
definition: 任何一种治疗方法，如压力测试、导管插入术、血液检测、计算机轴向断层扫描(CT)和磁共振成像等 @zh-hans
in scheme: Media Topic
created: 2009-10-22T02:00:00+00:00
modified: 2022-06-14T12:00:00+00:00
broader: health treatment and procedure

health care approach
type: Concept
preferred label: طب @ar
preferred label: Medicin @se
preferred label: Medikament @de
preferred label: Remède @fr
preferred label: Medicina @es
preferred label: medicamento @pt-pt
preferred label: medicin @dk
preferred label: 医药学 @zh-hans
preferred label: medisinske retninger @no-nb
preferred label: medisin @no-nn
definition: Ein Mittel, das verabreicht wird in der Hoffnung ein Leiden oder eine Krankheit zu heilen @de
definition: Different approaches to medical care that vary in the methods and substances used to treat symptoms
definition: En substans som används för att eliminera en sjukdom. @se
definition: Substância administrada com intenção de eliminar uma afeção ou doença. @pt-pt
definition: Substância administrada com intenção de eliminar uma afecção ou doença. @pt-br
definition: Et stof, der bruges til at eliminere en sygdom. @dk
definition: 研究人类疾病和病情的科学，包括诊断、治疗和预防的实践 @zh-hans
in scheme: Media Topic
created: 2009-10-22T02:00:00+00:00
modified: 2022-06-14T12:00:00+00:00
broader: health treatment and procedure
narrower: herbal medicine
narrower: holistic medicine
narrower: traditional Chinese medicine
narrower: conventional medicine

physical fitness
type: Concept
preferred label: Fysisk kondition @se
preferred label: État physique @fr
preferred label: لياقة بدنية @ar
preferred label: Estado físico @es
preferred label: Fitness @de
preferred label: condição física @pt-pt
preferred label: fysisk kondition @dk
preferred label: 身体素质 @zh-hans
preferred label: fysisk kondisjon @no-nb
preferred label: trim og trening @no-nn
definition: Körperliche Kondition @de
definition: The measure of the body's ability to function efficiently and effectively during work and leisure activities.
definition: Kroppens fysiska tillstånd hos en person. @se
definition: Capacidade do corpo de funcionar de forma eficiente e eficaz durante as atividades de trabalho e lazer. @pt-pt
definition: En persons kropslige kondition og vedligeholdelsen af den. @dk
definition: 衡量身体在工作和休闲活动中有效运作的能力 @zh-hans
change note: Retired. Use medtop:20001239 exercise and fitness instead.
in scheme: Media Topic
created: 2009-10-22T02:00:00+00:00
retired: 2022-06-14T12:00:00+00:00
modified: 2022-06-14T12:00:00+00:00
broader: health treatment and procedure

preventative medicine
type: Concept
preferred label: Médecine préventive @fr
preferred label: Förebyggande medicin @se
preferred label: Medicina preventiva @es
preferred label: طب وقائي @ar
preferred label: Vorsorge @de
preferred label: medicina preventiva @pt-pt
preferred label: forebyggende medicin @dk
preferred label: 预防医学 @zh-hans
preferred label: forebyggende medisin @no-nb
preferred label: førebyggjande medisin @no-nn
definition: Stoffe, die zur Vorbeugung von Krankheiten genutzt werden. @de
definition: Åtgärder som syftar till att bevara god hälsa och förhindra att skador och sjukdomar uppkommer eller förvärras. @se
definition: Substances used to prevent diseases or illnesses
definition: Medidas destinadas a manter uma boa saúde e a prevenir a ocorrência ou agravamento de doenças e afeções. @pt-pt
definition: Medidas destinadas a manter uma boa saúde e a prevenir a ocorrência ou agravamento de doenças e afecções. @pt-br
definition: Foranstaltninger, der sigter mod at opretholde et godt helbred og forebygge eller forværre kvæstelser og sygdomme. @dk
definition: 用于预防疾病的物质 @zh-hans
change note: Retired.
in scheme: Media Topic
created: 2009-10-22T02:00:00+00:00
retired: 2022-06-14T12:00:00+00:00
modified: 2022-06-14T12:00:00+00:00
broader: health treatment and procedure

vaccine
type: Concept
preferred label: Impfung @de
preferred label: لقاحات @ar
preferred label: Vaccins @fr
preferred label: Vacciner @se
preferred label: Vacunas @es
preferred label: vacinas @pt-pt
preferred label: 疫苗 @zh-hans
preferred label: vaksine @no-nb
definition: Skydd mot viss sjukdom, vilket består av försvagat smittämne som i liten dos införs i kroppen, som därvid utvecklar antikroppar mot denna sjukdom. @se
definition: Medications designed to create immunity to diseases
definition: Medikamente, die erzeugt werden um gegen Krankheiten immun zu werden. @de
definition: Medicamentos desenvolvidos para criar imunidade a doenças. @pt-pt
definition: Medicin designet til at skabe immunitet mod sygdomme. @dk
definition: 旨在产生对疾病免疫力的药物 @zh-hans
in scheme: Media Topic
created: 2009-10-22T02:00:00+00:00
modified: 2022-06-14T12:00:00+00:00
broader: health treatment and procedure

therapy
type: Concept
preferred label: Terapi @se
preferred label: Thérapie @fr
preferred label: Therapie @de
preferred label: Terapia @es
preferred label: علاج @ar
preferred label: terapias @pt-pt
preferred label: terapi @dk
preferred label: 治疗 @zh-hans
definition: Behandlung der physischen, mentalen oder medizinischen Kondition mit nicht-chirurgischen Mitteln. @de
definition: Särskild medicinsk eller psykologisk behandling ofta med aktivt deltagande av patienten. @se
definition: Treatment of physical, mental or medical conditions by non-surgical means
definition: Tratamento de condições físicas, mentais ou médicas através de meios não cirúrgicos. @pt-pt
definition: Behandling af fysiske, mentale eller medicinske tilstande på ikke-kirurgiske måder. @dk
definition: 通过非手术手段治疗身体、精神或病情 @zh-hans
in scheme: Media Topic
created: 2009-10-22T02:00:00+00:00
modified: 2021-02-18T12:00:00+00:00
broader: health treatment and procedure

drug rehabilitation
type: Concept
preferred label: Missbruksvård @se
preferred label: cura de desintoxicação @pt-pt
preferred label: afvænning @dk
preferred label: 戒毒 @zh-hans
preferred label: rusbehandling @no-nb
preferred label: Drogentherapie @de
preferred label: Cure de désintoxication @fr
preferred label: Rehabilitación de drogas @es
preferred label: إعادة تأهيل مدمني المخدرات @ar
definition: Medical or psychotherapeutic treatment for dependency on substances such as alcohol, prescription and controlled drugs
definition: Vård av personer som hamnat i missbruk av alkohol eller droger. @se
definition: Tratamento médico ou psicoterapêutico para a dependência de substâncias psicoativas, como álcool, medicamentos ou drogas. @pt-pt
definition: Pleje af personer, der er misbruger alkohol eller stoffer. @dk
definition: 采用医学或心理治疗方式治疗患者对精神活性物质（如酒精、处方药和毒品）的依赖。 @zh-hans
definition: Medizinische oder psychotherapeutische Behandlung der Abhängigkeit von psychoaktiven Substanzen wie Alkohol, verschreibungspflichtigen Drogen und Straßendrogen @de
in scheme: Media Topic
created: 2019-04-06T12:00:00+00:00
modified: 2022-06-14T12:00:00+00:00
broader: health treatment and procedure

emergency care
type: Concept
preferred label: Akutsjukvård @se
preferred label: serviço de urgência @pt-pt
preferred label: serviço de emergência @pt-br
preferred label: akut behandling @dk
preferred label: 紧急护理 @zh-hans
preferred label: akuttbehandling @no-nb
preferred label: Notfallversorgung @de
preferred label: Médecine d'urgence @fr
preferred label: Medicina de emergencia @es
preferred label: طب الطوارئ @ar
preferred label: akuttmottak @no-nn
definition: Immediate care of patients with critical medical emergencies, either inside or outside of a hospital
definition: Sjukvård som tar hand om akuta fall som är oplanerade men allvarliga. Patienter kommer in utan föregående tidsbokning eller tom med ambulans. @se
definition: Atendimento de pacientes que chegam com uma emergência médica pelos próprios meios ou transportados por ambulância. @pt-pt
definition: Akut pleje af patienter, der ankommer til en medicinsk nødsituation, enten med egne midler eller med ambulance. @dk
definition: 对通过自己的方法或救护车到达医疗急救中心的病人的紧急护理 @zh-hans
definition: Die Akutversorgung von Patienten, die mit einem medizinischen Notfall entweder mit ihren eigenen Mitteln oder mit denen eines Krankenwagens ankommen @de
in scheme: Media Topic
created: 2019-04-06T12:00:00+00:00
modified: 2022-06-14T12:00:00+00:00
broader: health treatment and procedure

surgery
type: Concept
preferred label: kirurgi @dk
preferred label: cirurgia @pt-br
preferred label: Kirurgi (ingrepp) @se
preferred label: 外科手术 @zh-hans
preferred label: Chirurgie @de
preferred label: Opération de chirurgie @fr
preferred label: Operación de cirugía @es
preferred label: عملية جراحية @ar
definition: Brug af snit lavet af medicinske instrumenter til at undersøge eller behandle en medicinsk tilstand eller skade. @dk
definition: The use of incisions made by medical instruments to investigate or treat a medical condition or injury
definition: Uso de incisões feitas por instrumentos médicos para investigar ou tratar uma condição médica ou lesão. @pt-br
definition: Metoder för att bota sjukdomar eller laga skador genom ingrepp i patientens kropp med hjälp av medicinska instrument. @se
definition: 利用医疗器械的切口来检查或治疗疾病或损伤 @zh-hans
definition: Die Verwendung von Einschnitten durch medizinische Instrumente zur Untersuchung oder Behandlung einer Erkrankung oder Verletzung @de
in scheme: Media Topic
created: 2019-04-06T12:00:00+00:00
modified: 2021-07-12T12:00:00+00:00
broader: health treatment and procedure

dietary supplement
type: Concept
preferred label: Diätische Ergänzung @de
preferred label: نظام غذائي تكميلي @ar
preferred label: Suplementos alimenticios @es
preferred label: Kosttillskott @se
preferred label: Complèments nutritifs @fr
preferred label: suplementos alimentares @pt-pt
preferred label: kosttilskud @dk
preferred label: 膳食补充剂 @zh-hans
preferred label: kosttilskudd @no-nb
preferred label: kosttilskot @no-nn
definition: Nutrients taken in addition to food to bolster health
definition: Livsmedel som är avsedda att komplettera en normal kost. @se
definition: Nährstoffe, die der Nahrung beigefügt werden zur Förderung der Gesundheit @de
definition: Nutrientes que se acrescentam à alimentação para fortalecer a saúde. @pt-pt
definition: Fødevarer, der er beregnet til at supplere en normal diæt. @dk
definition: 为增进健康而在食物之外摄入的营养素 @zh-hans
in scheme: Media Topic
created: 2009-10-22T02:00:00+00:00
modified: 2022-06-14T12:00:00+00:00
broader: diet

herbal medicine
type: Concept
preferred label: Örtmedicin @se
preferred label: Hierbas medicinales @es
preferred label: اعشاب @ar
preferred label: Phytothérapie @fr
preferred label: Homöopathie @de
preferred label: fitoterapia @pt-pt
preferred label: urtemedicin @dk
preferred label: 草药医学 @zh-hans
preferred label: naturmedisin @no-nb
definition: Behandlung, die auf der Nutzung von Kräutern und anderen Pflanzen beruht, um Krankheitssymptomen vorzubeugen oder zu heilen @de
definition: Treatment based on the use of herbs and other plants to cure or alleviate symptoms
definition: Benämning på medel, huvudsakligen avsedda för egenbehandling, vilka utgörs av torkade växtdelar eller extrakt av sådana som används för att bota sjukdomar. @se
definition: Tratamento baseado no uso de ervas e de outras plantas para curar ou aliviar sintomas de doença. @pt-pt
definition: Behandling baseret på brugen af urter og andre planter til at kurere eller lindre sygdomssymptomer. @dk
definition: 基于草药和其他植物治疗来减轻疾病症状的治疗方法 @zh-hans
in scheme: Media Topic
created: 2009-10-22T02:00:00+00:00
modified: 2022-06-14T12:00:00+00:00
broader: health care approach

holistic medicine
type: Concept
preferred label: Medicina holística @es
preferred label: Holistisk medicin @se
preferred label: Ganzheitliche Medizin @de
preferred label: طب شمولي @ar
preferred label: Médecine holistique @fr
preferred label: medicina holística @pt-pt
preferred label: holistisk medicin @dk
preferred label: 整体医学 @zh-hans
preferred label: alternativ medisin @no-nb
definition: Behandling av hela personen, inklusive mentala och sociala faktorer, i stället för bara av sjukdomens symptom. @se
definition: Treatment of the whole person including mental and environmental factors in addition to treating symptoms
definition: Behandlung der gesamten Person, unter Einbeziehung mentaler und sozialer Faktoren, eher als die Krankheitssymptome selbst. @de
definition: Tratamento da pessoa como um todo, incluindo fatores mentais e sociais, e não somente os sintomas da doença. @pt-pt
definition: Behandling af hele personen, inklusive mentale og sociale faktorer, i stedet for bare sygdommens symptomer. @dk
definition: 对人进行整体的治疗，包括心理和社会因素，而不仅仅是疾病的症状 @zh-hans
in scheme: Media Topic
created: 2009-10-22T02:00:00+00:00
modified: 2022-06-14T12:00:00+00:00
broader: health care approach

traditional Chinese medicine
type: Concept
preferred label: Medicina tradicional china @es
preferred label: Médecine traditionelle chinoise @fr
preferred label: Chinesische Medizin (TCM) @de
preferred label: Kinesisk medicin @se
preferred label: طب صيني @ar
preferred label: medicina tradicional chinesa @pt-pt
preferred label: traditionel kinesisk medicin @dk
preferred label: 中医 @zh-hans
preferred label: kinesisk medisin @no-nb
preferred label: tradisjonell kinesisk medisin @no-nn
definition: Utövandet av diagnosticering, behandling och förebyggande av sjukdomar baserat på traditionella metoder utvecklade i Östasien. @se
definition: Diagnose, Behandlung und Prävention von Krankheiten basierend auf traditionellen Methoden aus dem Orient @de
definition: The practice of diagnosis, treatment and prevention of disease based on traditional methods developed in Eastern Asia
definition: Prática de diagnóstico, tratamento e prevenção de doenças baseada em métodos tradicionais desenvolvidos no oriente. @pt-pt
definition: Praksis med at diagnosticere, behandle og forebygge sygdomme baseret på traditionelle metoder udviklet i Østasien. @dk
definition: 在东方发展起来的以传统方法为基础的疾病诊断、治疗和预防的实践 @zh-hans
in scheme: Media Topic
created: 2009-10-22T02:00:00+00:00
modified: 2022-06-14T12:00:00+00:00
broader: health care approach

conventional medicine
type: Concept
preferred label: غرب @ar
preferred label: Médecine occidentale @fr
preferred label: Medicina occidental @es
preferred label: Schulmedizin @de
preferred label: Västerländsk medicin @se
preferred label: medicina ocidental @pt-pt
preferred label: vestlig medicin @dk
preferred label: 西医 @zh-hans
preferred label: kunnskapsbasert medisin @no-nb
definition: Diagnostische, Behandlung und Prävention von Krankheiten, basierend auf modernen wissenschaftlichen Forschungen der westlichen Welt @de
definition: Utövandet av diagnosticering, behandling och förebyggande av sjukdomar baserat på vetenskaplig forskning i den västra hemisfären. @se
definition: The practice of diagnosis, treatment and prevention of disease based on modern scientific research
definition: Prática de diagnóstico, tratamento e prevenção de doenças baseada na investigação científica moderna do hemisfério ocidental. @pt-pt
definition: Praksis med diagnose, behandling og forebyggelse af sygdom baseret på moderne videnskabelig forskning på den vestlige halvkugle. @dk
definition: 基于西半球现代科学研究的疾病诊断，治疗和预防实践 @zh-hans
in scheme: Media Topic
created: 2009-10-22T02:00:00+00:00
modified: 2022-06-14T12:00:00+00:00
broader: health care approach

healthcare policy
type: Concept
preferred label: سياسة الرعاية الطبية @ar
preferred label: Política de atención de salud @es
preferred label: Gesundheitspolitik @de
preferred label: Hälso- och sjukvårdspolitik @se
preferred label: Politique de santé @fr
preferred label: política de saúde @pt-pt
preferred label: sundhedspolitik @dk
preferred label: 医疗保健政策 @zh-hans
preferred label: helsepolitikk @no-nb
definition: Politische Entscheidungen in Bezug auf die Gesundheit, umfasst was die Länder tun für die Drogenbekämpfung, AIDS, psychiatrische Versorgung, öffentliche Mittel für die Gesundheitsversorgung und ähnliches @de
definition: Politiska program för sjukvård, tandvård, psykiatri och folkhälsa. @se
definition: Government programs and policies related to healthcare such as drug policies, psychiatric care, health care funding and pandemic response
definition: Decisões políticas relativas à saúde, incluindo o que diferentes países estão a fazer em relação à prescrição de medicamentos, sida, cuidados psiquiátricos, financiamento da assistência médica e tópicos relacionados. @pt-pt
definition: Decisões políticas relativas à saúde, incluindo o que diferentes países estão a fazer em relação à prescrição de medicamentos, aids, cuidados psiquiátricos, financiamento da assistência médica e tópicos relacionados. @pt-br
definition: Politikker, der inkluderer civil sundhedspleje, tandpleje, militær sundhedspleje og folkesundhed generelt. @dk
definition: 与卫生有关的政策决定，包括不同国家在处方药政策、艾滋病、精神护理、卫生保健资金和相关主题方面的做法 @zh-hans
in scheme: Media Topic
created: 2009-10-22T02:00:00+00:00
modified: 2025-03-31T12:00:00+00:00
broader: government policy

Medicaid
type: Concept
preferred label: Krankenversicherung @de
preferred label: مساعدة طبية للفقراء @ar
preferred label: sygehjælp @dk
preferred label: 美国公费医疗保险 @zh-hans
definition: Staatliche Gesundheitsversorgung von Menschen aller Altersgruppen. @de
definition: Ett offentligt finansierat sjukförsäkringssystem i USA för låginkomsttagare och deras familjer. @se
definition: A program of the U.S. government to provide health care to needy citizens of all ages
definition: Programa do governo norte-americano para fornecer cuidados de saúde a cidadãos carenciados de todas as idades. @pt-pt
definition: Programa do governo norte-americano para fornecer cuidados de saúde a cidadãos necessitados de todas as idades. @pt-br
definition: Et offentligt finansieret sundhedsforsikringssystem i USA for lavindkomstindtægter og deres familier. @dk
definition: 美国政府为所有年龄段有需要的公民提供的医疗保健计划 @zh-hans
change note: This US-specific entity is not appropriate for Media Topics. The general concept of government-provided health care is covered by the parent.
in scheme: Media Topic
created: 2009-10-22T02:00:00+00:00
retired: 2014-06-02T12:00:00+00:00
modified: 2021-02-18T12:00:00+00:00
broader: government health care

Medicare
type: Concept
preferred label: Pflegeversicherung @de
preferred label: ميديكير @ar
preferred label: sundhedsforsikring @dk
preferred label: 联邦医疗保险 @zh-hans
definition: Ett offentligt finansierat sjukförsäkringssystem i USA för personer som är minst 65 år eller handikappade. @se
definition: Staatliche Gesundheitsversorgung von älteren Menschen. @de
definition: A program of the U.S. government to provide health care to senior citizens
definition: Programa do governo norte-americano para fornecer cuidados de saúde a cidadãos idosos. @pt-pt
definition: Et offentligt finansieret sundhedsforsikringssystem i USA for personer, der er mindst 65 år eller handicappede. @dk
definition: 美国政府为老年人提供的医疗保健计划 @zh-hans
change note: This US-specific entity is not appropriate for Media Topics. The general concept of government-provided health care is covered by the parent.
in scheme: Media Topic
created: 2009-10-22T02:00:00+00:00
retired: 2014-06-02T12:00:00+00:00
modified: 2021-02-18T12:00:00+00:00
broader: government health care

medical service
type: Concept
preferred label: Examens médicaux @fr
preferred label: Medicinska hjälpmedel @se
preferred label: خدمات طبية @ar
preferred label: Medizinischer Service @de
preferred label: Servicios médicos @es
preferred label: serviços médicos @pt-pt
preferred label: medicinske støttefunktioner @dk
preferred label: 医疗服务 @zh-hans
preferred label: helsetjeneste @no-nb
preferred label: helseteneste @no-nn
definition: Stöd för doktorer, såsom blodprover och andra prover, röntgenbilder och så vidare. @se
definition: Medical support for doctors, including blood tests and other medical tests on individuals, X-rays, CAT scans, MRIs, etc
definition: Medizinische Unterstützung/Hilfsmittel für Ärzte, wie Bluttests oder andere Tests an Einzelnen, Röntgen, CT, MRT etc. @de
definition: Serviços de apoio a médicos, incluindo análises ao sangue e outros testes individuais, raios X, tomografias axiais computadorizadas, ressonâncias magnéticas, etc. @pt-pt
definition: Serviços de apoio a médicos, incluindo exames de sangue e outros testes individuais, raios X, tomografias computadorizadas, ressonâncias magnéticas etc. @pt-br
definition: Medicinsk støtte til læger, herunder blodprøver og andre medicinske tests på individer, røntgenstråler CAT-scanninger MR-scanninger osv. @dk
definition: 对医生的医疗支持，包括血液检查、x射线、CAT扫描核磁共振成像等. @zh-hans
in scheme: Media Topic
created: 2009-10-22T02:00:00+00:00
modified: 2022-06-14T12:00:00+00:00
broader: medical profession

medical specialisation
type: Concept
preferred label: Medicinsk specialisering @se
preferred label: Medizinisches Spezialgebiet @de
preferred label: تخصص طبي @ar
preferred label: Spécialisations médicales @fr
preferred label: Especializaciones médicas @es
preferred label: especialização médica @pt-pt
preferred label: medicinsk specialisering @dk
preferred label: 医学专科 @zh-hans
preferred label: medisinsk spesialisering @no-nb
preferred label: medical specialization
definition: De olika medicinska specialiseringsområdena. @se
definition: The different medical specialist areas
definition: Verschiedene medizinische Spezialgebiete. @de
definition: Diferentes áreas de especialidade médica. @pt-pt
definition: De forskellige medicinske specialiserede områder. @dk
definition: 不同的医学专科领域 @zh-hans
in scheme: Media Topic
created: 2009-10-22T02:00:00+00:00
modified: 2022-06-14T12:00:00+00:00
broader: medical profession
narrower: geriatric medicine
narrower: obstetrics/gynaecology
narrower: paediatrics
narrower: reproductive medicine
narrower: dentistry
narrower: pharmacology
narrower: veterinary medicine
narrower: general practice
narrower: orthopaedics
narrower: oncology
narrower: radiology
narrower: eye care
narrower: surgical medicine
narrower: psychiatry

medical staff
type: Concept
preferred label: طاقم طبي @ar
preferred label: Gesundheitspersonal @de
preferred label: Personnel médical @fr
preferred label: Personal médico @es
preferred label: Sjukvårdspersonal @se
preferred label: profissionais de saúde @pt-pt
preferred label: medicinsk personale @dk
preferred label: 医务人员 @zh-hans
preferred label: helsepersonell @no-nb
definition: Ärzte und Pflegepersonal, innerhalb und außerhalb einer medizinischen Einrichtung @de
definition: Doktorer, sköterskor och andra som jobbar på en medicinsk inrättning. @se
definition: Doctors, nurses, interns and others in a medical facility
definition: Médicos, enfermeiros e outros profissionais que trabalham em instalações médicas. @pt-pt
definition: Læger, sygeplejersker, praktikanter og andre i en medicinsk facilitet. @dk
definition: 医疗机构中的医生、护士、实习人员 @zh-hans
in scheme: Media Topic
created: 2009-10-22T02:00:00+00:00
modified: 2021-05-05T12:00:00+00:00
broader: medical profession

geriatric medicine
type: Concept
preferred label: Geriatrik @se
preferred label: Geriatrie @de
preferred label: طب المسنين @ar
preferred label: Gériatrie @fr
preferred label: Geriatría @es
preferred label: geriatria @pt-pt
preferred label: geriatrisk medicin @dk
preferred label: 老年医学 @zh-hans
preferred label: geriatri @no-nb
definition: Specialty focusing on ageing and age-related issues including age-related illnesses, medical research, and trends.
definition: Spezialität des Alterns und altersbedingte Themen wie altersbedingte Krankheiten, medizinische Forschung, und Entwicklungen. @de
definition: Medicinskt kunskapsområde som omfattar sjukdomar hos äldre, vanligen med en nedre åldersgräns vid 65 år. @se
definition: Especialidade que trata de questões de idade e de envelhecimento, incluindo doenças relacionadas com a idade, investigação médica e tendências. @pt-pt
definition: Specialitet i aldring og aldersrelaterede problemer, inklusive aldersrelaterede sygdomme, medicinsk forskning og tendenser. @dk
definition: 专门研究老龄化和与老龄相关问题的医学专业，包括与老年相关的疾病、医学研究和趋势 @zh-hans
definition: Speciality into ageing and age-related issues including age-related illnesses, medical research, and trends.
change note: Retired. Use medtop:20001232 elderly care instead.
in scheme: Media Topic
created: 2009-10-22T02:00:00+00:00
retired: 2022-06-14T12:00:00+00:00
modified: 2022-06-14T12:00:00+00:00
broader: medical specialisation

obstetrics/gynaecology
type: Concept
preferred label: Gynäkologie @de
preferred label: توليد/طب نسائي @ar
preferred label: Gynekologi @se
preferred label: Gynécologie @fr
preferred label: Obstetricia / ginecología @es
preferred label: obstetrícia / ginecologia @pt-pt
preferred label: obstetrícia/ginecologia @pt-br
preferred label: obstetrik/gynækologi @dk
preferred label: 妇产科 @zh-hans
preferred label: gynekologi @no-nb
preferred label: obstetrics/gynecology
definition: Specialty of female reproductive organs
definition: Krankheiten der weiblichen Sexual- und Fortpflanzungsorgane @de
definition: Medicinskt kunskapsområde som omfattar sjukdomar i de kvinnliga könsorganen. @se
definition: Especialidade que se ocupa dos órgãos reprodutores femininos. @pt-pt
definition: Specialitet i kvindelige reproduktionsorganer. @dk
definition: 女性生殖器官的医学专科 @zh-hans
change note: Retired. Use medtop:20001359 pregnancy and childbirth instead.
in scheme: Media Topic
created: 2009-10-22T02:00:00+00:00
retired: 2022-06-14T12:00:00+00:00
modified: 2022-06-14T12:00:00+00:00
broader: medical specialisation

paediatrics
type: Concept
preferred label: Pädiatrie @de
preferred label: Pediatrik @se
preferred label: Pédiatrie @fr
preferred label: Pediatría @es
preferred label: طب الاطفال @ar
preferred label: pediatria @pt-pt
preferred label: pædiatri @dk
preferred label: 儿科 @zh-hans
preferred label: pediatri @no-nb
preferred label: pediatrics
definition: Forschung und Medizin speziell für die Jüngeren, umfasst Neugeborene, Kleinkindversorgung, Kinderkrankheiten und ihre Behandlung, sowie Gesundheitsfragen von Jugendlichen und ihre Verhaltensprobleme. @de
definition: Medicinskt kunskapsområde som omfattar sjukdomar och hälsobetingelser hos barn och under adolescensen, samt i vissa avseenden även hos foster under tiden närmast före födelsen. @se
definition: Medical specialisation that focuses on treating the young, including premature babies, infant care, childhood diseases and teenage health and behaviour problems
definition: Especialidade médica para os jovens - inclui bebés prematuros, cuidados infantis, doenças de crianças e seu tratamento – e ainda problemas de saúde e de comportamento de adolescentes. @pt-pt
definition: Especialidade médica para os jovens - inclui bebês prematuros, cuidados infantis, doenças de crianças e seu tratamento – e ainda problemas de saúde e de comportamento de adolescentes. @pt-br
definition: Medicinsk vidensområde, der inkluderer sygdomme og sundhedsmæssige forhold hos børn og unge, og i nogle henseender også hos fostre i perioden umiddelbart før fødslen. @dk
definition: 针对婴幼儿及少年儿童的医学专科——包括早产儿、婴儿护理、儿童疾病和治疗——也包括与少年儿童有关的健康和行为问题。 @zh-hans
definition: Medical specialization that focuses on treating the young, including premature babies, infant care, childhood diseases and teenage health and behaviour problems
in scheme: Media Topic
created: 2009-10-22T02:00:00+00:00
modified: 2022-06-14T12:00:00+00:00
broader: medical specialisation

reproductive medicine
type: Concept
preferred label: Reproduktiv medicin @se
preferred label: طب تناسلي @ar
preferred label: Medicina reproductiva @es
preferred label: Reproduktionsmedizin @de
preferred label: Médecine de la reproduction @fr
preferred label: medicina reprodutiva @pt-pt
preferred label: reproduktiv medicin @dk
preferred label: 生殖科 @zh-hans
preferred label: reproduktiv helse @no-nb
definition: Umfasst Reproduktionstechnologien, wie Invitro-Fertilisation, sowohl das Klonen als auch die damit zusammenhängenden Debatten. Entwicklungen der Sexualität und durch sexuellen Kontakt übertragene Krankheiten fallen auch in diese Kategorie @de
definition: Olika metoder att behandla par som inte kan få barn på naturlig väg, såsom provrörsbefruktning. @se
definition: Speciality of reproductive technologies like invitro fertilisation
definition: Especialidade das tecnologias de reprodução como a fertilização in vitro. @pt-pt
definition: Forskellige metoder til behandling af par, der ikke kan få børn naturligt, såsom befrugtning af reagensglas. @dk
definition: 生殖技术的专科，体外受精入此 @zh-hans
definition: Speciality of reproductive technologies like invitro fertilization
change note: Retired. Use medtop:20000784 family planning instead if relevant.
in scheme: Media Topic
created: 2009-10-22T02:00:00+00:00
retired: 2022-06-14T12:00:00+00:00
modified: 2022-06-14T12:00:00+00:00
broader: medical specialisation
broad match: http://cv.iptc.org/newscodes/subjectcode/07014003

dentistry
type: Concept
preferred label: طب اسنان @ar
preferred label: Odontología @es
preferred label: Zahnmedizin @de
preferred label: Tandvård @se
preferred label: Dentisterie @fr
preferred label: medicina dentária @pt-pt
preferred label: tandpleje @dk
preferred label: 牙科 @zh-hans
preferred label: tannpleie @no-nb
definition: Det medicinska yrket och forskningsfältet som rör diagnosticering, förebyggande arbete och behandling av tänderna. @se
definition: Die Ärzteschaft und das Fachgebiet, das sich der Diagnose, Vorbeugung und Behandlung oraler Erkrankungen widmet @de
definition: The medical profession and field of study devoted to diagnosing, preventing and treating oral conditions
definition: Corps médical et domaine d'étude consacrés au diagnostic, à la prévention et au traitement des affections buccales et dentaires @fr
definition: Profesión médica y campo de estudio dedicados al diagnóstico, la prevención y el tratamiento de enfermedades orales y dentales @es
definition: Especialidade médica e ramo de estudos dedicados ao diagnóstico, prevenção e tratamento de condições relativas à saúde oral. @pt-pt
definition: Det medicinske erhverv og forskningsområdet relateret til diagnose, forebyggelse og behandling af tænder. @dk
definition: 口腔疾病医学专科和研究领域，致力于口腔疾病的诊断、预防和治疗 @zh-hans
in scheme: Media Topic
created: 2009-10-22T02:00:00+00:00
modified: 2021-02-18T12:00:00+00:00
broader: medical specialisation
broad match: http://cv.iptc.org/newscodes/subjectcode/13019000

pharmacology
type: Concept
preferred label: Pharmakologie @de
preferred label: Farmakologi @se
preferred label: Pharmacologie @fr
preferred label: Farmacología @es
preferred label: صيدلة @ar
preferred label: farmacologia @pt-pt
preferred label: farmakologi @dk
preferred label: 药理科 @zh-hans
definition: The medical profession and field of study concerned with the uses, modes of action and effects of pharmaceutical agents
definition: Ärzteschaft und Studienrichtung, die sich mit den Anwendungen, Wirkungsweisen und Wirkungen pharmazeutischer Wirkstoffe befassen @de
definition: Det medicinska yrket och forskningsfältet som rör läkemedel. @se
definition: Corps médical et domaine d'étude consacrés à l'usage, l'action et les effets des médicaments @fr
definition: Cuerpo médico y campo de estudio dedicados al uso, el acción y los efectos de las drogas @es
definition: Especialidade médica e ramo de estudos dedicados aos usos, modos de ação e efeitos dos agentes farmacêuticos. @pt-pt
definition: Lægefaget og forskningsområdet relateret til lægemidler. @dk
definition: 与药物制剂的用途、作用方式和效果有关的医学专业和研究领域 @zh-hans
change note: Retired. Use medtop:20000468 prescription drugs instead.
in scheme: Media Topic
created: 2009-10-22T02:00:00+00:00
retired: 2022-06-14T12:00:00+00:00
modified: 2022-06-14T12:00:00+00:00
broader: medical specialisation
broad match: http://cv.iptc.org/newscodes/subjectcode/13019000

veterinary medicine
type: Concept
preferred label: Medicina veterinaria @es
preferred label: Veterinärmedicin @se
preferred label: علم البيطرة @ar
preferred label: Médecine vétérinaire @fr
preferred label: Tiermedizin @de
preferred label: medicina veterinária @pt-pt
preferred label: veterinærmedicin @dk
preferred label: 兽医 @zh-hans
preferred label: veterinærmedisin @no-nb
definition: Ärzteschaft und Studienrichtung zur Diagnose, Vorbeugung und Behandlung von Krankheiten bei Tieren @de
definition: Det medicinska yrket och forskningsfältet som rör diagnosticering, förebyggande arbete och behandlingar av sjukdomar hos djur. @se
definition: The medical profession and field of study devoted to diagnosis, prevention and treatment of medical conditions in animals
definition: Corps médical et domaine d'étude consacrés au diagnostic, à la prévention et au traitement des maladies chez les animaux @fr
definition: Cuerpo médico y campo de estudio dedicados al diagnóstico, la prevención y el tratamiento de enfermedades en animales @es
definition: Especialidade médica e ramo de estudos dedicados ao diagnóstico, prevenção e tratamento de condições médicas nos animais. @pt-pt
definition: Det medicinske erhverv og forskningsfelt relateret til diagnose, forebyggelse og behandling af dyresygdomme. @dk
definition: 从事动物疾病诊断、预防和治疗的医学专业和研究领域 @zh-hans
in scheme: Media Topic
created: 2009-10-22T02:00:00+00:00
modified: 2021-02-18T12:00:00+00:00
broader: medical specialisation
broad match: http://cv.iptc.org/newscodes/subjectcode/13019000

general practice
type: Concept
preferred label: Allmänmedicin @se
preferred label: medicina geral e familiar @pt-pt
preferred label: medicina de família e comunidade @pt-br
preferred label: almen praksis @dk
preferred label: 全科诊疗 @zh-hans
preferred label: allmennpraksis @no-nb
preferred label: Allgemeinmedizin @de
preferred label: Médecine générale @fr
preferred label: Medicina general @es
preferred label: طب الأسرة @ar
definition: The treatment of a wide range of acute and long-term medical conditions and symptoms
definition: Sjukvård som tar hand om alla möjliga åkommor internt i kroppen och som inte hör till någon specialist-vård. @se
definition: Especialidade médica que se dedica ao tratamento de uma ampla gama de problemas médicos gerais e dos seus sintomas. @pt-pt
definition: Especialidade médica que se dedica ao tratamento de uma ampla gama de problemas médicos gerais e de seus sintomas. @pt-br
definition: Behandling af en lang række akutte og langvarige medicinske tilstande og symptomer. @dk
definition: 治疗范围广泛的急性和长期的病情和症状 @zh-hans
definition: Die Behandlung eines breiten Spektrums akuter und langfristiger Krankheiten und Symptome @de
change note: Retired. Use general health terms instead.
in scheme: Media Topic
created: 2019-04-06T12:00:00+00:00
retired: 2022-06-14T12:00:00+00:00
modified: 2022-06-14T12:00:00+00:00
broader: medical specialisation

orthopaedics
type: Concept
preferred label: Ortopedi @se
preferred label: ortopedia @pt-pt
preferred label: ortopædi @dk
preferred label: 骨科 @zh-hans
preferred label: ortopedi @no-nb
preferred label: Orthopädie @de
preferred label: orthopedics
preferred label: Orthopédie @fr
preferred label: Ortopedia @es
preferred label: جراحة العظام @ar
definition: A medical specialisation that focuses on conditions involving the musculoskeletal system
definition: Sjukvård som tar hand om saker som gäller kroppens leder och rörlighet. @se
definition: Especialidade médica que se dedica ao estudo e tratamento dos problemas que envolvem o sistema musculoesquelético. @pt-pt
definition: Sundhedspleje, der tager sig af ting, der vedrører kroppens led og mobilitet. @dk
definition: 专注于肌肉骨骼系统疾病的医学专科 @zh-hans
definition: Eine medizinische Spezialisierung, die sich auf Erkrankungen des Bewegungsapparats konzentriert @de
definition: A medical specialization that focuses on conditions involving the musculoskeletal system
change note: Retired. Use medtop:20000456 injury instead.
in scheme: Media Topic
created: 2019-04-06T12:00:00+00:00
retired: 2022-06-14T12:00:00+00:00
modified: 2022-06-14T12:00:00+00:00
broader: medical specialisation

oncology
type: Concept
preferred label: Onkologi @se
preferred label: oncologia @pt-pt
preferred label: onkologi @dk
preferred label: 肿瘤科 @zh-hans
preferred label: kreftbehandling @no-nb
preferred label: Onkologie @de
preferred label: Oncologie @fr
preferred label: Oncología @es
preferred label: علم الأورام @ar
definition: A medical specialisation that focuses on the prevention, diagnosis, and treatment of cancer
definition: Läran om tumörsjukdomar. Medicinsk specialitet som fokuserar på tumörsjukdomar @se
definition: Especialidade médica que se dedica ao estudo, prevenção, diagnóstico e tratamento do cancro. @pt-pt
definition: Especialidade médica que se dedica ao estudo, prevenção, diagnóstico e tratamento do câncer. @pt-br
definition: En medicinsk specialisering, der fokuserer på forebyggelse, diagnose og behandling af kræft. @dk
definition: 癌症预防、诊断和治疗的医学专业 @zh-hans
definition: Eine medizinische Spezialisierung, die sich auf die Prävention, Diagnose und Behandlung von Krebs konzentriert @de
definition: A medical specialization that focuses on the prevention, diagnosis, and treatment of cancer
change note: Retired. Use medtop:20000447 cancer instead.
in scheme: Media Topic
created: 2019-04-06T12:00:00+00:00
retired: 2022-06-14T12:00:00+00:00
modified: 2022-06-14T12:00:00+00:00
broader: medical specialisation

radiology
type: Concept
preferred label: Röntgen @se
preferred label: radiologia @pt-pt
preferred label: radiologi @dk
preferred label: 放射科 @zh-hans
preferred label: Radiologie @de
preferred label: Radiologie médicale @fr
preferred label: Radiología @es
preferred label: علم الأشعة @ar
definition: A medical specialisation that focuses on the use of medical imaging (such as x-rays) and radiation to diagnose and sometimes also treat diseases within the body
definition: Använda strålning eller liknande metoder för att avbilda kroppens insida. @se
definition: Especialidade médica que se dedica ao estudo e emprego de imagens médicas (como raios X) e de radiação para diagnosticar e tratar doenças no interior do corpo. @pt-pt
definition: En medicinsk specialisering, der fokuserer på brugen af medicinsk billeddannelse (såsom røntgenstråler) og stråling til diagnosticering og undertiden også behandling af sygdomme i kroppen. @dk
definition: 侧重于使用医学成像(如x射线)和辐射来诊断和治疗身体内的疾病的医学专业 @zh-hans
definition: Eine medizinische Spezialisierung, die sich auf den Einsatz von medizinischer Bildgebung (z.B. Röntgenstrahlen) und Strahlung zur Diagnose und manchmal auch zur Behandlung von Krankheiten im Körper konzentriert @de
definition: A medical specialization that focuses on the use of medical imaging (such as x-rays) and radiation to diagnose and sometimes also treat diseases within the body
change note: Retired.
in scheme: Media Topic
created: 2019-04-06T12:00:00+00:00
retired: 2022-06-14T12:00:00+00:00
modified: 2022-06-14T12:00:00+00:00
broader: medical specialisation

eye care
type: Concept
preferred label: Ögonvård @se
preferred label: oftalmologia @pt-pt
preferred label: oftalmologi @dk
preferred label: 眼科 @zh-hans
preferred label: behandling av øyesykdommer @no-nb
preferred label: Augenheilkunde @de
preferred label: Ophtalmologie @fr
preferred label: Oftalmología @es
preferred label: طب العيون @ar
preferred label: behandling av augesjukdommar @no-nn
definition: The medical profession and field of study devoted to diagnosing, preventing and treating eye conditions
definition: Sjukvård som hanterar sjukdommar och andra problem i ögonen/synen. @se
definition: Especialidade médica que se dedica ao estudo e tratamento de doenças e transtornos dos olhos. @pt-pt
definition: En medicinsk specialisering, der fokuserer på sygdomme og lidelser i øjet. @dk
definition: 研究眼睛疾病和失调的医学专业 @zh-hans
definition: Eine medizinische Spezialisierung, die sich auf Krankheiten und Störungen des Auges konzentrier @de
in scheme: Media Topic
created: 2019-04-06T12:00:00+00:00
modified: 2022-06-14T12:00:00+00:00
broader: medical specialisation

surgical medicine
type: Concept
preferred label: Kirurgi (inriktning) @se
preferred label: medicina cirúrgica @pt-pt
preferred label: kirurgisk medicin @dk
preferred label: 外科 @zh-hans
preferred label: kirurgisk medisin @no-nb
preferred label: Chirurgische Medizin @de
preferred label: Chirurgie @fr
preferred label: Cirugía @es
preferred label: الجراحة العامة @ar
definition: A medical specialisation that focuses on the treatment of injuries or disorders of the body by incision or manipulation, especially with instruments
definition: Sjukvård där någon form av ingrepp i kroppen sker för att avlägsna skadade delar, eller reparera skadade saker. @se
definition: Especialidade médica que se dedica ao tratamento de lesões ou traumatismos por meio de incisão ou manipulação, especialmente com instrumentos, no corpo do paciente. @pt-pt
definition: Medicinsk pleje, hvor enhver form for intervention i kroppen udføres for at fjerne beskadigede dele eller reparere beskadigede ting. @dk
definition: 专注于通过手术切口或操作，特别是用器械治疗身体损伤或疾病的医学专业 @zh-hans
definition: Eine medizinische Spezialisierung, die sich auf die Behandlung von Verletzungen oder Störungen des Körpers durch Einschnitte oder Manipulation, insbesondere mit Instrumenten, konzentriert. @de
definition: A medical specialization that focuses on the treatment of injuries or disorders of the body by incision or manipulation, especially with instruments
change note: Retired. Use medtop:20001228 surgery instead.
in scheme: Media Topic
created: 2019-04-06T12:00:00+00:00
retired: 2022-06-14T12:00:00+00:00
modified: 2022-06-14T12:00:00+00:00
broader: medical specialisation

psychiatry
type: Concept
preferred label: Psykiatri @se
preferred label: psiquiatria @pt-pt
preferred label: psykiatri @dk
preferred label: 精神病科 @zh-hans
preferred label: Psychiatrie @de
preferred label: Psiquiatría @es
preferred label: طب نفسي @ar
definition: A medical specialisation that focuses on the diagnosis, prevention and treatment of mental disorders
definition: Sjukvård som gäller diagnosticering, förebyggande och behandling av mentala åkommor. @se
definition: Especialidade médica que se dedica ao estudo, diagnóstico, prevenção e tratamento de transtornos mentais. @pt-pt
definition: En medicinsk specialisering, der fokuserer på diagnose, forebyggelse og behandling af psykiske lidelser. @dk
definition: 专注于精神疾病诊断、预防和治疗的医学专业 @zh-hans
definition: Eine medizinische Spezialisierung, die sich auf die Diagnose, Prävention und Behandlung von psychischen Störungen konzentriert @de
definition: A medical specialization that focuses on the diagnosis, prevention and treatment of mental disorders
change note: Retired. Use medtop:20000458 mental health instead.
in scheme: Media Topic
created: 2019-04-06T12:00:00+00:00
retired: 2022-06-14T12:00:00+00:00
modified: 2022-06-14T12:00:00+00:00
broader: medical specialisation

animal disease
type: Concept
preferred label: Tierkrankheit @de
preferred label: Maladie animale @fr
preferred label: Djursjukdomar @se
preferred label: مرض حيواني @ar
preferred label: Enfermedades animales @es
preferred label: doenças dos animais @pt-pt
preferred label: dyresygdom @dk
preferred label: 动物疾病 @zh-hans
preferred label: dyresykdommer @no-nb
preferred label: dyresjukdommar @no-nn
definition: Krankheit, die Tiere befällt @de
definition: Sjukdomar som drabbar djur. @se
definition: Diseases that affect animals on a wide scale, including zoonotic diseases such as avian influenza
definition: Doenças que afetam os animais. @pt-pt
definition: Sygdomme, der rammer dyr. @dk
definition: 影响动物的疾病 @zh-hans
in scheme: Media Topic
created: 2009-10-22T02:00:00+00:00
modified: 2025-10-09T12:00:00+00:00
broader: animal

plant disease
type: Concept
preferred label: Pflanzenkrankheit @de
preferred label: Enfermedades de plantas @es
preferred label: Maladie végétale @fr
preferred label: Växtsjukdomar @se
preferred label: مرض نباتي @ar
preferred label: doenças das plantas @pt-pt
preferred label: plantesygdom @dk
preferred label: 植物疾病 @zh-hans
preferred label: plantesykdommer @no-nb
preferred label: plantesjukdommar @no-nn
definition: Sjukdomar som drabbar växter, orsakade av parasiter eller miljöproblem. @se
definition: Krankheit, die Pflanzen befällt, verursacht durch Parasiten oder durch Umwelteinflüsse @de
definition: Disorders affecting plants caused by factors such as parasites, fungi, bacteria, physical injuries or environmental factors
definition: Doenças que afetam as plantas, causadas por parasitas ou fatores ambientais. @pt-pt
definition: Sygdomme, der påvirker planter, forårsaget af parasitter eller miljøproblemer. @dk
definition: 由寄生虫或环境因素引起的影响植物的疾病 @zh-hans
in scheme: Media Topic
created: 2009-10-22T02:00:00+00:00
modified: 2025-10-09T12:00:00+00:00
broader: flowers and plants

pest and pest control
type: Concept
preferred label: skadedyr @no-nb
preferred label: Skadedjur @se
preferred label: pragas @pt-pt
preferred label: 害虫 @zh-hans
preferred label: Schädlinge @de
preferred label: Organisme nuisible @fr
preferred label: Plagas @es
preferred label: كائنات عضوية ضارة @ar
definition: Animals or insects that invade a human space causing destruction or unsanitary conditions and the methods for controlling or eradicating them
definition: Djur eller insekter som tar sig in i byggnader och ställer till skada @se
definition: Dyr eller insekter, der trænger ind i menneskers ejendom og forårsager skade. @dk
definition: Animais ou insetos que invadem um espaço humano e causam destruição ou condições insalubres. @pt-pt
definition: 破坏人类生活环境或卫生条件的动物或昆虫 @zh-hans
definition: Tiere oder Insekten, die in einen menschlichen Raum eindringen und Zerstörung oder unhygienische Bedingungen verursachen @de
in scheme: Media Topic
created: 2021-02-18T12:00:00+00:00
modified: 2025-10-09T12:00:00+00:00
broader: animal

name ceremony
type: Concept
preferred label: Namngivning @se
preferred label: cerimónia de batismo @pt-pt
preferred label: cerimônia de batismo @pt-br
preferred label: navngivningsceremoni @dk
preferred label: 命名仪式 @zh-hans
preferred label: navneseremoni @no-nb
preferred label: Namenstag @de
preferred label: Baptême civil @fr
preferred label: Ceremonia de bautizo civil @es
preferred label: حفل تعيين @ar
preferred label: namneseremoni @no-nn
definition: Event at which an infant, youth, or adult is given a name
definition: Nyheter om namngivning/dop @se
definition: Evento em que um bebé, jovem ou adulto recebe um nome. @pt-pt
definition: Evento em que um bebê, jovem ou adulto recebe um nome. @pt-br
definition: Ceremoni, hvor et barn eller en voksen får tildelt et navn. @dk
definition: 给婴儿、青年或成人起名字的公开活动 @zh-hans
definition: Veranstaltung, bei der einem Säugling, Jugendlichen oder Erwachsenen ein Name gegeben wird @de
in scheme: Media Topic
created: 2019-06-26T12:00:00+00:00
modified: 2021-07-12T12:00:00+00:00
broader: ceremony

graduation
type: Concept
preferred label: Examen & student @se
preferred label: cerimónia de graduação @pt-pt
preferred label: formatura @pt-br
preferred label: dimission @dk
preferred label: 毕业 @zh-hans
preferred label: vitnemålsseremoni @no-nb
preferred label: Abschlussfeier @de
preferred label: Remise de diplôme @fr
preferred label: Graduación @es
preferred label: تخرج @ar
definition: A ceremony, also known as commencement, at which a person receives a diploma or academic degree
definition: Nyheter om studenter och andra former av examen @se
definition: Cerimónia na qual uma pessoa recebe um diploma ou grau académico. @pt-pt
definition: Cerimônia na qual uma pessoa recebe um diploma ou grau acadêmico. @pt-br
definition: En ceremoni, hvor en person modtager bevis for at have bestået en uddannelse. @dk
definition: 一个人获得文凭或学位的仪式，也称为毕业典礼 @zh-hans
definition: Eine Zeremonie, auch bekannt als Beginn, bei der eine Person ein Diplom oder einen akademischen Grad erhält @de
definition: Avslutningsseremoni etter vidaregåande og høgare utdanning. @no-nn
definition: Avslutningsseremoni etter videregående og høyere utdanning. @no-nb
in scheme: Media Topic
created: 2019-06-26T12:00:00+00:00
modified: 2021-07-12T12:00:00+00:00
broader: ceremony

funeral and memorial service
type: Concept
preferred label: Begravning @se
preferred label: funeral e serviço fúnebre @pt-pt
preferred label: begravelse og bisættelse @dk
preferred label: 葬礼及追悼会 @zh-hans
preferred label: begravelse og bisettelse @no-nb
preferred label: Beerdigung und Gedenkfeier @de
preferred label: Service funèbre et commémoratif @fr
preferred label: Servicio funerario y memorial @es
preferred label: جنازة ومراسم تأبين @ar
preferred label: gravferd og bisetjing @no-nn
definition: A ceremony to memorialise a deceased person
definition: Nyheter om jordfästning av en person @se
definition: Cerimónia para fazer homenagem a uma pessoa falecida e / ou o enterro dos restos mortais dessa pessoa. @pt-pt
definition: Cerimônia para fazer homenagem a uma pessoa falecida e / ou o enterro dos restos mortais dessa pessoa. @pt-br
definition: En ceremoni, hvor man mindes en afdød og begraver eller tager afsked med vedkommendes jordiske rester. @dk
definition: 纪念死者和/或埋葬死者遗体的仪式 @zh-hans
definition: Eine Zeremonie zum Gedenken an eine verstorbene Person und/oder die Bestattung der sterblichen Überreste dieser Person. @de
in scheme: Media Topic
created: 2019-06-26T12:00:00+00:00
modified: 2021-07-12T12:00:00+00:00
broader: ceremony

wedding
type: Concept
preferred label: bryllup @dk
preferred label: vielse @no-nb
preferred label: casamento @pt-pt
preferred label: Bröllop @se
preferred label: 婚礼 @zh-hans
preferred label: Hochzeit @de
preferred label: Mariage @fr
preferred label: Boda @es
preferred label: حفل زواج @ar
preferred label: vigsel @no-nn
definition: Alt, hvad der foregår omkring et bryllup. Foruden selve ceremonien kan det være en reception, en bryllupsfest eller en polterabend. @dk
definition: Marriage ceremony and the events and parties surrounding it, such as wedding receptions, engagement parties, bridal showers and hen or stag parties
definition: Cerimônia de casamento, bem como eventos e festas relacionados, como recepções de casamento, festas de noivado, chás de panela e despedidas de solteiro / solteira. @pt-br
definition: Cerimónia de casamento, bem como eventos e festas relacionados, como receções de casamento, festas de noivado, chás de panela e despedidas de solteiro / solteira. @pt-pt
definition: Olika aktiviteter kring den ceremoni då två personer gifter sig, kyrkligt eller borgerligt. @se
definition: 结婚典礼及其相关的活动和派对，例如婚宴、订婚派对、新娘送礼会和单身汉/未婚女子派对 @zh-hans
definition: Trauungszeremonie und die sie umgebenden Veranstaltungen und Feste, wie Hochzeitsempfänge, Verlobungsfeiern, Brautduschen und Junggesellen-/Bachelorettenpartys. @de
definition: Marriage ceremony and the events and parties surrounding it, such as wedding receptions, engagement parties, bridal showers and bachelor or bachelorette parties
in scheme: Media Topic
created: 2019-06-26T12:00:00+00:00
modified: 2021-07-12T12:00:00+00:00
broader: ceremony

royalty
type: Concept
preferred label: Royauté @fr
preferred label: Asuntos imperiales, reales @es
preferred label: Kungligt @se
preferred label: شؤون امبراطورية وملكية @ar
preferred label: Adel @de
preferred label: realeza @pt-pt
preferred label: kongelige og kejserlige @dk
preferred label: 皇室事务 @zh-hans
preferred label: kongelige @no-nb
preferred label: kongelege @no-nn
definition: Nyheter om kungliga personer och då främst deras sociala liv till skillnad från mer officiella uppdrag. @se
definition: Imperial and royal family members in their societal rather than governmental roles
definition: Nachrichten über Adelige oder Angehörige von Königsfamilien, alltägliches und bezüglich ihrer Rolle als regierende Königshäuser @de
definition: Notícias sobre membros de famílias reais e imperiais, incluindo assuntos de sistemas legais. @pt-pt
definition: Nyheder om kongelige mennesker og især deres sociale liv, i modsætning til mere officielle opgaver. @dk
definition: 皇室成员在他们的社会角色而不是政府角色中 @zh-hans
in scheme: Media Topic
created: 2009-10-22T02:00:00+00:00
modified: 2021-05-05T12:00:00+00:00
broader: high society

apprenticeship
type: Concept
preferred label: Ausbildung @de
preferred label: Apprentissage @fr
preferred label: Aprendices @es
preferred label: مبتدئون/متدربون @ar
preferred label: Lärlingar @se
preferred label: estagiários e aprendizes @pt-pt
preferred label: lærling @dk
preferred label: 学徒 @zh-hans
definition: A period of work used to learn a skill or trade
definition: Menschen, die sich lernend im Arbeitsprozess befinden und von einem Ausbilder betreut werden @de
definition: Den som lär ett yrke, oftast ett hantverksyrke, genom att arbeta tillsammans med någon tidigare yrkesutbildad. @se
definition: Pessoas que fazem parte de uma força de trabalho num nível inicial, aprendendo a profissão sob a direção de alguém. @pt-pt
definition: Pessoas que fazem parte de uma força de trabalho em nível inicial, aprendendo a profissão sob a direção de alguém. @pt-br
definition: Enhver, der undervises i et erhverv, normalt et håndværk, ved at arbejde med nogen, der tidligere er blevet uddannet. @dk
definition: 在劳动力中处于学习阶段，在师傅手下工作的人 @zh-hans
in scheme: Media Topic
created: 2009-10-22T02:00:00+00:00
modified: 2021-02-18T12:00:00+00:00
broader: employment

child labour
type: Concept
preferred label: Travail des enfants @fr
preferred label: Barnarbete @se
preferred label: Kinderarbeit @de
preferred label: عمل الاطفال @ar
preferred label: Trabajo infantil @es
preferred label: trabalho infantil @pt-pt
preferred label: børne- og ungearbejde @dk
preferred label: 童工 @zh-hans
preferred label: barnearbeid @no-nb
preferred label: child labor
definition: The employment of children
definition: Arbete utfört av barn under 18 års ålder. @se
definition: Beschäftigung von Kindern meistens unter 18 Jahre @de
definition: Trabalho de crianças, geralmente com menos de 18 anos. @pt-pt
definition: Arbejde udført af børn under 18 år. @dk
definition: 指被雇佣的18岁以下未成年人 @zh-hans
in scheme: Media Topic
created: 2009-10-22T02:00:00+00:00
modified: 2021-02-18T12:00:00+00:00
broader: employment

employee
type: Concept
preferred label: موظف @ar
preferred label: Arbeitnehmer @de
preferred label: Salarié @fr
preferred label: Arbetstagare @se
preferred label: Empleados @es
preferred label: empregado @pt-pt
preferred label: medarbejder @dk
preferred label: 员工 @zh-hans
preferred label: arbeidstaker @no-nb
preferred label: arbeidstakar @no-nn
definition: Fysisk person som i ett anställningsavtal mot vederlag utför arbete åt motparten, arbetsgivaren. @se
definition: Those who are paid or otherwise compensated for providing services to employers
definition: Jemand der seine Zeit und Fähigkeiten gegen Geld und andere Vergütungen anbietet @de
definition: Pessoa que troca o seu tempo, talento e capacidades por dinheiro e outros benefícios. @pt-pt
definition: Pessoa que troca seu tempo, talento e capacidades por dinheiro e outros benefícios. @pt-br
definition: En person, der i en ansættelseskontrakt for vederlag, udfører arbejde for modparten, arbejdsgiveren. @dk
definition: 一个用自己的时间和才能换取金钱和其他利益的人 @zh-hans
in scheme: Media Topic
created: 2009-10-22T02:00:00+00:00
modified: 2021-02-18T12:00:00+00:00
broader: employment

employer
type: Concept
preferred label: رب العمل @ar
preferred label: Employeur @fr
preferred label: Arbetsgivare @se
preferred label: Empleadores @es
preferred label: Arbeitgeber @de
preferred label: empregador @pt-pt
preferred label: arbejdsgiver @dk
preferred label: 雇主 @zh-hans
preferred label: arbeidsgiver @no-nb
preferred label: arbeidsgivar @no-nn
definition: Juridisk eller fysisk person som betalar en annan person, arbetstagaren, lön för att få visst arbete utfört. @se
definition: Derjenige, der Arbeiter beschäftigt und ihre Löhne und andere Vergütungen zahlt. @de
definition: People and organisations that pay employees to provide services
definition: Pessoa que emprega trabalhadores e paga salários e outros benefícios. @pt-pt
definition: Den person, der beskæftiger arbejdstagere og betaler lønninger og andre fordele til arbejdstagerne. @dk
definition: 雇佣工人并向工人支付工资和其他福利的人 @zh-hans
definition: People and organizations that pay employees to provide services
in scheme: Media Topic
created: 2009-10-22T02:00:00+00:00
modified: 2021-02-18T12:00:00+00:00
broader: employment

employment training
type: Concept
preferred label: تدريب مهني @ar
preferred label: Formation à l'emploi @fr
preferred label: Capacitación profesional @es
preferred label: Berufliche Bildung @de
preferred label: Yrkesträning @se
preferred label: formação profissional @pt-pt
preferred label: jobtræning @dk
preferred label: 就业培训 @zh-hans
preferred label: arbeidstrening @no-nb
definition: Learning new skills as part of an existing job, such as developing specialisations, learning new techniques or retraining when an employee's skills are no longer relevant
definition: Inlärning av kunskap och färdigheter som krävs för ett specifikt yrke. @se
definition: Erwerben von Sachkenntnis, die für eine Beschäftigung notwendig ist @de
definition: Aprendizagem de competências para o emprego. @pt-pt
definition: At lære den viden og de færdigheder, der kræves til et bestemt erhverv. @dk
definition: 就业所需的技能学习 @zh-hans
definition: Learning new skills as part of an existing job, such as developing specializations, learning new techniques or retraining when an employee's skills are no longer relevant
in scheme: Media Topic
created: 2009-10-22T02:00:00+00:00
modified: 2021-02-18T12:00:00+00:00
broader: employment
narrower: advanced training
narrower: retraining
broad match: http://cv.iptc.org/newscodes/subjectcode/09003000

occupations
type: Concept
preferred label: Yrken @se
preferred label: Beruf @de
preferred label: عمل @ar
preferred label: Profession @fr
preferred label: Oficios @es
preferred label: ocupações @pt-pt
preferred label: profession og faglighed @dk
preferred label: 职业 @zh-hans
preferred label: yrke @no-nb
definition: Typ av arbete som det går att försörja sig på och som kräver vissa särskilda kunskaper. @se
definition: Tätigkeit, Profession oder Geschäft im Allgemeinen, obwohl mit Profession meist Rechtsanwälte und Ärzte, mit Tätigkeit eher Angestellte oder Fernfahrer gemeint sind @de
definition: Generally one's trade, profession or business although professions are usually such things as lawyers and doctors, and occupations are such as clerks or truckers
definition: Em geral, ofício, profissão ou negócio, embora as profissões sejam geralmente coisas como advogados e médicos e as ocupações sejam algo como funcionários administrativos ou camionistas. @pt-pt
definition: Em geral, ofício, profissão ou negócio, embora as profissões sejam geralmente coisas como advogados e médicos e as ocupações sejam algo como funcionários administrativos ou caminhoneiros. @pt-br
definition: Den type arbejde, en person primært beskæftiger sig med. @dk
definition: 通常指一个人的专长、专业或业务，尽管专业通常指医生、律师，而职业通常指职员或司机 @zh-hans
in scheme: Media Topic
created: 2009-10-22T02:00:00+00:00
retired: 2019-10-07T12:00:00+00:00
modified: 2021-02-18T12:00:00+00:00
broader: employment

wages and benefits
type: Concept
preferred label: Salaires et pensions ou Salaires et allocations @fr
preferred label: Löner och förmåner @se
preferred label: Lohn @de
preferred label: Salarios y pensiones @es
preferred label: اجور وتعويضات @ar
preferred label: salários e benefícios @pt-pt
preferred label: løn og goder @dk
preferred label: 工资和福利 @zh-hans
preferred label: lønn og goder @no-nb
preferred label: lønn og gode @no-nn
definition: Lohn für Arbeitnehmer @de
definition: Money, or other items of value such as pension contributions and health insurance, paid to employees as compensation for their work
definition: Den ersättning en anställd får efter utfört arbete. @se
definition: Remuneração laboral. @pt-pt
definition: Vederlag, som en medarbejder modtager, når arbejdet er afsluttet. @dk
definition: 员工的薪酬 @zh-hans
in scheme: Media Topic
created: 2009-10-22T02:00:00+00:00
modified: 2021-02-18T12:00:00+00:00
broader: employment
narrower: employee benefits
narrower: social security
narrower: profit sharing
broad match: http://cv.iptc.org/newscodes/subjectcode/09011001

self-employment
type: Concept
preferred label: Egenföretagande @se
preferred label: trabalho independente @pt-pt
preferred label: trabalho autônomo @pt-br
preferred label: selvstændig beskæftigelse @dk
preferred label: 自雇就业 @zh-hans
preferred label: selvstendig næringsdrivende @no-nb
preferred label: Selbstständigkeit @de
preferred label: Auto-entrepreneur @fr
preferred label: Autoempleo @es
preferred label: مهنة حرة @ar
preferred label: sjølvstendig næringsdrivande @no-nn
definition: A situation in which an individual works for themselves as a freelancer or business owner instead of working for an employer that pays a salary or a wage
definition: När en person arbetar men gör det i form av ett eget företag som sedan har kontrakt med något beställande företag eller personer. @se
definition: Situação do indivíduo que trabalha para si mesmo como freelancer ou como empresário em vez de trabalhar para um empregador que lhe paga um salário. @pt-pt
definition: Når en person arbejder, men gør det i form af sit eget firma, som derefter har en kontrakt med et eller flere ordrerfirmaer eller personer. @dk
definition: 个人以自由职业者或企业主的身份为自己工作，而不是为支付工资或薪水的雇主工作 @zh-hans
definition: Eine Situation, in der eine Person für sich selbst als Freiberufler oder Geschäftsinhaber arbeitet, anstatt für einen Arbeitgeber zu arbeiten, der ein Gehalt oder einen Lohn zahlt @de
in scheme: Media Topic
created: 2019-04-06T12:00:00+00:00
modified: 2021-07-12T12:00:00+00:00
broader: employment

parental leave
type: Concept
preferred label: Föräldraledighet @se
preferred label: barsels- og forældreorlov @dk
preferred label: 产假与育婴假 @zh-hans
preferred label: foreldrepermisjon @no-nb
preferred label: licença parental @pt-pt
preferred label: Erziehungsurlaub @de
preferred label: Congé parental @fr
preferred label: Permiso por paternidad @es
preferred label: إجازة الأبوة @ar
definition: Time off work to give birth or care for a child
definition: Arbejdsorlov, som tildeles med det formål af føde eller passe et barn. @dk
definition: Rätt till ledighet för att föda barn eller ta hand om ett litet barn. @se
definition: 为分娩或照顾新生儿进行的休假 @zh-hans
definition: Licença para se ausentar do trabalho para poder dar à luz ou cuidar de uma criança. @pt-pt
definition: Freistellung von der Arbeit, um ein Kind zu gebären oder zu betreuen @de
in scheme: Media Topic
created: 2019-10-07T12:00:00+00:00
modified: 2021-07-12T12:00:00+00:00
broader: employment

volunteering
type: Concept
preferred label: frivilligt arbejde @dk
preferred label: Ideellt arbete @se
preferred label: 志愿服务 @zh-hans
preferred label: frivillig arbeid @no-nb
preferred label: voluntariado @pt-pt
preferred label: Ehrenamt @de
preferred label: Bénévolat @fr
preferred label: Voluntariado @es
preferred label: تطوع @ar
definition: Unpaid work undertaken freely by individuals as a service to others
definition: Ulønnet arbejde, som udføres af lyst med det formål at glæde eller gavne andre. @dk
definition: Jobb som utförs frivilligt och utan betalning för att hjälpa andra personer eller organisationer. @se
definition: 无偿并自愿向他人提供服务 @zh-hans
definition: Trabalho não remunerado realizado gratuitamente por indivíduos como um serviço aos outros. @pt-pt
definition: Unbezahlte Arbeit, die von Einzelpersonen als Dienst an anderen frei geleistet wird @de
in scheme: Media Topic
created: 2019-10-07T12:00:00+00:00
modified: 2021-07-12T12:00:00+00:00
broader: employment

advanced training
type: Concept
preferred label: Kompetensutveckling @se
preferred label: Fortbildung @de
preferred label: Especialización @es
preferred label: Formation continue @fr
preferred label: تأهيل متقدم @ar
preferred label: formação avançada @pt-pt
preferred label: efteruddannelse @dk
preferred label: 高级培训 @zh-hans
preferred label: videreutdanning @no-nb
preferred label: vidareutdanning @no-nn
definition: Ergänzende Maßnahmen, um aktuelle Sachkenntnisse zu erwerben @de
definition: Additional training to enhance current skills
definition: Studier och kurser för yrkesutövare och befattningshavare i syfte att ge kunskaper och färdigheter utöver vad en tidigare, grundläggande utbildning givit. @se
definition: Formação adicional para melhorar as competências atuais. @pt-pt
definition: Studier og kurser for fagfolk og ledere med henblik på at give viden og færdigheder ud over, hvad en tidligere grunduddannelse har givet. @dk
definition: 加强现有技能的额外培训 @zh-hans
in scheme: Media Topic
created: 2009-10-22T02:00:00+00:00
retired: 2019-10-07T12:00:00+00:00
modified: 2021-05-05T12:00:00+00:00
broader: employment training

retraining
type: Concept
preferred label: Reconversión @es
preferred label: اعادة تدريب @ar
preferred label: Reconversion @fr
preferred label: Umschulung @de
preferred label: Omskolning @se
preferred label: reconversão @pt-pt
preferred label: omskoling @dk
preferred label: 再培训 @zh-hans
preferred label: gjenopplæring @no-nb
preferred label: kurs og opplæring @no-nn
definition: Providing a worker training in new skills when his old skills are no longer applicable
definition: Maßnahme, um neue Sachkenntnisse zu erwerben, wenn die bestehenden nicht mehr länger verwendbar sind. @de
definition: Utbildning från ett yrkesområde till ett annat, företrädesvis för vuxna. @se
definition: Dotar um trabalhador de novas competências quando as antigas já não são aplicáveis. @pt-pt
definition: Dotar um trabalhador de novos conhecimentos e competências quando os antigos já não são aplicáveis. @pt-br
definition: Uddannelse fra et erhverv til et andet, helst for voksne. @dk
definition: 当老技能不再适用，为员工提供新技能培训 @zh-hans
definition: Etter- og vidareutdanning. @no-nn
in scheme: Media Topic
created: 2009-10-22T02:00:00+00:00
retired: 2019-10-07T12:00:00+00:00
modified: 2021-02-18T12:00:00+00:00
broader: employment training

employee benefits
type: Concept
preferred label: مكاسب العمال @ar
preferred label: Anställningsförmåner @se
preferred label: Arbeitnehmerzulage @de
preferred label: Avantages sociaux @fr
preferred label: Beneficios laborales @es
preferred label: benefícios laborais @pt-pt
preferred label: benefícios trabalhistas @pt-br
preferred label: medarbejderfordel @dk
preferred label: 员工福利 @zh-hans
preferred label: frynsegoder @no-nb
preferred label: frynsegode @no-nn
definition: Sowohl Vergütungen, die ein Arbeitnehmer von einer Firma erhält, wie auch Pensionen, Krankenversicherung @de
definition: Arbetsgivaren köper varor eller tjänster, ger ränteförmånliga lån eller hyr tillgångar åt sina anställda för de anställdas privata användning. @se
definition: Benefits provided to an employee by a company, such as pension contributions, health insurance.
definition: Benefícios fornecidos a um funcionário por uma empresa, como contribuições para o regime de pensões, seguro de saúde. @pt-pt
definition: Fordele, som en virksomhed leverer til en medarbejder, såsom pensionsbidrag, sundhedsforsikring. @dk
definition: 公司为雇员提供的福利，如养老金、健康保险等 @zh-hans
in scheme: Media Topic
created: 2009-10-22T02:00:00+00:00
retired: 2019-10-07T12:00:00+00:00
modified: 2021-02-18T12:00:00+00:00
broader: wages and benefits

social security
type: Concept
preferred label: Cotisations Vieillesse @fr
preferred label: Seguridad social @es
preferred label: ضمان اجتماعي @ar
preferred label: Renten- und Sozialversicherung @de
preferred label: Socialförsäkring @se
preferred label: segurança social @pt-pt
preferred label: seguridade social @pt-br
preferred label: social sikring @dk
preferred label: 社会保障 @zh-hans
preferred label: trygd @no-nb
definition: Trygghetsförsäkring som omfattar alla medborgare t ex folkpension, allmän sjukförsäkring, yrkesskadeförsäkring och arbetslöshetsförsäkring. @se
definition: a government system that provides monetary assistance to people with inadequate or no incomes, such as retirees, disabled people or carers
definition: Zahlungen, die von Einzelnen und Firmen an die Regierung geleistet werden und in einem bestimmten Alter an den Einzelnen ausgezahlt wird. @de
definition: Dinheiro entregue pelo indivíduo e pelas empresas para uma conta do governo para ser pago quando esse indivíduo atinge uma certa idade. @pt-pt
definition: Penge, der indbetales af enkeltpersoner og virksomheder på en statskonto, der skal udbetales, når denne person når en bestemt alder. @dk
definition: 联邦社会保险捐款法。个人和公司存入政府账户的款项，在个人达到一定年龄时支付 @zh-hans
definition: a government system that provides monetary assistance to people with inadequate or no incomes, such as retirees, disabled people or caregivers
in scheme: Media Topic
created: 2009-10-22T02:00:00+00:00
modified: 2021-02-18T12:00:00+00:00
broader: wages and benefits

profit sharing
type: Concept
preferred label: overskotsdeling @no-nn
preferred label: overskuddsdeling @no-nb
preferred label: Vinstdelning @se
preferred label: Gewinnbeteiligung @de
definition: A system by which employees are paid a share of the net profits of their employer. These earnings are distinct from and additional to regular wages.
definition: System där anställda får del av företagets vinster. Vid sidan av vanlig lön. @se
definition: Ein System, bei dem die Arbeitnehmer einen Anteil am Nettogewinn ihres Arbeitgebers erhalten. Dieser Verdienst unterscheidet sich von den regulären Löhnen und wird zusätzlich zu diesen gezahlt. @de
in scheme: Media Topic
created: 2023-10-02T12:00:00+00:00
modified: 2023-10-02T12:00:00+00:00
broader: wages and benefits

workplace health and safety
type: Concept
preferred label: Arbetsmiljöfrågor @se
preferred label: الصحة والسلامة في العمل @ar
preferred label: Règles de sécurité au travail @fr
preferred label: Salud y seguridad laboral @es
preferred label: Arbeitssicherheit @de
preferred label: higiene e segurança no trabalho @pt-pt
preferred label: sundhed og sikkerhed på arbejdspladsen @dk
preferred label: 劳动卫生和劳动安全 @zh-hans
preferred label: helse, miljø og sikkerhet @no-nb
preferred label: helse, miljø og tryggleik @no-nn
definition: Regler och processer för att garantera arbetstagarnas hälsa. @se
definition: Laws protecting a safe and healthy work environment
definition: Regeln und Maßnahmen, die die Gesundheit der Arbeiter garantieren. @de
definition: Regras e procedimentos para garantir a saúde dos trabalhadores. @pt-pt
definition: Regler og procedurer for sikring af arbejdstagernes sundhed. @dk
definition: 保障劳动者健康的规章制度和程序 @zh-hans
in scheme: Media Topic
created: 2009-10-22T02:00:00+00:00
modified: 2021-02-18T12:00:00+00:00
broader: employment legislation

gig economy
type: Concept
preferred label: tidsbegrænset ansættelse @dk
preferred label: Gig-ekonomi @se
preferred label: 零工经济 @zh-hans
preferred label: oppdragsøkonomi @no-nb
preferred label: economia dos serviços pontuais @pt-pt
preferred label: economia sob demanda @pt-br
preferred label: Gig-Economy @de
preferred label: Gig economy @fr
preferred label: اقتصاد العربة @ar
definition: a labour market consisting of individual suppliers on short-term contracts or freelance work as opposed to permanent jobs, such as drivers or delivery workers
definition: En tendens på arbejdsmarkedet, hvor man ansættes fra dag til dag eller fra opgave til opgave i modsætning til fast arbejde samme sted. @dk
definition: En arbetsmarknad där enskilda personer jobbar på korta uppdrag istället för att vara fast anställda. @se
definition: 由基于短期合约或自由职业者构成的劳动力市场，与长期雇佣相区别 @zh-hans
definition: Mercado de trabalho que consiste em fornecedores individuais de serviços com contratos de curto prazo ou freelance em oposição a empregos permanentes, como motoristas ou entregadores. @pt-pt
definition: einen Arbeitsmarkt, der aus einzelnen Zulieferern mit kurzfristigen Verträgen oder freiberuflicher Arbeit besteht, im Gegensatz zu Festanstellungen, wie z.B. Fahrer oder Auslieferungspersonal @de
definition: a labor market consisting of individual suppliers on short-term contracts or freelance work as opposed to permanent jobs, such as drivers or delivery workers
in scheme: Media Topic
created: 2019-10-07T12:00:00+00:00
modified: 2021-07-12T12:00:00+00:00
broader: labour market

collective agreements
type: Concept
preferred label: Kollektivavtal @se
preferred label: Convention collective @fr
preferred label: عقد جماعي @ar
preferred label: Tarifvertrag @de
preferred label: Contratos colectivos @es
preferred label: contrato coletivo @pt-pt
preferred label: contratos coletivos @pt-br
preferred label: kollektiv aftale @dk
preferred label: 集体合同 @zh-hans
preferred label: tariffavtale @no-nb
definition: Överenskommelse mellan facklig organisation och arbetsgivare om anställningsvillkor. @se
definition: Negotiated guidelines for relationships between groups of employees and employers, including issues such as working hours, wages, health care, pensions and other benefits
definition: Schriftliche Verträge, die sich auf eine bestimmte Gruppe von Beschäftigten beziehen. @de
definition: Contratos geralmente escritos que cobrem uma classe específica de trabalhadores. @pt-pt
definition: Aftale mellem fagforeningsorganisation og arbejdsgiver om ansættelsesvilkår, herunder uenighed om dens fortolkning. @dk
definition: 通常是涉及特定类别工人的书面合同 @zh-hans
in scheme: Media Topic
created: 2009-10-22T02:00:00+00:00
modified: 2021-02-18T12:00:00+00:00
broader: labour relations
narrower: contract issue-healthcare
narrower: contract issue-wages
narrower: contract issue-work rules

labour dispute
type: Concept
preferred label: Conflit social @fr
preferred label: Tarifkonflikt @de
preferred label: Arbetskonflikt @se
preferred label: نزاع عمل @ar
preferred label: Conflictos laborales @es
preferred label: conflitos laborais @pt-pt
preferred label: conflitos trabalhistas @pt-br
preferred label: arbejdskonflikt @dk
preferred label: 劳动争议 @zh-hans
preferred label: arbeidskonflikt @no-nb
preferred label: labor dispute
definition: Meinungsverschiedenheiten der Tarifpartner über Arbeitsbedingungen, Bezahlung etc. @de
definition: Disagreements between employers and employees regarding work conditions, pay or other issues
definition: Akut motsättning mellan arbetstagare och arbetsgivare som tar sig uttryck i eller leder till stridsåtgärder, vanligtvis strejk eller lockout. @se
definition: Diferenças de opinião sobre condições de trabalho, salário, etc. @pt-pt
definition: Diferenças de opinião sobre condições de trabalho, salário etc. @pt-br
definition: Konflikter mellem arbejdstagere og arbejdsgivere, der kommer til udtryk i eller fører til bekæmpelse, normalt strejke eller lockout. @dk
definition: 对工作条件、工资等意见的分歧 @zh-hans
in scheme: Media Topic
created: 2009-10-22T02:00:00+00:00
modified: 2021-02-18T12:00:00+00:00
broader: labour relations
narrower: labour strike

contract issue-healthcare
type: Concept
preferred label: Friskvårdsavtal @se
preferred label: Conditions de travail @fr
preferred label: Krankengeld @de
preferred label: Contratos/cuidado de salud @es
preferred label: عقد عمل/ضمان صحي @ar
preferred label: questões contratuais de saúde @pt-pt
preferred label: kontraktligt problem - sundhedspleje @dk
preferred label: 医疗保健合同 @zh-hans
preferred label: bedriftshelsetjeneste @no-nb
preferred label: bedriftshelseteneste @no-nn
definition: Teile des Tarifvertrages und der Tarifverhandlungen, die sich auf die Versorgung im Krankheitsfall beziehen. @de
definition: Element of contracts and contract discussions centring on health care issues
definition: Avtal om åtgärder för att förebygga sjukdomar. @se
definition: Elementos e discussões contratuais sobre questões de cuidados de saúde. @pt-pt
definition: Aftale om foranstaltninger til forebyggelse af sygdom. @dk
definition: 合同要素和合同讨论集中在卫生保健问题上 @zh-hans
definition: Element of contracts and contract discussions centering on health care issues
in scheme: Media Topic
created: 2009-10-22T02:00:00+00:00
retired: 2019-10-07T12:00:00+00:00
modified: 2021-05-05T12:00:00+00:00
broader: collective agreements

contract issue-wages
type: Concept
preferred label: Löneavtal @se
preferred label: عقد عمل/رواتب @ar
preferred label: Accords salariaux @fr
preferred label: Contratos/pagos @es
preferred label: Gehaltstarifvertrag @de
preferred label: questões contratuais de salário @pt-pt
preferred label: aftalebrud - løn @dk
preferred label: 工资合同 @zh-hans
preferred label: lønn @no-nb
definition: Element of contracts and contract discussions centring on remuneration
definition: Teile der Tarifverträge und Tarifverhandlungen, die sich auf die Vergütung beziehen. @de
definition: Avtal om ersättning för utfört arbete. @se
definition: Elementos e discussões contratuais sobre remuneração. @pt-pt
definition: Aftale om kompensation for udført arbejde. @dk
definition: 合同的要素和合同讨论的焦点是报酬 @zh-hans
definition: Element of contracts and contract discussions centering on remuneration
in scheme: Media Topic
created: 2009-10-22T02:00:00+00:00
retired: 2019-10-07T12:00:00+00:00
modified: 2021-05-05T12:00:00+00:00
broader: collective agreements

contract issue-work rules
type: Concept
preferred label: عقد عمل/قواعد العمل @ar
preferred label: Manteltarifvertrag @de
preferred label: Arbetstidsavtal @se
preferred label: Règlement intérieur d'entreprises @fr
preferred label: Contratos/normas de trabajo @es
preferred label: questões contratuais laborais @pt-pt
preferred label: questões contratuais trabalhistas @pt-br
preferred label: kontraktligt problem - arbejdsregel @dk
preferred label: 工作规则合同 @zh-hans
preferred label: personalhåndbok @no-nb
preferred label: personalhandbok @no-nn
definition: Avtal om arbetstid, t ex längd, förläggning eller avbrott i arbetet för vila. @se
definition: Teile des Tarifvertrages und der Tarifverhandlungen, die sich auf die Versorgung, Pausenregelung, Urlaubsregelung, Arbeitszeit, Krankmeldung etc. beziehen. @de
definition: Element of contracts and contract discussions centring on rules affecting issues such as lunch and other breaks, work shifts, vacation scheduling, seniority, sick leave etc.
definition: Elementos e discussões contratuais sobre regras relacionadas com questões como almoço e outras pausas, turnos, marcação de férias, antiguidade, licença por doença, etc. @pt-pt
definition: Elementos e discussões contratuais sobre regras relacionadas com questões como almoço e outras pausas, turnos, marcação de férias, antiguidade, licença por doença etc. @pt-br
definition: Aftaler om arbejdstid, f.eks. længde, placering eller afbrydelse af arbejdet for hvile. @dk
definition: 合同的讨论集中在规则影响等问题，如午餐和其他休息时间，轮班工作问题，假期安排问题，工龄问题、病假问题等 @zh-hans
definition: Element of contracts and contract discussions centering on rules affecting issues such as lunch and other breaks, work shifts, vacation scheduling, seniority, sick leave etc.
in scheme: Media Topic
created: 2009-10-22T02:00:00+00:00
retired: 2019-10-07T12:00:00+00:00
modified: 2021-02-18T12:00:00+00:00
broader: collective agreements

labour strike
type: Concept
preferred label: Huelga @es
preferred label: اضراب @ar
preferred label: Strejk @se
preferred label: Grèves @fr
preferred label: Streik @de
preferred label: greve @pt-pt
preferred label: strejke og lockout @dk
preferred label: 罢工 @zh-hans
preferred label: streik @no-nb
preferred label: labor strike
definition: Organiserad nedläggelse av arbete i syfte att utöva påtryckningar på arbetsgivaren under längre eller kortare tid. @se
definition: Groups of employees agreeing to cease work activities with the aim of achieving better pay or work conditions
definition: Eine Arbeitsaktion, umfasst die Niederlegung der Arbeit. @de
definition: Ação por parte dos empregados que envolve paralisação de atividade laboral. @pt-pt
definition: Organiseret lukning af arbejdet for at udøve pres på arbejdsgiveren i en længere eller kortere periode. @dk
definition: 涉及停止工作的临时罢工示威 @zh-hans
in scheme: Media Topic
created: 2009-10-22T02:00:00+00:00
modified: 2021-02-18T12:00:00+00:00
broader: labour dispute

pension
type: Concept
preferred label: Pension de retraite @fr
preferred label: راتب تقاعد @ar
preferred label: Pensión @es
preferred label: Pensions @se
preferred label: Rente @de
preferred label: pensão @pt-pt
preferred label: reforma pensionária @pt-br
preferred label: 养老金 @zh-hans
preferred label: alderspensjon @no-nb
definition: Payments, either government or private, to retired people
definition: Bezüge während des Ruhestands @de
definition: Regelbundet utbetalat belopp till person som har lämnat förvärvslivet av ålders- eller hälsoskäl. @se
definition: Pagamentos a uma pessoa reformada. @pt-pt
definition: Pagamentos a uma pessoa aposentada. @pt-br
definition: Faste månedlige betalinger til en pensioneret person. @dk
definition: 支付给退休人员的款项 @zh-hans
in scheme: Media Topic
created: 2009-10-22T02:00:00+00:00
modified: 2021-02-18T12:00:00+00:00
broader: retirement
broad match: http://cv.iptc.org/newscodes/subjectcode/09006000

job layoffs
type: Concept
preferred label: Uppsägningar @se
preferred label: تسريح موظفين @ar
preferred label: Plan social @fr
preferred label: Despidos @es
preferred label: Personalabbau @de
preferred label: despedimentos @pt-pt
preferred label: demissões @pt-br
preferred label: afskedigelse @dk
preferred label: 裁员 @zh-hans
preferred label: oppsigelser @no-nb
preferred label: oppseiingar @no-nn
definition: The reduction of a company's work force through dismissal because of changing economic factors
definition: Die Reduzierung von Arbeit innerhalb einer Firma durch Entlassungen aufgrund sich ändernder wirtschaftlicher Bedingungen. @de
definition: Ensidig förklaring av part i anställnings- eller kollektivavtal att avtalet ska upphöra på grund av förändrade ekonomiska förutsättningar. @se
definition: Redução da força de trabalho de uma empresa, através de despedimento por alteração de fatores económicos. @pt-pt
definition: Redução da força de trabalho de uma empresa, através de despedimento por alteração de fatores econômicos. @pt-br
definition: Reduktion af en virksomheds arbejdsstyrke set fra arbejdstagers synspunkt. @dk
definition: 由于经济因素的变化通过解雇方式而减少公司的人员规模 @zh-hans
in scheme: Media Topic
created: 2009-10-22T02:00:00+00:00
retired: 2019-10-07T12:00:00+00:00
modified: 2021-02-18T12:00:00+00:00
broader: unemployment

unemployment benefits
type: Concept
preferred label: Allocations chômage @fr
preferred label: Arbetslöshetsersättning @se
preferred label: Subsidio de paro @es
preferred label: Arbeitslosengeld @de
preferred label: تعويضات البطالة @ar
preferred label: subsídio de desemprego @pt-pt
preferred label: seguro-desemprego @pt-br
preferred label: arbejdsløshedsunderstøttelse @dk
preferred label: 失业救济金 @zh-hans
preferred label: arbeidsledighetstrygd @no-nb
preferred label: arbeidsløysetrygd @no-nn
definition: Monetary compensation paid to the jobless
definition: Finanzieller Ausgleich während der Arbeitslosigkeit @de
definition: Statsunderstödd försäkring som ger ersättning vid oförvållad arbetslöshet. @se
definition: Compensação monetária paga aos desempregados. @pt-pt
definition: Statsstøttet forsikring, der yder kompensation for uforsikret arbejdsløshed. @dk
definition: 支付给失业者的货币补偿金 @zh-hans
in scheme: Media Topic
created: 2009-10-22T02:00:00+00:00
modified: 2021-02-18T12:00:00+00:00
broader: unemployment
broad match: http://cv.iptc.org/newscodes/subjectcode/09009000

club and association
type: Concept
preferred label: Clubes y asociaciones @es
preferred label: Verein @de
preferred label: نادي وجمعية @ar
preferred label: Klubbar och föreningar @se
preferred label: Associations et clubs @fr
preferred label: clubes e associações @pt-pt
preferred label: klub og forening @dk
preferred label: 俱乐部和协会 @zh-hans
preferred label: forening @no-nb
preferred label: foreining @no-nn
definition: Einrichtungen, die von Einzelnen besucht werden, aufgrund gemeinsamer Interessen. @de
definition: Organisations joined by individuals because of similar interests
definition: Organisationer med medlemmar som delar ett intresse. @se
definition: Organizações a que as pessoas aderem por partilharem interesses similares. @pt-pt
definition: Organisation med medlemmer, der deler en interesse. @dk
definition: 个人出于类似兴趣而加入的组织 @zh-hans
definition: organizations joined by individuals because of similar interests
in scheme: Media Topic
created: 2009-10-22T02:00:00+00:00
modified: 2021-02-18T12:00:00+00:00
broader: leisure

game
type: Concept
preferred label: Juegos @es
preferred label: Spel @se
preferred label: العاب @ar
preferred label: Jeux @fr
preferred label: Spiel @de
preferred label: jogos @pt-pt
preferred label: spil @dk
preferred label: 游戏 @zh-hans
preferred label: spill @no-nb
preferred label: spel @no-nn
definition: Benämning på tidsfördriv, vanligen i tävlingsform, för en eller flera personer, utövade efter vissa regler och vanligen med någon sorts hjälpmedel eller rekvisita. @se
definition: Allgemeiner Wettstreit zur Unterhaltung. @de
definition: Contests generally for one's amusement
definition: Competição, geralmente para divertimento próprio. @pt-pt
definition: spil generelt for ens underholdning, og ofte med et konkurrencemoment. @dk
definition: 为娱乐而进行的竞赛 @zh-hans
in scheme: Media Topic
created: 2009-10-22T02:00:00+00:00
modified: 2021-02-18T12:00:00+00:00
broader: leisure
narrower: board game
narrower: card game
narrower: children's game
narrower: dice game
narrower: outdoor game
narrower: puzzle
narrower: tile game
narrower: video game

gaming and lottery
type: Concept
preferred label: Glücksspiel und Lotterie @de
preferred label: Spel och lotteri @se
preferred label: يانصيب @ar
preferred label: Juegos de azar y loterías @es
preferred label: Jeux de hasard et loteries @fr
preferred label: jogos e lotarias @pt-pt
preferred label: jogos e loterias @pt-br
preferred label: spil og lotteri @dk
preferred label: 游戏和彩票 @zh-hans
preferred label: pengespill og lotteri @no-nb
definition: Gambling, often involving selection of sets of numbers one expects to come up
definition: Spel där deltagarnas vinstmöjligheter helt eller delvis är beroende av slumpen. @se
definition: Spielen um Geld, meist im Zusammenhang mit Zahlen und dem Setzen auf erhoffte Kombinationen @de
definition: Jogos de azar, que envolvem frequentemente a seleção de um conjunto de números que se espera que sejam sorteados. @pt-pt
definition: Spil, hvor deltagernes chancer for at vinde, helt eller delvist beror på tilfældet. @dk
definition: 赌博，通常包括选择多组预期出现的数字 @zh-hans
in scheme: Media Topic
created: 2009-10-22T02:00:00+00:00
modified: 2021-02-18T12:00:00+00:00
broader: leisure

hobby
type: Concept
preferred label: Pasatiempos @es
preferred label: Hobby @se
preferred label: Passe-temps @fr
preferred label: هواية @ar
preferred label: passatempo @pt-pt
preferred label: 爱好 @zh-hans
definition: Aktiv verksamhet som man regelbundet och av renodlat intresse ägnar sig åt på fritiden, ofta med inslag av skapande. @se
definition: Recreational pursuit
definition: Aktivität in der Freizeit @de
definition: Atividades para entretenimento. @pt-pt
definition: Aktiviteter, som man i fritiden engagerer sig i, ofte med elementer af kreativitet. @dk
definition: 具有浓厚兴趣并在业余时间积极参加的活动 @zh-hans
in scheme: Media Topic
created: 2009-10-22T02:00:00+00:00
modified: 2021-02-18T12:00:00+00:00
broader: leisure
narrower: automobile enthusiasm
narrower: bicycle enthusiasm
narrower: food and drink enthusiasm
narrower: motorcycle enthusiasm
narrower: collecting

holiday
type: Concept
preferred label: Semester @se
preferred label: Vacaciones @es
preferred label: Vacances @fr
preferred label: Urlaub @de
preferred label: عطلة @ar
preferred label: férias @pt-pt
preferred label: ferie @dk
preferred label: 假日 @zh-hans
preferred label: fri- og høytidsdager @no-nb
preferred label: vacation
preferred label: fri- og høgtidsdagar @no-nn
definition: Time spent not at work for rest and relaxation
definition: Arbetstagares årliga, av arbetsgivaren betalda, ledighet för rekreation. @se
definition: Arbeitsfreie Zeit zur Erholung und Regeneration @de
definition: Tempo de descanso e relaxamento passado fora do trabalho. @pt-pt
definition: Periode hvor man afholder fri fra skole eller arbejde, ofte betalt af arbejdsgiveren ifølge overenskomst. @dk
definition: 用于休息和放松的非工作时间 @zh-hans
in scheme: Media Topic
created: 2009-10-22T02:00:00+00:00
modified: 2021-02-18T12:00:00+00:00
broader: leisure
narrower: public holiday
narrower: Halloween
broad match: http://cv.iptc.org/newscodes/subjectcode/10005000

leisure venue
type: Concept
preferred label: Lieu de loisirs @fr
preferred label: مكان ترفيه @ar
preferred label: Lugares de ocio @es
preferred label: Veranstaltungsort @de
preferred label: Nöjeslokal @se
preferred label: lugar de lazer @pt-pt
preferred label: underholdningssted @dk
preferred label: 休闲场所 @zh-hans
preferred label: fritidsarena @no-nb
definition: A place where people go to be entertained or amused. For sporting events, use sport venue.
definition: En plats dit folk går för att bli underhållna eller roade. @se
definition: Ort, an dem Menschen sich amüsieren oder unterhalten werden @de
definition: Lugar onde as pessoas vão para entretenimento ou diversão. @pt-pt
definition: Et sted, hvor folk går hen for at underholde sig eller blive underholdt. @dk
definition: 人们去娱乐或消遣的场所，供体育赛事使用的运动场地。 @zh-hans
definition: A place where people go to be entertained or amused
in scheme: Media Topic
created: 2009-10-22T02:00:00+00:00
modified: 2021-05-05T12:00:00+00:00
broader: leisure
narrower: amusement park
narrower: bar
narrower: cafe
narrower: nightclub
narrower: restaurant
narrower: sports facilities
narrower: zoo
narrower: park and playground
broad match: http://cv.iptc.org/newscodes/subjectcode/10000000

outdoor recreational activities
type: Concept
preferred label: Freizeitaktivität @de
preferred label: منشآت ترفيهية @ar
preferred label: Activités récréatives @fr
preferred label: Fritidsaktiviteter @se
preferred label: Actividades recreativas @es
preferred label: atividades recreativas ao ar livre @pt-pt
preferred label: fritidsaktivitet @dk
preferred label: 户外娱乐活动 @zh-hans
preferred label: utendørsaktiviteter @no-nb
preferred label: utandørsaktivitetar @no-nn
definition: Aktivitäten zum Vergnügen, zur Entspannung und Erholung @de
definition: Leisure activities engaged in the outdoors, most commonly in natural settings
definition: Aktiviteter som görs på ledig tid för nöjes skull eller som avslappning. @se
definition: Atividades de lazer ao ar livre, habitualmente em ambientes naturais. @pt-pt
definition: Aktiviteter, der udføres i fritiden til glæde eller afslapning. @dk
definition: 户外的休闲活动，通常在自然环境中进行 @zh-hans
in scheme: Media Topic
created: 2009-10-22T02:00:00+00:00
modified: 2021-02-18T12:00:00+00:00
broader: leisure
narrower: fishing
narrower: hunting
narrower: scuba diving
narrower: recreational hiking and climbing
narrower: horseback riding
broad match: http://cv.iptc.org/newscodes/subjectcode/10000000

travel and tourism
type: Concept
preferred label: Viajes @es
preferred label: Reise @de
preferred label: سفر @ar
preferred label: Voyages @fr
preferred label: Resor @se
preferred label: viagens e turismo @pt-pt
preferred label: rejse @dk
preferred label: 旅行和旅游 @zh-hans
preferred label: reise @no-nb
definition: Spending time away from home in pursuit of recreation, relaxation or pleasure
definition: Resor för nöjes skull, turistresor. @se
definition: Reisen in der Freizeit @de
definition: Viajar para passar um tempo fora de casa em busca de recreação, relaxamento ou prazer. @pt-pt
definition: Rejse i forbindelse med fornøjelse. @dk
definition: 花时间离家去追求娱乐、放松或快乐 @zh-hans
in scheme: Media Topic
created: 2009-10-22T02:00:00+00:00
modified: 2021-02-18T12:00:00+00:00
broader: leisure
narrower: tourism
broad match: http://cv.iptc.org/newscodes/subjectcode/10000000

board game
type: Concept
preferred label: لوح اللعبة @ar
preferred label: Brettspiel @de
preferred label: Juego de mesa @es
preferred label: Brädspel @se
preferred label: Jeu de société @fr
preferred label: jogo de tabuleiro @pt-pt
preferred label: brætspil @dk
preferred label: 棋盘游戏 @zh-hans
preferred label: brettspill @no-nb
preferred label: brettspel @no-nn
definition: Spiel, was auf einem Brett gespielt wird @de
definition: Ett tärningsspel med brickor som ska flyttas runt ett bräde. @se
definition: A game played on a board
definition: Jogo praticado num tabuleiro. @pt-pt
definition: Et spil spillet på et bræt. @dk
definition: 在棋盘上玩的游戏 @zh-hans
in scheme: Media Topic
created: 2009-10-22T02:00:00+00:00
modified: 2021-02-18T12:00:00+00:00
broader: game
broad match: http://cv.iptc.org/newscodes/subjectcode/10001000

card game
type: Concept
preferred label: Jeux de cartes @fr
preferred label: لعبة ورق @ar
preferred label: Kortspel @se
preferred label: Juego de naipes @es
preferred label: Kartenspiel @de
preferred label: jogo de cartas @pt-pt
preferred label: kortspil @dk
preferred label: 纸牌游戏 @zh-hans
preferred label: kortspill @no-nb
preferred label: kortspel @no-nn
definition: Spel i vilket man använder kort. @se
definition: Spiel, was mit Karten gespielt wird @de
definition: A game played with a pack of cards
definition: Jogo praticado com um baralho de cartas. @pt-pt
definition: Spil, hvor man bruger spillekort. @dk
definition: 用纸牌玩的游戏 @zh-hans
in scheme: Media Topic
created: 2009-10-22T02:00:00+00:00
modified: 2021-02-18T12:00:00+00:00
broader: game
broad match: http://cv.iptc.org/newscodes/subjectcode/10001000

children's game
type: Concept
preferred label: لعبة اطفال @ar
preferred label: Barnspel @se
preferred label: Kinderspiel @de
preferred label: Juego de niños @es
preferred label: Jeux pour enfants @fr
preferred label: jogo de crianças @pt-pt
preferred label: børnespil @dk
preferred label: 儿童游戏 @zh-hans
preferred label: barnespill @no-nb
preferred label: barnespel @no-nn
definition: Spel som har utformats för, och oftast spelas av, barn. @se
definition: Spiele, entwickelt für und benutzt von Kindern @de
definition: A game designed for and most often played by children
definition: Jogo geralmente destinado a e maioritariamente praticado por crianças. @pt-pt
definition: Et spil designet til og oftest spillet af børn. @dk
definition: 为儿童设计并主要由儿童参与的游戏 @zh-hans
in scheme: Media Topic
created: 2009-10-22T02:00:00+00:00
modified: 2021-04-09T12:00:00+00:00
broader: game
broad match: http://cv.iptc.org/newscodes/subjectcode/10001000

dice game
type: Concept
preferred label: Würfelspiel @de
preferred label: Jeux de dés @fr
preferred label: Juego de dados @es
preferred label: لعبة زهر @ar
preferred label: Tärningsspel @se
preferred label: jogo de dados @pt-pt
preferred label: terningspil @dk
preferred label: 骰子游戏 @zh-hans
preferred label: terningspill @no-nb
preferred label: terningspel @no-nn
definition: Spel i vilket deltagarna tilldelas poäng i enlighet med utfallet av tärningskast. @se
definition: Spiel, was mit Würfeln gespielt wird @de
definition: A game played using dice only
definition: Jogo praticado só com dados. @pt-pt
definition: Et spil, der kun spilles med terninger. @dk
definition: 只用骰子玩的游戏 @zh-hans
in scheme: Media Topic
created: 2009-10-22T02:00:00+00:00
modified: 2021-02-18T12:00:00+00:00
broader: game
broad match: http://cv.iptc.org/newscodes/subjectcode/10001000

outdoor game
type: Concept
preferred label: Utomhusspel @se
preferred label: لعبة خارجية @ar
preferred label: Jeux de plein air @fr
preferred label: Outdoorspiel @de
preferred label: Juego al aire libre @es
preferred label: jogo de exterior @pt-pt
preferred label: undendørsspil @dk
preferred label: 户外游戏 @zh-hans
preferred label: uteleker @no-nb
preferred label: uteleikar @no-nn
definition: A game played in an open space
definition: Spel som utövas utomhus. @se
definition: Spiel, was draußen gespielt wird @de
definition: Jogo praticado num espaço aberto. @pt-pt
definition: Spil, der udøves udendørs. @dk
definition: 在户外进行的游戏 @zh-hans
in scheme: Media Topic
created: 2009-10-22T02:00:00+00:00
modified: 2021-02-18T12:00:00+00:00
broader: game
broad match: http://cv.iptc.org/newscodes/subjectcode/10001000

puzzle
type: Concept
preferred label: Puzzle @de
preferred label: احجية @ar
preferred label: Kryss och pyssel @se
preferred label: Rompecabezas @es
preferred label: Casse-tête @fr
preferred label: quebra-cabeças @pt-pt
preferred label: quebra-cabeça @pt-br
preferred label: kryds og gåder @dk
preferred label: 猜谜游戏 @zh-hans
preferred label: puslespill @no-nb
preferred label: puslespel @no-nn
definition: A game played solving logic problems for entertainment
definition: Korsord och andra logiska gåtor. @se
definition: Spiel, was logische Fragen und Probleme löst @de
definition: Jogo de entretenimento que consiste na resolução de um problema lógico. @pt-pt
definition: Krydsord og andre logiske gåder. @dk
definition: 为娱乐而进行的解决逻辑问题的游戏 @zh-hans
in scheme: Media Topic
created: 2009-10-22T02:00:00+00:00
modified: 2021-02-18T12:00:00+00:00
broader: game
broad match: http://cv.iptc.org/newscodes/subjectcode/10001000

tile game
type: Concept
preferred label: لعبة @ar
preferred label: Plattenspiel @de
preferred label: Jeu de dominos @fr
preferred label: Juego de fichas @es
preferred label: Brickspel @se
preferred label: jogo de peças @pt-pt
preferred label: brikspil @dk
preferred label: 瓦片游戏 @zh-hans
preferred label: brikkespill @no-nb
preferred label: brikkespel @no-nn
definition: Spiel, das auf/mit Platten gespielt wird @de
definition: A game played using tiles
definition: Spel som spelas med brickor, t ex domino. @se
definition: Jogo praticado com peças. @pt-pt
definition: Spil, der spilles med brikker, såsom domino. @dk
definition: 用瓦片拼接的游戏，又叫拼贴游戏 @zh-hans
in scheme: Media Topic
created: 2009-10-22T02:00:00+00:00
modified: 2021-02-18T12:00:00+00:00
broader: game
broad match: http://cv.iptc.org/newscodes/subjectcode/10001000

video game
type: Concept
preferred label: Datorspel @se
preferred label: Jeux vidéo @fr
preferred label: Videospiel @de
preferred label: Videojuegos @es
preferred label: لعبة فيديو @ar
preferred label: jogo eletrónico @pt-pt
preferred label: jogo eletrônico @pt-br
preferred label: video- og computerspil @dk
preferred label: 视频游戏 @zh-hans
preferred label: videospill @no-nb
preferred label: videospel @no-nn
definition: Benämning på videospel, ett datorspel avsett att kopplas till en tv-apparat, som på sin bildskärm visar spelförloppet. @se
definition: A game played using a video display
definition: Spiel, das einen Videobildschirm nutzt @de
definition: Jogo praticado num ecrã de televisão ou num monitor. @pt-pt
definition: Jogo praticado numa tela de televisão ou num monitor. @pt-br
definition: Digitalt spil, der foregår på en computer, spillekonsol eller mobiltelefon. @dk
definition: 用视频显示器玩的游戏 @zh-hans
in scheme: Media Topic
created: 2009-10-22T02:00:00+00:00
modified: 2021-02-18T12:00:00+00:00
broader: game
broad match: http://cv.iptc.org/newscodes/subjectcode/10001000

automobile enthusiasm
type: Concept
preferred label: شغف بالسيارات @ar
preferred label: Afición por el automóvil @es
preferred label: Bilar @se
preferred label: Amateur d'automobile @fr
preferred label: Auto @de
preferred label: interesse automobilístico @pt-pt
preferred label: entusiasmo automobilístico @pt-br
preferred label: bilentusiasme @dk
preferred label: 汽车爱好 @zh-hans
preferred label: bilinteresse @no-nb
definition: Intresse för nya och gamla bilar. @se
definition: Interest in new and classic cars
definition: Interesse für alte und moderne Autos @de
definition: Interesse por carros novos e clássicos. @pt-pt
definition: Interesse for nye og gamle biler. @dk
definition: 对新车和老爷车的兴趣 @zh-hans
in scheme: Media Topic
created: 2009-10-22T02:00:00+00:00
modified: 2021-02-18T12:00:00+00:00
broader: hobby
broad match: http://cv.iptc.org/newscodes/subjectcode/10000000

bicycle enthusiasm
type: Concept
preferred label: شغف بالدراجات @ar
preferred label: Amateur de vélo @fr
preferred label: Cyklar @se
preferred label: Afición por la bicicleta @es
preferred label: Fahrrad @de
preferred label: interesse por bicicletas @pt-pt
preferred label: cykelentusiasme @dk
preferred label: 自行车爱好 @zh-hans
preferred label: sykkelinteresse @no-nb
definition: Interesse für alte und moderne Fahrräder @de
definition: Interest in new and classic manpowered cycles
definition: Intresse för nya och gamla cyklar. @se
definition: Interesse por bicicletas novas e clássicas. @pt-pt
definition: Interesse for nye og gamle cykler. @dk
definition: 对新型和经典人力自行车的兴趣 @zh-hans
in scheme: Media Topic
created: 2009-10-22T02:00:00+00:00
modified: 2021-02-18T12:00:00+00:00
broader: hobby
broad match: http://cv.iptc.org/newscodes/subjectcode/10000000

food and drink enthusiasm
type: Concept
preferred label: طعام ومشروب @ar
preferred label: Mat och dryck @se
preferred label: Essen und Trinken @de
preferred label: Gastronomie @fr
preferred label: Gastronomía @es
preferred label: interesse gastronómico @pt-pt
preferred label: interesse gastronômico @pt-br
preferred label: interesse for mad @dk
preferred label: 美食爱好 @zh-hans
preferred label: matinteresse @no-nb
definition: Intresse för mat och dryck, matlagning och dryckesframställning. @se
definition: Interest in eating and drinking
definition: Interesse für Essen und Trinken @de
definition: Interesse por comidas e bebidas. @pt-pt
definition: Interesse for mad og drikke. @dk
definition: 对饮食的兴趣 @zh-hans
in scheme: Media Topic
created: 2009-10-22T02:00:00+00:00
modified: 2021-02-18T12:00:00+00:00
broader: hobby
narrower: cooking and baking
narrower: beer, wine and spirits
broad match: http://cv.iptc.org/newscodes/subjectcode/10000000

motorcycle enthusiasm
type: Concept
preferred label: Amateur de moto @fr
preferred label: Afición por la moto @es
preferred label: Motorcyklar @se
preferred label: شغف بالدراجات النارية @ar
preferred label: Motorrad @de
preferred label: interesse por motas @pt-pt
preferred label: motorcykelentusiasme @dk
preferred label: 摩托车爱好 @zh-hans
preferred label: motorsykkelinteresse @no-nb
definition: Intresse för nya och gamla motorfordon med två eller tre hjul. @se
definition: Interesse für alte und moderne Motorräder @de
definition: Interest in new and classic motor-powered cycles
definition: Interesse por motas novas e clássicas. @pt-pt
definition: Interesse for nye og gamle motorkøretøjer med to eller tre hjul. @dk
definition: 对新型和经典摩托车的兴趣 @zh-hans
in scheme: Media Topic
created: 2009-10-22T02:00:00+00:00
modified: 2021-05-05T12:00:00+00:00
broader: hobby
broad match: http://cv.iptc.org/newscodes/subjectcode/10000000

collecting
type: Concept
preferred label: samler @dk
preferred label: samling @no-nb
preferred label: colecionismo @pt-br
preferred label: Samlande @se
preferred label: 收藏 @zh-hans
preferred label: Sammeln @de
preferred label: Collections (loisir) @fr
preferred label: Coleccionismo @es
preferred label: جمع قطع @ar
preferred label: samle @no-nn
definition: En hobby, hvor man finder og køber genstande indenfor en bestemt kategori og måske udstiller, sorterer eller katalogiserer dem. @dk
definition: The hobby of seeking, locating, acquiring, organising, cataloguing, displaying, storing or maintaining items that are of interest to an individual collector
definition: Atividade que consiste em procurar, localizar, adquirir, organizar, catalogar, exibir, armazenar ou manter itens de interesse para um colecionador individual. @pt-br
definition: Hobby där man leta, skaffar, ordnar och kanske visar en stor mängd föremål av en viss sort. @se
definition: 寻找、定位、获取、组织、编目、展示、存储或维护个人收藏家感兴趣的物品的爱好 @zh-hans
definition: Das Hobby des Suchens, Auffindens, Erwerbens, Organisierens, Katalogisierens, Ausstellens, Aufbewahrens oder Pflegens von Gegenständen, die für einen einzelnen Sammler von Interesse sind @de
definition: The hobby of seeking, locating, acquiring, organizing, cataloging, displaying, storing or maintaining items that are of interest to an individual collector
in scheme: Media Topic
created: 2019-07-30T12:00:00+00:00
modified: 2021-07-12T12:00:00+00:00
broader: hobby

public holiday
type: Concept
preferred label: Jour férié @fr
preferred label: Días feriados @es
preferred label: Feiertag @de
preferred label: عطلة عامة @ar
preferred label: Helgdagar @se
preferred label: feriado @pt-pt
preferred label: helligdag @dk
preferred label: 公共假日 @zh-hans
preferred label: offentlig fridag @no-nb
preferred label: offentleg fridag @no-nn
definition: Ein oder mehrere Tage, die für Feierlichkeiten festgesetzt sind. @de
definition: A day of celebration declared by a government
definition: Allmänt arbetsfri dag. @se
definition: Dia de celebração declarado por um governo. @pt-pt
definition: En årlig officiel fridag til festligheder erklæret af myndighederne, ofte i forbindelse med en religiøs højtid. @dk
definition: 官方宣布的庆祝活动休息日 @zh-hans
in scheme: Media Topic
created: 2009-10-22T02:00:00+00:00
modified: 2021-02-18T12:00:00+00:00
broader: holiday
narrower: Midsummer
narrower: National day
narrower: New year

Halloween
type: Concept
preferred label: halloween/allehelgensaften @dk
preferred label: halloween @no-nb
preferred label: Dia das Bruxas @pt-pt
preferred label: 万圣节 @zh-hans
preferred label: هالويين @ar
definition: Foregår 31. oktober og er oprindeligt en dag, hvor man mindes de døde. Efter amerikansk forbillede har fejringen i Danmark udviklet sig til en udklædningsfest, hvor man skræmmer hinanden for sjov, og hvor børnene tigger slik i nabolaget. @dk
definition: A celebration observed in a number of countries on 31 October with activities including trick-or-treating, wearing costumes, carving pumpkins, visiting haunted attractions, telling scary stories and watching horror films
definition: Celebração comemorada em vários países em 31 de outubro, com atividades que incluem pedir doçuras ou travessuras, usar fantasias, esculpir abóboras, visitar atrações assombradas, contar histórias assustadoras e assistir filmes de terror. @pt-br
definition: Celebração comemorada em vários países a 31 de outubro, com atividades que incluem pedir doçuras ou travessuras, usar fantasias, esculpir abóboras, visitar atrações assombradas, contar histórias assustadoras e ver filmes de terror. @pt-pt
definition: Firas i en del länder den 31 oktober och innehåller ofta kostymer, bus-eller-godis, pumpadekorationer och festligheter. @se
definition: 通常在10月31日庆祝的节日，活动包括不给糖就捣乱的游戏、装扮、雕刻南瓜、参观闹鬼的景点、讲恐怖故事和观看恐怖电影等 @zh-hans
definition: Eine Feier, die in einer Reihe von Ländern am 31. Oktober mit Aktivitäten wie *Süßes oder Saures*, dem Tragen von Kostümen, dem Schnitzen von Kürbissen, dem Besuch von Spukattraktionen, dem Erzählen von Gruselgeschichten und dem Anschauen von Horrorfilmen gefeiert wird @de
in scheme: Media Topic
created: 2019-09-05T12:00:00+00:00
modified: 2021-07-12T12:00:00+00:00
broader: holiday

Midsummer
type: Concept
preferred label: midsommer/sankthansfest @dk
preferred label: sankthans @no-nb
preferred label: festa de solstício de verão @pt-pt
preferred label: Midsommar @se
preferred label: 仲夏节 @zh-hans
preferred label: Sommersondenwende @de
preferred label: احتفالات منتصف الصيف @ar
preferred label: jonsok @no-nn
definition: Særlig nordisk tradition, hvor man fejrer sommersolhvervet. @dk
definition: Northern European celebrations that accompany the Summer solstice
definition: Celebrações do norte da Europa que acompanham o solstício de verão. @pt-br
definition: Tradition att fira sommarsolståndet. @se
definition: 北欧居民庆祝夏至来临的节日 @zh-hans
definition: Nordeuropäische Feierlichkeiten, die die Sommersonnenwende begleiten @de
in scheme: Media Topic
created: 2019-09-05T12:00:00+00:00
modified: 2021-07-12T12:00:00+00:00
broader: public holiday

National day
type: Concept
preferred label: nationaldag @dk
preferred label: nasjonaldag @no-nb
preferred label: feriado nacional @pt-br
preferred label: Nationaldag @se
preferred label: 国庆节 @zh-hans
preferred label: Nationalfeiertag @de
preferred label: Fête nationale @fr
preferred label: Día nacional @es
preferred label: العيد الوطني @ar
definition: En dato, hvor en nation fejrer sig selv. I Danmark sker det grundlovsdag (5. juni). @dk
definition: A designated day to celebrate a nation
definition: Dia determinado para celebrar uma nação. @pt-pt
definition: En dag för att fira en viss nation. @se
definition: 庆祝一个国家建国的指定日子 @zh-hans
definition: Ein festgelegter Tag zur Feier einer Nation @de
in scheme: Media Topic
created: 2019-09-05T12:00:00+00:00
modified: 2021-07-12T12:00:00+00:00
broader: public holiday

New year
type: Concept
preferred label: nytår @dk
preferred label: nyttår @no-nb
preferred label: Dia de Ano Novo @pt-br
preferred label: Nyår @se
preferred label: 新年 @zh-hans
preferred label: Neujahr @de
preferred label: Nouvel an @fr
preferred label: Año Nuevo @es
preferred label: رأس السنة @ar
definition: Fejringen af, at et kalenderår afsluttes og et nyt begynder. Afhængig af kultur og tidsregning. @dk
definition: The celebration of the end of one calendar year and the start of next
definition: Celebração do fim de um ano civil e do início do próximo. @pt-br
definition: Högtid för att fira ut det gamla året och välkomna det nya. @se
definition: 庆祝一年完结新一年开始 @zh-hans
definition: Die Feier des Endes eines Kalenderjahres und des Beginns des nächsten @de
in scheme: Media Topic
created: 2019-09-05T12:00:00+00:00
modified: 2021-07-12T12:00:00+00:00
broader: public holiday

amusement park
type: Concept
preferred label: Parque de atracciones @es
preferred label: Nöjesfält @se
preferred label: Vergnügungspark @de
preferred label: Parc d'attractions @fr
preferred label: منتزه تسلية @ar
preferred label: parque de diversões @pt-pt
preferred label: forlystelsespark @dk
preferred label: 游乐园 @zh-hans
preferred label: fornøyelsespark @no-nb
preferred label: underhaldningspark @no-nn
definition: Stationär eller ambulerande nöjespark med bland annat karuseller och andra åkattraktioner. @se
definition: Park, in dem verschiedene Fahrten und Unterhaltungsattraktionen für Kinder und Erwachsene angeboten werden, inklusive Themenparks @de
definition: A park providing various rides and entertainment attractions for both adults and children, including theme parks
definition: Parque que oferece várias atrações de entretenimento para adultos e crianças, incluindo parques temáticos. @pt-pt
definition: En park med forskellige forlystelser og underholdningsattraktioner for både voksne og børn, herunder forlystelsesparker. @dk
definition: 为成人和儿童提供各种游乐设施和娱乐景点的公园，包括主题公园 @zh-hans
in scheme: Media Topic
created: 2009-10-22T02:00:00+00:00
modified: 2021-02-18T12:00:00+00:00
broader: leisure venue
broad match: http://cv.iptc.org/newscodes/subjectcode/10000000

bar
type: Concept
preferred label: حانة @ar
preferred label: Bar @de
preferred label: 酒吧 @zh-hans
definition: Lokal för öl-, vin- och spritservering vid disk ofta i anslutning till restaurang. @se
definition: A business where drinks are prepared and served to the public for consumption on the premises
definition: Geschäft mit der Zubereitung und dem Verzehr von Getränken zum öffentlichen Konsum auf einem bestimmten Gelände @de
definition: Estabelecimento comercial onde são preparadas e servidas ao público bebidas para consumo no local. @pt-pt
definition: Et serveringssted, hvor drinks eller lette måltider tilberedes og serveres til offentligheden til indtagelse i lokalerne. @dk
definition: 在营业场所为公众准备和提供饮料供消费的企业 @zh-hans
in scheme: Media Topic
created: 2009-10-22T02:00:00+00:00
modified: 2021-02-18T12:00:00+00:00
broader: leisure venue
broad match: http://cv.iptc.org/newscodes/subjectcode/10000000

cafe
type: Concept
preferred label: Kafé @se
preferred label: Café @de
preferred label: مقهى @ar
preferred label: café @pt-pt
preferred label: 咖啡厅 @zh-hans
preferred label: kafé @no-nb
definition: A small business where drinks and snacks are prepared and served - its specifics may depend on the local culture
definition: Geschäft mit der Zubereitung und Bereitstellung von Getränken und kleinen Snacks, spezielle Details in verschiedenen Kulturen @de
definition: Lokal där det framför allt serveras kaffe, te och läskedrycker samt bakverk och smörgåsar. @se
definition: Pequeno estabelecimento onde são preparadas e servidas ao público bebidas e refeições ligeiras – a sua especificidade pode depender da cultura local. @pt-pt
definition: Lokale, hvor der serveres kaffe, te og læskedrikke samt morgenmad, kager og sandwich. @dk
definition: 提供饮料和小吃的小型企业——具体情况可能取决于当地文化 @zh-hans
in scheme: Media Topic
created: 2009-10-22T02:00:00+00:00
modified: 2021-02-18T12:00:00+00:00
broader: leisure venue
broad match: http://cv.iptc.org/newscodes/subjectcode/10000000

nightclub
type: Concept
preferred label: Nattklubb @se
preferred label: مرقص @ar
preferred label: Clubes nocturnos @es
preferred label: Discothèque @fr
preferred label: Nachtclub @de
preferred label: clube noturno @pt-pt
preferred label: casa noturna @pt-br
preferred label: natklub @dk
preferred label: 夜总会 @zh-hans
preferred label: nattklubb @no-nb
definition: Kommerzielle Einrichtung für ausgewähltes Klientel, die Musik oder andere Unterhaltung anbietet, begleitet mit Essen und Trinken @de
definition: A commercial establishment providing music, or other entertainment along with food and drink to selected clientele
definition: Lokal med musik och dans, ibland med artistuppträdanden, som har öppet på natten efter vanliga restaurangers stängningstid. @se
definition: Estabelecimento comercial que fornece música e outras formas de entretenimento, assim como comida e bebida, a uma clientela seleta. @pt-pt
definition: Bar eller restaurant der holder åbent om natten, og hvor underholdning kan forekomme i form af dans eller musik. @dk
definition: 为特定的顾客提供音乐或其他娱乐以及食物和饮料的商业机构 @zh-hans
in scheme: Media Topic
created: 2009-10-22T02:00:00+00:00
modified: 2021-02-18T12:00:00+00:00
broader: leisure venue

restaurant
type: Concept
preferred label: Restaurant @fr
preferred label: Restaurang @se
preferred label: Restaurante @es
preferred label: مطعم @ar
preferred label: restaurante @pt-pt
preferred label: 餐厅 @zh-hans
definition: Geschäft mit der Zubereitung und dem Verzehr von Mahlzeiten für die Öffentlichkeit @de
definition: Offentlig lokal för servering av måltid mot betalning. @se
definition: A business where meals are prepared and served to the public
definition: Estabelecimento onde são preparadas e servidas ao público refeições. @pt-pt
definition: En forretning, hvor måltiderne tilberedes og serveres for offentligheden mod betaling. @dk
definition: 为公众准备和提供膳食的企业 @zh-hans
in scheme: Media Topic
created: 2009-10-22T02:00:00+00:00
modified: 2021-02-18T12:00:00+00:00
broader: leisure venue
broad match: http://cv.iptc.org/newscodes/subjectcode/10000000

sports facilities
type: Concept
preferred label: Instalaciones deportivas @es
preferred label: Sportanlagen @de
preferred label: Sportanläggningar @se
preferred label: منشأت رياضية @ar
preferred label: Complexe sportif @fr
preferred label: instalações desportivas @pt-pt
preferred label: instalações esportivas @pt-br
preferred label: sportsfacilitet @dk
preferred label: 体育设施 @zh-hans
preferred label: idrettsanlegg @no-nb
definition: Gymnasien, Stadien oder Arenen wo Sportereignisse stattfinden @de
definition: Byggnader där sportevenemang äger rum. @se
definition: Gymnasiums, stadiums or arenas where sports events take place
definition: Pavilhões, estádios ou recintos onde têm lugar eventos desportivos. @pt-pt
definition: Pavilhões, estádios ou recintos onde têm lugar eventos esportivos. @pt-br
definition: Bygninger og anlæg, hvor sportsbegivenheder finder sted. @dk
definition: 体育馆、体育场或体育赛事的竞技场 @zh-hans
in scheme: Media Topic
created: 2009-10-22T02:00:00+00:00
retired: 2021-02-18T12:00:00+00:00
modified: 2021-02-18T12:00:00+00:00
broader: leisure venue
broad match: http://cv.iptc.org/newscodes/subjectcode/10000000

zoo
type: Concept
preferred label: dyrehage @no-nb
preferred label: Djurpark @se
preferred label: zoologisk have @dk
preferred label: jardim zoológico @pt-pt
preferred label: 动物园 @zh-hans
preferred label: Zoo @de
preferred label: Parc zoologique @fr
preferred label: Parque zoológico @es
preferred label: حديقة حيوان @ar
definition: A park where visitors can see both wild and tame animals that are kept in cages or enclosed areas
definition: En anläggning där människor kan se vilda och/eller tama djur i fångenskap. @se
definition: En park, hvor de besøgende kan se både vilde og tamme dyr, der lever i bure eller indhegninger. @dk
definition: Parque onde os visitantes podem ver animais selvagens e domesticados que se encontram em jaulas ou em áreas fechadas. @pt-pt
definition: 游客可以观看关在笼子或封闭区域的野生和驯服动物的园区 @zh-hans
definition: Ein Park, in dem Besucher sowohl wilde als auch zahme Tiere sehen können, die in Käfigen oder geschlossenen Bereichen gehalten werden @de
in scheme: Media Topic
created: 2021-02-18T12:00:00+00:00
modified: 2021-07-12T12:00:00+00:00
broader: leisure venue

park and playground
type: Concept
definition: A public green area in a town or city used for recreation
in scheme: Media Topic
created: 2025-06-30T12:00:00+00:00
modified: 2025-06-30T12:00:00+00:00
broader: leisure venue

fishing
type: Concept
preferred label: Pêche @fr
preferred label: صيد سمك @ar
preferred label: Angeln @de
preferred label: Pesca @es
preferred label: Fiske @se
preferred label: pesca @pt-pt
preferred label: lystfiskeri @dk
preferred label: 钓鱼 @zh-hans
preferred label: fiske @no-nb
definition: En fritidsaktivitet där man med hjälp av beten, vapen och fällor försöker fånga vattenlevande djur. @se
definition: Eine Aktivität, die Köder, Waffen und Netze benutzt um Wassertiere zu fangen. @de
definition: A recreational activity involving the use of baits, lures, weapons and traps for the capture of aquatic species.
definition: Atividade que envolve o uso de isco, chamariz, armas ou armadilhas na captura de espécies aquáticas. @pt-pt
definition: Atividade que envolve o uso de isca, chamariz, armas ou armadilhas na captura de espécies aquáticas. @pt-br
definition: En rekreativ aktivitet, hvor man forsøger at fange fisk ved hjælp af agn, våben og fælder. @dk
definition: 一种娱乐活动，包括使用诱饵、诱饵、武器和陷阱捕获水生物种 @zh-hans
in scheme: Media Topic
created: 2009-10-22T02:00:00+00:00
modified: 2021-02-18T12:00:00+00:00
broader: outdoor recreational activities

hunting
type: Concept
preferred label: Chasse @fr
preferred label: صيد @ar
preferred label: Jakt @se
preferred label: Caza @es
preferred label: Jagd @de
preferred label: caça @pt-pt
preferred label: jagt @dk
preferred label: 打猎 @zh-hans
preferred label: jakt @no-nb
definition: Försök till fångande eller dödande av vilt genom uppspårning, förföljande eller dylikt. @se
definition: Eine Aktivität, bei der Waffen oder Fallen benutzt werden, um Tiere zu fangen. @de
definition: An activity involving the use of weapons or traps for the capturing of animals
definition: Atividade que envolve o uso de armas ou de armadilhas na captura de animais. @pt-pt
definition: En aktivitet, der involverer brug af våben eller fælder til fangst af dyr. @dk
definition: 用武器或陷阱捕捉动物的活动 @zh-hans
in scheme: Media Topic
created: 2009-10-22T02:00:00+00:00
modified: 2021-02-18T12:00:00+00:00
broader: outdoor recreational activities

scuba diving
type: Concept
preferred label: Plongée sous-marine @fr
preferred label: سكوبا @ar
preferred label: Buceo @es
preferred label: Dyksport @se
preferred label: Sporttauchen @de
preferred label: mergulho @pt-pt
preferred label: flaskedykning @dk
preferred label: 水肺潜水 @zh-hans
preferred label: apparatdykking @no-nb
definition: Underwater diving with the use of a self-contained underwater breathing apparatus
definition: Samlingsbegrepp för olika grenar med dykning under vatten. @se
definition: Tauchen in unterschiedlichen Tiefen unter Zeitmessung @de
definition: Mergulho subaquático com o uso de um aparelho respiratório subaquático independente. @pt-pt
definition: Dykning i forskellige dybder med tidsmåling. @dk
definition: 使用自给式水下呼吸器进行水下潜水 @zh-hans
definition: Dykking med pusteutstyr ein ber på kroppen. @no-nn
definition: Dykking med pusteutstyr man bærer på kroppen. @no-nb
in scheme: Media Topic
created: 2009-10-22T02:00:00+00:00
modified: 2021-02-18T12:00:00+00:00
broader: outdoor recreational activities

recreational hiking and climbing
type: Concept
preferred label: Klättring och vandring @se
preferred label: Alpinismus @de
preferred label: montanhismo @pt-pt
preferred label: bjergklatring og -vandring @dk
preferred label: 登山 @zh-hans
preferred label: fjelltur og klatring @no-nb
preferred label: Alpinisme (loisir) @fr
preferred label: Montañismo recreativo @es
preferred label: تسلق جبال @ar
definition: Sportsliga aktiviteter i bergen. @se
definition: Sportive activities in the mountains including climbing and hiking
definition: Sportliche Aktivität in den Bergen, schließt das Klettern und Wandern ein @de
definition: Atividades desportivas em montanhas, incluindo escalada e caminhada. @pt-pt
definition: Atividades esportivas em montanhas, incluindo escalada e caminhada. @pt-br
definition: Sportsaktiviteter i bjergene. @dk
definition: 在山区进行的体育活动，包括登山和徒步旅行 @zh-hans
in scheme: Media Topic
created: 2012-10-04T12:00:00+00:00
modified: 2023-10-02T12:00:00+00:00
broader: outdoor recreational activities

horseback riding
type: Concept
preferred label: Ridning @se
preferred label: equitação @pt-pt
preferred label: hesteridning @dk
preferred label: 骑马 @zh-hans
preferred label: ridning @no-nb
preferred label: Reiten @de
preferred label: Équitation (loisir) @fr
preferred label: Equitación (ocio) @es
preferred label: ركوب الخيل @ar
preferred label: riding @no-nn
definition: The riding of horses for leisure or light exercise.
definition: Fritidsaktivitet där personen sitter på en häst. Inomhus eller utomhus. @se
definition: Andar a cavalo para lazer ou para exercícios leves. @pt-pt
definition: Ridning for fornøjelsens skyld. @dk
definition: 为休闲或轻度运动而骑马 @zh-hans
definition: Das Reiten von Pferden zur Freizeitgestaltung oder zur leichten Bewegung. @de
in scheme: Media Topic
created: 2019-06-26T12:00:00+00:00
modified: 2021-07-12T12:00:00+00:00
broader: outdoor recreational activities

tourism
type: Concept
preferred label: سياحة @ar
preferred label: Tourisme @fr
preferred label: Tourismus @de
preferred label: Turism @se
preferred label: Turismo @es
preferred label: turismo @pt-pt
preferred label: turisme @dk
preferred label: 旅游 @zh-hans
definition: Människors aktiviteter när de reser till och vistas på platser utanför den vanliga omgivningen, ibland som en del av en grupp. @se
definition: Reisen, um eine Reihe von Orten und Ländern zu besuchen über einen längeren Zeitraum, meist in einer Gruppe @de
definition: Leisure travel involving visits to a number of locations and/or countries over an extended period of time, often as part of an organised group
definition: Viagens de lazer que envolvem visitas a vários locais e/ou países durante um período prolongado, frequentemente em grupos organizados. @pt-pt
definition: Fritidsrejser, der involverer besøg på en række lokationer og/eller lande over en længere periode, ofte som en del af en organiseret gruppe. @dk
definition: 休闲旅行，通常作为一个有组织的团体的一部分，包括在较长时间内到多个地点和/或国家旅游的休闲活动 @zh-hans
definition: Leisure travel involving visits to a number of locations and/or countries over an extended period of time, often as part of an organized group
in scheme: Media Topic
created: 2009-10-22T02:00:00+00:00
retired: 2019-07-22T12:00:00+00:00
modified: 2021-02-18T12:00:00+00:00
broader: travel and tourism

organic food
type: Concept
preferred label: غذاء عضوي @ar
preferred label: Biologische Nahrungsmittel @de
preferred label: Alimentos orgánicos @es
preferred label: Ekologisk mat @se
preferred label: Aliments biologiques @fr
preferred label: alimentos biológicos @pt-pt
preferred label: økologisk fødevare @dk
preferred label: 有机食物 @zh-hans
preferred label: økologisk mat @no-nb
definition: Nahrungsmittel, die erzeugt wurden, ohne künstlichen Dünger oder chemische Zusätze @de
definition: Mat som är framodlad utan konstgödsel eller kemiska föreningar. @se
definition: Food which is grown using no artificial fertilisers or chemical compounds
definition: Alimentos produzidos sem uso de fertilizantes artificiais ou compostos químicos. @pt-pt
definition: Mad der dyrkes uden kunstgødning eller kemiske forbindelser. @dk
definition: 不使用人工合成肥料或化合物种植的食物 @zh-hans
definition: Food which is grown using no artificial fertilizers or chemical compounds
in scheme: Media Topic
created: 2009-10-22T02:00:00+00:00
modified: 2021-02-18T12:00:00+00:00
broader: lifestyle

house and home
type: Concept
preferred label: Casa y hogar @es
preferred label: Hem och trädgård @se
preferred label: Wohnungseinrichtung @de
preferred label: بيت ومسكن @ar
preferred label: Maison et décoration @fr
preferred label: casa e decoração @pt-pt
preferred label: hus og hjem @dk
preferred label: 房屋和住所 @zh-hans
preferred label: hus og heim @no-nn
definition: Interest in maintaining and decorating one's home
definition: Intresse för hus och lägenheter, deras möblering, inredning med mera. @se
definition: Interesse für Häuser, Apartments und ihre Einrichtungen, inklusive Möbel @de
definition: Interesse por cuidar e por decorar a casa. @pt-pt
definition: Interesse for hus og hjem, herunder indretning og have. @dk
definition: 对房子，公寓和他们的装饰，包括家具的爱好 @zh-hans
in scheme: Media Topic
created: 2009-10-22T02:00:00+00:00
modified: 2021-02-18T12:00:00+00:00
broader: lifestyle
narrower: home renovation
narrower: interior decoration
narrower: gardening
broad match: http://cv.iptc.org/newscodes/subjectcode/10000000

trend
type: Concept
preferred label: Trend @de
preferred label: Tendencia @es
preferred label: Trender @se
preferred label: Tendance @fr
preferred label: تقليعة @ar
preferred label: tendências @pt-pt
preferred label: trends @dk
preferred label: 时尚潮流 @zh-hans
preferred label: trender @no-nb
preferred label: trendar @no-nn
definition: Interesse für die Entwicklung von Stil, Mode und Design @de
definition: Interest in what is considered hip or popular at a certain point in time
definition: Intresse för utvecklingen av stil, mode och design. @se
definition: Interesse pelo que se considera popular ou na moda em determinado momento. @pt-pt
definition: Interesse for udvikling af stil, mode og design. @dk
definition: 对时尚潮流的爱好 @zh-hans
in scheme: Media Topic
created: 2009-10-22T02:00:00+00:00
modified: 2021-02-18T12:00:00+00:00
broader: lifestyle
narrower: body modification
broad match: http://cv.iptc.org/newscodes/subjectcode/10000000

party
type: Concept
preferred label: Fester @se
preferred label: Party @de
preferred label: festa @pt-pt
preferred label: fest @dk
preferred label: 派对 @zh-hans
preferred label: Soirée (fête) @fr
preferred label: Fiesta @es
preferred label: حفلة @ar
definition: A social gathering of invited guests, often involving eating, drinking, dancing or the playing of games
definition: Soziales Ereignis mit Tanz @de
definition: Sammankomst med riklig förtäring av god mat och dryck, för deltagarnas nöje, ibland med dans. @se
definition: Evento social que reúne pessoas convidadas, geralmente com comida, bebida, dança ou jogos. @pt-pt
definition: Social begivenhed med dans. @dk
definition: 邀请客人参加的社交聚会，通常包括吃饭、喝酒、跳舞或玩游戏 @zh-hans
in scheme: Media Topic
created: 2012-10-04T12:00:00+00:00
modified: 2021-07-12T12:00:00+00:00
broader: lifestyle

vegetarianism and veganism
type: Concept
definition: The avoidance of meat and other animal products for moral, dietary or religious reasons and the plant-based products that adhere to this principle
in scheme: Media Topic
created: 2025-06-30T12:00:00+00:00
modified: 2025-06-30T12:00:00+00:00
broader: lifestyle

cooking and baking
type: Concept
preferred label: madlavning og bagning @dk
preferred label: matlaging @no-nb
preferred label: cozinhar @pt-pt
preferred label: Matlagning och bakning @se
preferred label: 烹饪和烘焙 @zh-hans
preferred label: Kochen und Backen @de
preferred label: Cuisine (loisir) @fr
preferred label: Cocina (ocio) @es
preferred label: طهو @ar
definition: Interesse for at tilberede mad eller bagværk. @dk
definition: Interest in preparing meals or baked goods
definition: Interesse por preparar refeições ou cozinhados. @pt-br
definition: Intresse i metoder och recept för att laga mat och baka. @se
definition: 准备饭菜或烘焙食品的兴趣 @zh-hans
definition: Interesse an der Zubereitung von Mahlzeiten oder Backwaren @de
in scheme: Media Topic
created: 2019-07-30T12:00:00+00:00
modified: 2021-07-12T12:00:00+00:00
broader: food and drink enthusiasm

beer, wine and spirits
type: Concept
preferred label: øl, vin og spiritus @dk
preferred label: øl, vin og brennevin @no-nb
preferred label: cerveja, vinho e bebidas espirituosas @pt-pt
preferred label: Öl, vin och sprit @se
preferred label: 啤酒、葡萄酒和烈酒 @zh-hans
preferred label: Bier, Wein und Spirituosen @de
preferred label: Bières, vins et spiritueux (centre d'intérêt) @fr
preferred label: Cerveza, vino y licores (ocio) @es
preferred label: جعة، نبيذ ومشروبات روحية @ar
definition: Interesse i produktionen eller nydelsen af alkoholiske drikke. @dk
definition: Interest in the consumption, production and collection of alcoholic beverages
definition: Interesse pelo consumo, pela produção e pela coleção de bebidas alcoólicas. @pt-br
definition: Intresse i produktion, avsmakning och samlande av olika alkoholhaltiga drycker. @se
definition: 对酒精饮料的消费、生产和收集的兴趣 @zh-hans
definition: Interesse am Konsum, der Herstellung und dem Sammeln von alkoholischen Getränken @de
in scheme: Media Topic
created: 2019-07-30T12:00:00+00:00
modified: 2021-07-12T12:00:00+00:00
broader: food and drink enthusiasm

home renovation
type: Concept
preferred label: gør-det-selv @dk
preferred label: oppussing @no-nb
preferred label: reforma de casas @pt-br
preferred label: renovação de casas @pt-pt
preferred label: Gör det själv @se
preferred label: 家居装修 @zh-hans
preferred label: Hausrenovierung @de
preferred label: Travaux de rénovation @fr
preferred label: Renovación del hogar @es
preferred label: ترميم منازل @ar
definition: Interesse i at istandsætte fast ejendom. @dk
definition: Interest in renovating one's property
definition: Interesse por renovar casas. @pt-pt
definition: Interesse por reformar casas. @pt-br
definition: Intresse i att renovera och bygga om ens eget hem. @se
definition: 翻新自己财产的爱好 @zh-hans
definition: Interesse an der Renovierung der eigenen Immobilie @de
in scheme: Media Topic
created: 2019-07-30T12:00:00+00:00
modified: 2021-07-12T12:00:00+00:00
broader: house and home

interior decoration
type: Concept
preferred label: boligindretning @dk
preferred label: interiørdesign @no-nb
preferred label: decoração de interiores @pt-br
preferred label: Inredningsdesign @se
preferred label: 室内装饰 @zh-hans
preferred label: Inneneinrichtung @de
preferred label: Décoration intérieure @fr
preferred label: Decoración de interiores @es
preferred label: هندسة داخلية @ar
definition: Interesse i at indrette en bolig. @dk
definition: Interest in decorating one's home
definition: Interesse pela decoração de um espaço interior. @pt-pt
definition: Intresse i att dekorera ens eget hem. @se
definition: 装饰家居的爱好 @zh-hans
definition: Interesse am Dekorieren des eigenen Heims @de
in scheme: Media Topic
created: 2019-07-30T12:00:00+00:00
modified: 2021-07-12T12:00:00+00:00
broader: house and home

gardening
type: Concept
preferred label: havearbejde @dk
preferred label: jardinagem @pt-pt
preferred label: hagearbeid @no-nb
preferred label: Trädgårdsdesign @se
preferred label: 园艺 @zh-hans
preferred label: Gärtnern @de
preferred label: Jardinage @fr
preferred label: Jardinería @es
preferred label: تنظيم الحدائق @ar
definition: Interesse i at beplante og ordne en have. @dk
definition: Interest in working in one's garden
definition: Interesse por trabalhar no jardim. @pt-pt
definition: Intresse i att designa, anlägga och sköta sin egen trädgård. @se
definition: 对在花园里工作的爱好 @zh-hans
definition: Interesse an der Arbeit im eigenen Garten @de
in scheme: Media Topic
created: 2019-07-30T12:00:00+00:00
modified: 2021-07-12T12:00:00+00:00
broader: house and home

body modification
type: Concept
preferred label: kropsmodifikation @dk
preferred label: kroppsmodifikasjon @no-nb
preferred label: modificação corporal @pt-br
preferred label: Kroppsdekoration @se
preferred label: 身体修饰 @zh-hans
preferred label: Körpermodifikation @de
preferred label: Modification corporelle @fr
preferred label: Modificación corporal @es
preferred label: تعديل ملامح الجسم @ar
definition: Kropsudsmykning, der ændrer kroppens udseende. Det kan være i form af piercing eller tatovering. @dk
definition: Actions taken to permanently or semi-permanently change body appearance, such as piercing and tattooing
definition: Ações realizadas para alterar de modo permanente ou semipermanente a aparência do corpo, como piercings e tatuagens. @pt-br
definition: Intresse i att smycka den egna kroppen, exempelvis med taturering eller piercing. @se
definition: 为永久或半永久改变身体外观而采取的行动，如穿孔和纹身 @zh-hans
definition: Maßnahmen, die ergriffen werden, um das Aussehen des Körpers dauerhaft oder semi-permanent zu verändern, wie Piercing und Tätowierung @de
in scheme: Media Topic
created: 2019-07-30T12:00:00+00:00
modified: 2021-07-12T12:00:00+00:00
broader: trend
narrower: tattooing
narrower: piercing

citizens' initiative and recall
type: Concept
preferred label: Initative populaire @fr
preferred label: مبادرات المواطنين @ar
preferred label: Iniciativa y revocación ciudadanas @es
preferred label: Medborgarinitiativ @se
preferred label: Bürgerinitiative @de
preferred label: iniciativa dos cidadãos e revocação @pt-pt
preferred label: borgerforslag @dk
preferred label: 公民倡议和罢免 @zh-hans
preferred label: innbyggerinitiativ @no-nb
preferred label: innbyggjarinitiativ @no-nn
definition: Political suggestions by non-government officials for corrective action, or for changes in existing rules and regulations
definition: Politische Überzeugungen von Nicht-Regierungsangehörigen für Korrekturen oder Veränderungen in Bezug auf schon existente Regeln und Vorschriften. @de
definition: Politiska förslag från icke-statliga organisationer eller privatpersoner för korrigerande åtgärder eller på förändringar av lagar och regler. @se
definition: Sugestões políticas de membros ou organismos não governamentais para corrigir uma ação ou para fazer mudanças nas regras e regulações existentes. @pt-pt
definition: Politiske forslag fra ngo'er eller enkeltpersoner til korrigerende handlinger eller ændringer i love og regler. @dk
definition: 非政府官员对纠正措施或现有规章制度的变更提出的政治建议 @zh-hans
in scheme: Media Topic
created: 2009-10-22T02:00:00+00:00
modified: 2021-05-12T12:00:00+00:00
broader: election

voting system
type: Concept
preferred label: Wahlsystem @de
preferred label: Valsystem @se
preferred label: Système électoral @fr
preferred label: Sistema electoral @es
preferred label: نظام انتخابي @ar
preferred label: sistema eleitoral @pt-pt
preferred label: valgsystem @dk
preferred label: 选举制度 @zh-hans
preferred label: valgordning @no-nb
preferred label: electoral system
preferred label: valordning @no-nn
definition: Övergripande utformning av ett lands representationssystem på nationell och subnationell nivå. @se
definition: Verfahren, mit denen gewählt wird @de
definition: The set of rules that determine how elections are conducted and how their results are determined, including discussions of the electoral college, ranked choice voting or the allocation of governmental seats
definition: Sistemas de votação. @pt-pt
definition: Regler for hvordan et valg skal afvikles, og hvordan stemmerne omsættes i mandater inden for et bestemt politisk system. @dk
definition: 投票制度 @zh-hans
in scheme: Media Topic
created: 2009-10-22T02:00:00+00:00
modified: 2024-09-26T12:00:00+00:00
broader: election
broad match: http://cv.iptc.org/newscodes/subjectcode/11000000

intergovernmental elections
type: Concept
preferred label: Élections intergouvernementales @fr
preferred label: Mellanstatliga val @se
preferred label: انتخابات حكومية @ar
preferred label: staatsübergreifende Wahl @de
preferred label: Elecciones intergubernamentales @es
preferred label: eleições intergovernamentais @pt-pt
preferred label: mellemstatsligt valg @dk
preferred label: 政府选举 @zh-hans
preferred label: mellomstatlige valg @no-nb
preferred label: mellomstatlege val @no-nn
definition: Choosing individuals for the leadership of an international organisation, such as the United Nations, European Union, NATO and World Bank
definition: Att välja representanter till ett mellanstatligt styre, t ex Europaparlamentet. @se
definition: Auswahl einzelner Regierungsvertreter für eine staatsübergreifende Organisation @de
definition: Escolha de indivíduos para a chefia de uma organização internacional, como Nações Unidas, União Europeia, NATO ou Banco Mundial. @pt-pt
definition: Escolha de indivíduos para a chefia de uma organização internacional, como Nações Unidas, União Europeia, OTAN ou Banco Mundial. @pt-br
definition: At vælge repræsentanter til en mellemstatslig regering, f.eks. Europa-Parlamentet. @dk
definition: 为政府机构选拔工作人员 @zh-hans
definition: Choosing individuals for the leadership of an international organization, such as the United Nations, European Union, NATO and World Bank
in scheme: Media Topic
created: 2009-10-22T02:00:00+00:00
modified: 2021-07-12T12:00:00+00:00
broader: election
broad match: http://cv.iptc.org/newscodes/subjectcode/11000000

local elections
type: Concept
preferred label: انتخابات محلية @ar
preferred label: Elecciones locales @es
preferred label: Kommunalwahl @de
preferred label: Lokalval @se
preferred label: Élections locales @fr
preferred label: eleições locais @pt-pt
preferred label: lokalvalg @dk
preferred label: 地方选举 @zh-hans
preferred label: lokalval @no-nn
definition: Wahl einzelner Regierungsvertreter auf der unteren Ebene, wie Stadt, Kreis oder Bezirk @de
definition: Att välja representanter till ett lokalt styre, t ex en kommun. @se
definition: Choosing individuals for government at the city, village or county level
definition: Escolha de pessoas para o governo a nível básico, seja cidade, vila ou município. @pt-pt
definition: Valg af repræsentanter for en lokal regering, f.eks. en kommune. @dk
definition: 为市、村、县基层政府选拔工作人员 @zh-hans
in scheme: Media Topic
created: 2009-10-22T02:00:00+00:00
modified: 2021-07-12T12:00:00+00:00
broader: election

national elections
type: Concept
preferred label: انتخابات وطنية @ar
preferred label: Elecciones nacionales @es
preferred label: Bundestagswahl @de
preferred label: Élections nationales @fr
preferred label: Nationella val @se
preferred label: eleições nacionais @pt-pt
preferred label: nationalt valg @dk
preferred label: 全国选举 @zh-hans
preferred label: nasjonalvalg @no-nb
preferred label: nasjonalval @no-nn
definition: Choosing individuals for government at a national level
definition: Wahl einzelner Regierungsvertreter auf nationaler Ebene @de
definition: Att välja representanter till ett nationellt styre, t ex riksdagen. @se
definition: Escolha de pessoas para o governo a nível nacional. @pt-pt
definition: At vælge repræsentanter til et nationalt parlament, f.eks. Folketinget. @dk
definition: 为国家一级的政府选拔工作人员 @zh-hans
in scheme: Media Topic
created: 2009-10-22T02:00:00+00:00
modified: 2021-07-12T12:00:00+00:00
broader: election

political campaigns
type: Concept
preferred label: Campagne électorale @fr
preferred label: حملات سياسية @ar
preferred label: Wahlkampf @de
preferred label: Campañas políticas @es
preferred label: Politiska kampanjer @se
preferred label: campanhas políticas @pt-pt
preferred label: politisk kampagne @dk
preferred label: 政治运动 @zh-hans
preferred label: valgkamp @no-nb
preferred label: valkamp @no-nn
definition: Campaigns for public office
definition: Intensiv verksamhet under viss tid i avsikt att få någon vald. @se
definition: Kampagnen für öffentliche Parteien @de
definition: Campanhas para cargos públicos. @pt-pt
definition: Intensive aktiviteter i en bestemt periode med henblik på at få en valgt. @dk
definition: 公职竞选 @zh-hans
in scheme: Media Topic
created: 2009-10-22T02:00:00+00:00
retired: 2024-09-26T12:00:00+00:00
modified: 2024-09-26T12:00:00+00:00
broader: election

campaign finance
type: Concept
preferred label: تمويل حملات @ar
preferred label: Campañas financieras @es
preferred label: Financement de campagne @fr
preferred label: Kampanjbidrag @se
preferred label: Wahlkampffinanzierung @de
preferred label: financiamento de campanhas @pt-pt
preferred label: kampagnefinansiering @dk
preferred label: 竞选资金 @zh-hans
preferred label: valgkampfinansiering @no-nb
preferred label: valkampfinansiering @no-nn
definition: The money that makes campaigns for public office possible
definition: Geld, das Kampagnen für öffentliche Parteien ermöglicht @de
definition: Pengar som används för att hjälpa personer att bli valda. @se
definition: Dinheiro que torna possível as campanhas para cargos públicos. @pt-pt
definition: Penge, der bruges til at hjælpe folk med at blive valgt. @dk
definition: 用于竞选公职的资金 @zh-hans
in scheme: Media Topic
created: 2009-10-22T02:00:00+00:00
modified: 2021-02-18T12:00:00+00:00
broader: election

political candidates
type: Concept
preferred label: Politiska kandidater @se
preferred label: Kandidat @de
preferred label: Candidatos políticos @es
preferred label: Candidats @fr
preferred label: مرشحون سياسيون @ar
preferred label: candidatos políticos @pt-pt
preferred label: politisk kandidat @dk
preferred label: 政治候选人 @zh-hans
preferred label: valgkandidat @no-nb
preferred label: valkandidat @no-nn
definition: Personer som ställer upp i ett val. @se
definition: Individuals who are chosen to stand for office
definition: Individuen, die sich zur Wahl stellen @de
definition: Indivíduos escolhidos para se candidatarem a cargos públicos. @pt-pt
definition: Enkeltpersoner, der er valgt til at stille op for deres respektive partier eller til valg. @dk
definition: 被选来竞选公职的个人 @zh-hans
in scheme: Media Topic
created: 2009-10-22T02:00:00+00:00
modified: 2021-02-18T12:00:00+00:00
broader: election

primary elections
type: Concept
preferred label: Vorwahl @de
preferred label: انتخابات تمهيدية @ar
preferred label: Primarias @es
preferred label: Primärval @se
preferred label: Élections primaires @fr
preferred label: eleições primárias @pt-pt
preferred label: primærvalg @dk
preferred label: 初选 @zh-hans
preferred label: primærvalg i USA @no-nb
preferred label: primærval i USA @no-nn
definition: Vorwahlen auf lokaler oder regionaler Ebene, die zu einer regionalen oder nationalen Wahl führen @de
definition: Preliminary elections or caucuses to choose candidates to represent a political party in a regional or national election
definition: Förberedande val för att välja kandidater att representera ett politiskt parti i ett lokalt, regionalt eller nationellt val @se
definition: Eleições primárias locais ou regionais que conduzem a eleições regionais ou nacionais. @pt-pt
definition: Forberedelse af lokale og regionale valg, især i USA, inden for et parti for at give vejledning til at nominere kandidater på regionalt eller nationalt niveau. @dk
definition: 地方或区域一级的初步选举，直至区域或全国选举 @zh-hans
in scheme: Media Topic
created: 2009-10-22T02:00:00+00:00
modified: 2021-07-12T12:00:00+00:00
broader: election

referendum
type: Concept
preferred label: استفتاء @ar
preferred label: Referendos @es
preferred label: Référendum @fr
preferred label: Referendum @de
preferred label: Folkomröstning @se
preferred label: referendo @pt-pt
preferred label: folkeafstemning @dk
preferred label: 普通投票 @zh-hans
preferred label: folkeavstemning @no-nb
preferred label: folkerøysting @no-nn
definition: Political proposals, laws and actions to be voted on by the entire voting body, including ballot measures and citizens' initiatives
definition: Politische Vorschläge, Gesetze und Taten, die von Nicht-Regierungsangehörigen vorgebracht werden und zur Abstimmung durch die Abstimmungsberechtigten vorliegen @de
definition: Omröstning i en viss fråga, där alla röstberättigade kan delta. @se
definition: Propostas políticas, leis e ações sugeridas por membros ou organismos não governamentais para serem votados pela comunidade. @pt-pt
definition: Afstemning om et bestemt emne, hvor alle berettigede vælgere kan deltage. @dk
definition: 非政府官员提出的由整个投票机构投票表决的政治建议、法律和行动 @zh-hans
in scheme: Media Topic
created: 2009-10-22T02:00:00+00:00
modified: 2024-09-26T12:00:00+00:00
broader: election

regional elections
type: Concept
preferred label: Regionala val @se
preferred label: Élections régionales @fr
preferred label: Elecciones regionales @es
preferred label: انتخابات مناطق @ar
preferred label: Landtagswahl/Bürgerschaftswahl @de
preferred label: eleições regionais @pt-pt
preferred label: regionalvalg @dk
preferred label: 地区选举 @zh-hans
preferred label: state elections
preferred label: regionalval @no-nn
definition: Choosing individuals for government at a regional, state or province level
definition: Val av politiska företrädare till regional beslutande politisk församling @se
definition: Wahl einzelner Regierungsvertreter auf der regionalen Ebene @de
definition: Escolha de pessoas para o governo a nível regional. @pt-pt
definition: Valg, hvor borgerne i de 5 danske regioner vælger medlemmer til regionsrådene. @dk
definition: 为区域一级的政府选拔工作人员 @zh-hans
in scheme: Media Topic
created: 2009-10-22T02:00:00+00:00
modified: 2021-07-12T12:00:00+00:00
broader: election

voting
type: Concept
preferred label: تصويت @ar
preferred label: Stimmwahl @de
preferred label: Votación @es
preferred label: Opération de vote @fr
preferred label: Röstning @se
preferred label: votação @pt-pt
preferred label: afstemning @dk
preferred label: 投票 @zh-hans
preferred label: stemmegiving @no-nb
definition: Att rösta för en kandidat, ett parti eller ett initiativ i ett politiskt val, att företräda medborgarna i en politisk församling @se
definition: The act of casting a ballot for a candidate, a party or an initiative in a political election, including voting machines, voting by mail or voter turnout
definition: Die Wahl eines Individuums, der die eigenen Interessen in der Regierung vertreten soll @de
definition: Ato de selecionar uma pessoa para representar os seus interesses no governo. @pt-pt
definition: At vælge den person eller det parti, som vælgeren ønsker, skal repræsentere sine interesser. @dk
definition: 选择一个你愿意在政府中代表你利益的人的行为 @zh-hans
in scheme: Media Topic
created: 2009-10-22T02:00:00+00:00
modified: 2021-02-18T12:00:00+00:00
broader: election

church elections
type: Concept
preferred label: kirke- og menighedsrådsvalg @dk
preferred label: kirkevalg @no-nb
preferred label: eleições na Igreja @pt-br
preferred label: Kyrkoval @se
preferred label: 教会选举 @zh-hans
preferred label: Kirchenwahlen @de
preferred label: Élections paroissiales @fr
preferred label: Elecciones parroquiales @es
preferred label: انتخابات كنسية @ar
preferred label: kyrkjeval @no-nn
definition: Valghandling, hvor ledende personer i en kirkelig organisation skal udpeges. @dk
definition: Elections to choose leaders to run church organisations at various levels
definition: Eleições para escolher líderes para administrar organizações da igreja a vários níveis. @pt-br
definition: Procedurer för att välja representanter för att styra olika religiösa organisationer. @se
definition: 各级教会领导者的选举 @zh-hans
definition: Wahlen zur Wahl von Führungskräften für die Leitung kirchlicher Organisationen auf verschiedenen Ebenen @de
definition: Elections to choose leaders to run church organizations at various levels
change note: Retired. Use medtop:20000703 religious leader instead.
in scheme: Media Topic
created: 2019-09-05T12:00:00+00:00
retired: 2024-09-26T12:00:00+00:00
modified: 2024-09-26T12:00:00+00:00
broader: election

political debates
type: Concept
preferred label: politisk debatmøde @dk
preferred label: politiske debatter @no-nb
preferred label: debates políticos @pt-br
preferred label: Politiska debatter @se
preferred label: 政治辩论 @zh-hans
preferred label: politische Debatten @de
preferred label: Débat politique @fr
preferred label: Debate político @es
preferred label: نقاشات سياسية @ar
preferred label: politiske debattar @no-nn
definition: En organiseret debat mellem to eller flere kandidater. Kan foregå på tv og/eller foran et publikum. @dk
definition: Organised debates between political candidates during their election campaign
definition: Debates organizados entre candidatos políticos, que decorrem ao vivo em frente de uma audiência ou que são transmitidos. @pt-br
definition: Organiserade debatter mellan kandidater inför politiska val. Ofta inför publik och ibland tv- och radiosända. @se
definition: 政治候选人之间的有组织的辩论，以在观众面前直播或其他形式广播 @zh-hans
definition: Organisierte Debatten zwischen politischen Kandidaten, live vor Publikum oder auf irgendeine Art und Weise übertragen @de
definition: Organized debates between political candidates during their election campaign
in scheme: Media Topic
created: 2019-09-05T12:00:00+00:00
modified: 2021-07-12T12:00:00+00:00
broader: election

by-election
type: Concept
preferred label: special election
preferred label: Fyllnadsval @se
preferred label: suppleringsvalg @no-nb
preferred label: suppleringsval @no-nn
preferred label: Nachwahl @de
definition: An election used to fill an office that has become vacant between general elections because of the death of a politician, a resignation or other reason
definition: Särskilda val för att välja någon till en valbar plats som har blivit ledig mellan allmänna val @se
definition: Eine Wahl, die dazu dient, ein Amt zu besetzen, das zwischen den allgemeinen Wahlen durch den Tod eines Politikers, einen Rücktritt oder aus anderen Gründen frei geworden ist @de
in scheme: Media Topic
created: 2024-09-26T12:00:00+00:00
modified: 2024-09-26T12:00:00+00:00
broader: election

recall election
type: Concept
preferred label: Misstroendevotum @se
preferred label: mistillitsforslag @no-nb
preferred label: Abberufungswahl @de
definition: A special election to vote to remove an elected official from office before that official's term has ended
definition: Ett verktyg som den folkvalda församlingen har för att avsätta en regering eller ett enskilt statsråd @se
definition: Sonderwahlen zur Abwahl eines gewählten Amtsträgers vor Ablauf seiner Amtszeit @de
in scheme: Media Topic
created: 2024-09-26T12:00:00+00:00
modified: 2024-09-26T12:00:00+00:00
broader: election

coalition building
type: Concept
preferred label: Koalition @se
preferred label: koalisjon @no-nb
preferred label: Koalitionsverhandlung @de
definition: Political parties entering a power-sharing arrangement usually occurring when no single party has achieved an absolute majority after an election
definition: Samverkan, allians eller förbund mellan nationer eller politiska partier @se
definition: Politische Parteien, die eine Vereinbarung zur Teilung der Macht treffen, die in der Regel zustande kommt, wenn keine Partei nach einer Wahl die absolute Mehrheit erreicht hat @de
in scheme: Media Topic
created: 2024-09-26T12:00:00+00:00
modified: 2024-09-26T12:00:00+00:00
broader: election

censorship and freedom of speech
type: Concept
preferred label: رقابة @ar
preferred label: Zensur @de
preferred label: censur @dk
preferred label: Censura @es
preferred label: Censure @fr
preferred label: sensur @no-nb
preferred label: censura e liberdade de expressão @pt-br
preferred label: Censur och yttrandefrihet @se
preferred label: 审查 @zh-hans
definition: Försök att kontrollera yttrandefriheten samt rätten att utöva densamma @se
definition: The right to express opinions without restraint and attempts to supress speech by an organisation or individual
definition: Versuch durch jede Art von Gemeinschaft, die Redefreiheit, Religion und Ideen, die gedruckt, gezeichnet, im Cyberspace oder auf anderem Wege verbreitet werden, zu kontrollieren. Umfasst nicht offizielle Reglementierungen wie Kino, Werbung oder Fernsehen @de
definition: Tentativas de um grupo controlar as liberdades de expressão, de religião ou de ideias difundidas de forma impressa, em gráficos, no ciberespaço ou por outros meios. Não inclui padrões oficiais como classificação de filmes, publicidade e padrões de transmissão. @pt-pt
definition: Gruppers forsøg på at kontrollere trykke- og religionsfriheden i skrift, billede, internet og så videre. @dk
definition: 指任何组织为了控制印刷品、图像、网络上的言论、宗教信仰和思想自由颁布的非官方的各种规范，如电影评级，广告和广播标准 @zh-hans
definition: The right to express opinions without restraint and attempts to supress speech by an organization or individual
in scheme: Media Topic
created: 2009-10-22T02:00:00+00:00
modified: 2021-02-18T12:00:00+00:00
broader: fundamental rights

freedom of religion
type: Concept
preferred label: Religionsfreiheit @de
preferred label: Libertad de culto @es
preferred label: Liberté de religion @fr
preferred label: حرية الديانة @ar
preferred label: Religionsfrihet @se
preferred label: liberdade religiosa @pt-pt
preferred label: religionsfrihed @dk
preferred label: 宗教自由 @zh-hans
preferred label: religionsfrihet @no-nb
preferred label: religionsfridom @no-nn
definition: The right to practice the religion of one's choosing and efforts to violate this right through the intimidation of believers or laws that encroach on religious rituals
definition: Rättighet att utöva vilken religion man vill utan världsliga myndigheters inblandning. @se
definition: Artikel über Religionsrechte und Freiheiten, Unterdrückung und Einschüchterung von Gläubigen, Zensur in den Massenmedien, Vorgehensweisen von Regierungen, Journalistenverbände und andere NGOs im Zusammenhang mit Glaubensfreiheit und deren Praxis @de
definition: Direitos e liberdades religiosas, pressão e intimidação dos crentes, censura nos meios de comunicação de massa, atividades de órgãos governamentais, associações e/ou organizações de jornalistas e outras ONG no que diz respeito à liberdade de crença e de prática. @pt-pt
definition: Direitos e liberdades religiosas, pressão e intimidação dos crentes, censura na mídia de massa, atividades de órgãos governamentais, associações e/ou organizações de jornalistas e outras ONG no que diz respeito à liberdade de crença e de prática. @pt-br
definition: Retten til at udøve sin religion uden indblanding fra verdslige myndigheder. @dk
definition: 宗教权利和自由、对信徒的压力和恐吓、大众传媒的审查、政府机构、新闻协会和/或组织和其他非政府组织在信仰和实践自由方面的活动 @zh-hans
in scheme: Media Topic
created: 2009-10-22T02:00:00+00:00
modified: 2021-05-05T12:00:00+00:00
broader: fundamental rights

freedom of the press
type: Concept
preferred label: Libertad de prensa @es
preferred label: Pressefreiheit @de
preferred label: Liberté de la presse @fr
preferred label: حرية الصحافة @ar
preferred label: Tryckfrihet @se
preferred label: liberdade de imprensa @pt-pt
preferred label: pressefrihed @dk
preferred label: 新闻自由 @zh-hans
preferred label: trykkefrihet @no-nb
preferred label: trykkjefridom @no-nn
definition: Lagstadgad rätt att fritt uttrycka tankar och åsikter i tryckt form, varvid ofta någon annan person än skribenten hålls ansvarig för publiceringen. @se
definition: The right of the press to report on stories freely and efforts by governments, organizations or individuals to suppress, jail or kill journalists who are reporting the news
definition: Rechte und Freiheiten der Massenmedien, Druck und Einschüchterung von Journalisten, Zensur, Aktivitäten der Regierung, Journalistenverbände und/oder Organisationen die für die Pressefreiheit kämpfen @de
definition: Direitos e liberdades dos meios de comunicação de massa, pressão e intimidação dos jornalistas, censura nos meios de comunicação de massa, atividades de órgãos governamentais, associações e/ou organizações de jornalistas e outras ONG em relação à liberdade de imprensa. @pt-pt
definition: Direitos e liberdades da mídia de massa, pressão e intimidação dos jornalistas, censura na mídia de massa, atividades de órgãos governamentais, associações e/ou organizações de jornalistas e outras ONG em relação à liberdade de imprensa. @pt-br
definition: Lovbestemt ret til frit at udtrykke tanker og meninger i trykt form, hvorved en anden end forfatteren holdes ansvarlig for publikationen. @dk
definition: 大众传媒的权利和自由、对记者的压力和恐吓、大众传媒的审查、政府机构、记者协会和/或组织以及其他非政府组织在新闻自由方面的活动 @zh-hans
in scheme: Media Topic
created: 2009-10-22T02:00:00+00:00
modified: 2021-02-18T12:00:00+00:00
broader: fundamental rights

human rights
type: Concept
preferred label: حقوق الانسان @ar
preferred label: Mänskliga rättigheter @se
preferred label: Derechos humanos @es
preferred label: Droits de l'homme @fr
preferred label: Menschenrechte @de
preferred label: direitos humanos @pt-pt
preferred label: menneskerettighed @dk
preferred label: 人权 @zh-hans
preferred label: menneskerettigheter @no-nb
preferred label: menneskerettar @no-nn
definition: Rechte, die von allen Bürgern in Anspruch genommen werden können @de
definition: Rättigheter att åtnjutas av alla människor i hela världen @se
definition: Rights entitled to be enjoyed by all people universally
definition: Direitos comuns a todos os cidadãos do mundo. @pt-pt
definition: Individets grundlæggende rettigheder over for statsmagten, såsom ytringsfrihed, religionsfrihed og diskrimination. @dk
definition: 所有公民普遍享有的权利 @zh-hans
in scheme: Media Topic
created: 2009-10-22T02:00:00+00:00
modified: 2021-02-18T12:00:00+00:00
broader: fundamental rights

privacy
type: Concept
preferred label: Personlig integritet @se
preferred label: personvern @no-nb
preferred label: privacidade @pt-pt
preferred label: privatliv @dk
preferred label: 隐私 @zh-hans
preferred label: Datenschutz @de
preferred label: Droit au respect de la vie privée @fr
preferred label: Derecho al respeto de la vida privada @es
preferred label: احترام الخصوصية @ar
definition: The right of an individual or group to keep information about themselves private
definition: Rätten för en individ eller grupp att hålla information om sig själv privat @se
definition: Direito de um indivíduo ou grupo manter privadas as suas informações pessoais. @pt-pt
definition: Direito de um indivíduo ou grupo manter privadas suas informações pessoais. @pt-br
definition: Individets eller en gruppes rettighed til at holde personlige informationer privat. @dk
definition: 个人或群体保持有关自身信息私密的权利 @zh-hans
definition: Das Recht eines Einzelnen oder einer Gruppe, Informationen über sich selbst geheim zu halten @de
in scheme: Media Topic
created: 2020-08-05T12:00:00+00:00
modified: 2021-07-12T12:00:00+00:00
broader: fundamental rights

women's rights
type: Concept
preferred label: kvinners rettigheter @no-nb
preferred label: Jämställdhet @se
preferred label: kvinnerettar @no-nn
preferred label: Derechos de las mujeres @es
preferred label: Droits des femmes @fr
preferred label: حقوق النساء @ar
preferred label: Frauenrechte @de
definition: The rights of women to be treated equally as men, such as pay parity, feminism and bodily autonomy around abortion
definition: Frågor om jämställdhet mellan olika grupper, vanligast den mellan män och kvinnor med målsättningen att kvinnor ska ha samma rättigheter och möjligheter som män. @se
definition: Das Recht der Frauen auf Gleichbehandlung mit den Männern, z. B. Lohngleichheit, Feminismus und körperliche Autonomie bei der Abtreibung @de
in scheme: Media Topic
created: 2021-05-05T12:00:00+00:00
modified: 2021-12-21T12:00:00+00:00
broader: fundamental rights

civil and public service
type: Concept
preferred label: ادارة مدنية وعامة @ar
preferred label: Servicios públicos @es
preferred label: Öffentlicher Dienst @de
preferred label: Offentlig verksamhet @se
preferred label: Service public @fr
preferred label: serviços públicos @pt-pt
preferred label: offentlig forvaltning @dk
preferred label: 公务员和公共服务 @zh-hans
preferred label: offentleg forvaltning @no-nn
definition: Bezahlte Dienstleistung von Zivilisten für die Regierung und die oftmals unbezahlte ehrenamtliche Dienstleistung für andere @de
definition: The paid service by civilians for the government, and the often non-paid service of individuals for the benefit of others (public service)
definition: Statlig och kommunal förvaltning. @se
definition: Serviço pago feito por civis para o governo e serviço, frequentemente não pago, de indivíduos para benefício de outros (serviço público). @pt-pt
definition: Statslig og kommunal forvaltning. @dk
definition: 公务人员为政府提供的有偿服务，以及个人为他人提供的非有偿服务(公共服务) @zh-hans
change note: 2025-03-31: Retired. Use government employee (medtop:20000595) instead.
in scheme: Media Topic
created: 2009-10-22T02:00:00+00:00
retired: 2025-03-31T12:00:00+00:00
modified: 2025-03-31T12:00:00+00:00
broader: government
narrower: civilian service

government employee
type: Concept
preferred label: Beamte @de
preferred label: Empleados públicos @es
preferred label: Fonctionnaires @fr
preferred label: Offentliganställd @se
preferred label: موظفون حكوميون @ar
preferred label: funcionários públicos @pt-pt
preferred label: offentligt ansat @dk
preferred label: 公务人员 @zh-hans
preferred label: offentlig ansatte @no-nb
preferred label: offentleg tilsette @no-nn
definition: Den som är anställd i offentlig skattefinansierad verksamhet på alla nivåer. @se
definition: Individuals employed by a government at all levels
definition: Menschen auf allen Ebenen, die im Dienst der Regierung stehen @de
definition: Pessoas contratadas por qualquer nível de governo. @pt-pt
definition: Personer ansat af staten på alle niveauer. @dk
definition: 各级政府工作人员 @zh-hans
in scheme: Media Topic
created: 2009-10-22T02:00:00+00:00
modified: 2025-03-31T12:00:00+00:00
broader: government

public officials
type: Concept
preferred label: شخصيات حكومية وموظفون رسميون @ar
preferred label: Hauts fonctionnaires @fr
preferred label: Förtroendevald @se
preferred label: Ministerialbeamte @de
preferred label: Funcionarios públicos @es
preferred label: detentores de cargos públicos @pt-pt
preferred label: offentlig embedsmand @dk
preferred label: 政府官员 @zh-hans
preferred label: folkevalgte og embetspersoner @no-nb
preferred label: folkevalde og embetspersoner @no-nn
definition: Individuals who are elected or appointed to positions in the government
definition: Individuen, meist gewählt, die im öffentlichen Dienst stehen oder öffentliche Interessen vertreten. @de
definition: Den som genom val erhållit ett uppdrag och på väljarnas uppdrag sköta ämbetet i enlighet med sin övertygelse. @se
definition: Pessoas, geralmente eleitas para cargos políticos, que estão no serviço público ou frequentemente na opinião pública. @pt-pt
definition: Personer der arbejder inden for den offentlige administration. @dk
definition: 在公共服务领域或公众视野中的个人，通常由选举产生 @zh-hans
definition: Individuals, usually elected, who are in public service or commonly in the public eye.
in scheme: Media Topic
created: 2009-10-22T02:00:00+00:00
modified: 2025-03-31T12:00:00+00:00
broader: government

constitution (law)
type: Concept
preferred label: Grundlag @se
preferred label: Constitución @es
preferred label: Constitution @fr
preferred label: Verfassung (Gesetz) @de
preferred label: دستور @ar
preferred label: constituição @pt-pt
preferred label: grundlov @dk
preferred label: 宪法（法律） @zh-hans
preferred label: grunnlov @no-nb
definition: Für gewöhnlich ein schriftliches Dokument, was das Funktionieren einer Regierung und die Rechte der Bürger darin festschreibt @de
definition: A basic framework that stands above all laws and regulations, specifying how a particular political entity is governed
definition: En grundlag, konstitution eller statsförfattning är en samling lagar som utgör de grundläggande formella normerna i en stat. @se
definition: Geralmente, um documento escrito que estabelece os direitos e os deveres dos cidadãos e a organização política do estado, definindo os poderes e funções dos poderes legislativo, executivo e judicial. @pt-pt
definition: Geralmente, documento escrito que estabelece as operações de um governo e os direitos dos cidadãos. @pt-br
definition: Et sæt juridiske bestemmelser, der specificerer, hvordan et bestemt land skal styres. @dk
definition: 通常是一种书面文件，规定了政府的运作和公民的权利 @zh-hans
in scheme: Media Topic
created: 2009-10-22T02:00:00+00:00
modified: 2025-03-31T12:00:00+00:00
broader: government

national security
type: Concept
preferred label: Défense @fr
preferred label: Nationell säkerhet @se
preferred label: Verteidigung @de
preferred label: دفاع @ar
preferred label: Defensa @es
preferred label: defesa @pt-pt
preferred label: forsvar @dk
preferred label: 防务 @zh-hans
definition: En nations försvar mot inre och yttre fiender. @se
definition: Alles was die Verteidigung des eigenen Landes umfasst @de
definition: The protection of a political entity
definition: Tudo o que envolva a proteção de um país. @pt-pt
definition: Alt, der involverer beskyttelse af ens eget land. @dk
definition: 任何涉及保护自己国家的事情 @zh-hans
in scheme: Media Topic
created: 2009-10-22T02:00:00+00:00
modified: 2025-03-31T12:00:00+00:00
broader: government
narrower: armed forces
narrower: military equipment
narrower: military weaponry and equipment
narrower: security measures (defence)
narrower: espionage and intelligence

executive (government)
type: Concept
preferred label: Pouvoir exécutif @fr
preferred label: Ejecutivo (gobierno) @es
preferred label: Bundeskabinett @de
preferred label: Verkställande statsmakt @se
preferred label: سلطة تنفيذية (حكومة) @ar
preferred label: executivo (governo) @pt-pt
preferred label: udøvende (regering) @dk
preferred label: 行政工作（政府） @zh-hans
preferred label: utøvende makt @no-nb
preferred label: utøvande makt @no-nn
definition: Der Teil der regulierenden Kraft des Staates, der in alle Regierungsangelegenheiten involviert ist. @de
definition: Den högsta verkställande makten i en nation @se
definition: Branch of government that is responsible for implementing the laws passed by the legislative branch, sometimes led by a prime minister or president
definition: Parte do corpo governativo de um país que detém o poder de executar as leis e a operação geral do governo. @pt-pt
definition: Den højeste udøvende magt i et land, hvor magten er delt i tre mellem udøvende, lovgivende og dømmende. @dk
definition: 管理机构中涉及政府整体运作的那部分 @zh-hans
in scheme: Media Topic
created: 2009-10-22T02:00:00+00:00
modified: 2025-03-31T12:00:00+00:00
broader: government

government budget
type: Concept
preferred label: Statsbudget @se
preferred label: ميزانية حكومية @ar
preferred label: Staatshaushalt @de
preferred label: Presupuesto del gobierno @es
preferred label: Budget du gouvernement @fr
preferred label: orçamento de estado @pt-pt
preferred label: finanslov @dk
preferred label: 政府预算 @zh-hans
preferred label: statsbudsjett @no-nb
definition: En beräkning i förväg av statens inkomster och utgifter under ett år, budgetår. @se
definition: The proposed expenses and revenues approved by the legislature.
definition: Der von der Regierung verkündete nationale Haushalt @de
definition: Despesas e receitas aprovadas pela assembleia legislativa. @pt-pt
definition: Despesas e receitas aprovadas pela câmara legislativa. @pt-br
definition: Et skøn på forhånd af statens indtægter og udgifter i et år, regnskabsåret. @dk
definition: 立法机关批准的开支和收入。 @zh-hans
in scheme: Media Topic
created: 2009-10-22T02:00:00+00:00
modified: 2025-03-31T12:00:00+00:00
broader: government
narrower: public finance
broad match: http://cv.iptc.org/newscodes/subjectcode/11013000

government department
type: Concept
preferred label: Ministerio @es
preferred label: Ministère @fr
preferred label: Ministerium @de
preferred label: Departement @se
preferred label: ادارة حكومية @ar
preferred label: departamentos governamentais @pt-pt
preferred label: ministerium @dk
preferred label: 政府部门 @zh-hans
preferred label: departementer @no-nb
preferred label: departement @no-nn
definition: Abteilungen der Regierung, die ein spezielles Gebiet vertreten, wie z.B. Gesundheit, Soziales, Wirtschaft oder Verteidigung @de
definition: Divisions of a government that concentrate on specific areas such as health, welfare, economy or war
definition: Statsorgan som under regeringen ansvarar för viss gren av statsstyrelsen genom att bereda, handlägga och verkställa regeringens beslut, men utan befogenhet att ingripa i förvaltningens detaljer. @se
definition: Divisões de um governo que se concentram em áreas específicas, como a saúde, o bem-estar, a economia ou a guerra. @pt-pt
definition: Afdeling under statsforvaltningen som administrerer lovgivning etc. på et bestemt område, og som ledes af en minister. @dk
definition: 政府中专注于卫生、福利、经济或战争等特定领域的部门 @zh-hans
change note: 2025-03-31: Retired. Use more specific terms or government (medtop:20000593) instead.
in scheme: Media Topic
created: 2009-10-22T02:00:00+00:00
retired: 2025-03-31T12:00:00+00:00
modified: 2025-03-31T12:00:00+00:00
broader: government

head of state
type: Concept
preferred label: Statschef @se
preferred label: رئيس حكومة @ar
preferred label: Staatsoberhaupt/Bundespräsident @de
preferred label: Chef de l'Etat @fr
preferred label: Jefes de Estado @es
preferred label: chefes de estado @pt-pt
preferred label: statsoverhoved @dk
preferred label: 国家元首 @zh-hans
preferred label: statsoverhode @no-nb
preferred label: statsoverhovud @no-nn
definition: Symbolic or actual chief representative of a nation, such as a monarch, president or emir
definition: Symbolischer oder aktiver Repräsentant eines Landes, wie z.B. König, Präsident oder Emir. @de
definition: Den högsta företrädaren för en suverän stat, som en president, monark eller emir. @se
definition: Representante supremo de uma nação, simbólico ou não, como a realeza, um presidente ou um emir, por exemplo. @pt-pt
definition: Øverste leder eller repræsentant for en stat f.eks. konge, dronning eller præsident. @dk
definition: 国家的象征或实际的领袖。例如王室成员、总统、 国家主席、埃米尔 @zh-hans
in scheme: Media Topic
created: 2009-10-22T02:00:00+00:00
modified: 2025-03-31T12:00:00+00:00
broader: government

impeachment
type: Concept
preferred label: Amtsvergehen @de
preferred label: اجراءات الاتهام @ar
preferred label: Procédure de destitution @fr
preferred label: Procedimiento de destitución @es
preferred label: Riksrättsförfarande @se
preferred label: rigsretssag @dk
preferred label: 弹劾 @zh-hans
preferred label: riksrett @no-nb
definition: The process of bringing a public official before a tribunal to answer charges of wrongdoing
definition: Processen som ställer regeringsmedlemmar eller liknande personer inför en särskild domstol för ämbetsfel. @se
definition: Verfahren zur Anklage wegen Amtsvergehen von Amtsträgern vor einem Tribunal. @de
definition: Processo em que um detentor de cargo público é levado a tribunal para responder por acusações de irregularidades. @pt-pt
definition: Proces med at bringe regeringsmedlemmer eller lignende personer for en særlig domstol for lovstridig embedsførelse. @dk
definition: 将公职人员带到法庭上对不法行为的指控进行答辩的过程 @zh-hans
in scheme: Media Topic
created: 2009-10-22T02:00:00+00:00
modified: 2021-02-18T12:00:00+00:00
broader: government

local authority
type: Concept
preferred label: Autoridades locales @es
preferred label: Lokala myndigheter @se
preferred label: سلطة محلية @ar
preferred label: Kommune @de
preferred label: Institutions locales @fr
preferred label: governo e autoridades locais @pt-pt
preferred label: kommune @dk
preferred label: 地方政府 @zh-hans
preferred label: lokale myndigheter @no-nb
preferred label: local government
preferred label: lokale styresmakter @no-nn
definition: Autoritäten in der Stadt, auf Landes- oder Bezirksebene @de
definition: Verkställande myndigheter på lokal, kommun- region- eller länsnivå. @se
definition: Authorities at borough, city or county level
definition: Autoridades de uma cidade, condado, distrito ou município. @pt-pt
definition: Autoridades de uma cidade, condado, distrito, município. @pt-br
definition: Lokal myndighed, som ledes af en valgt kommunalbestyrelse. @dk
definition: 区、市、县各级政府 @zh-hans
in scheme: Media Topic
created: 2009-10-22T02:00:00+00:00
modified: 2025-03-31T12:00:00+00:00
broader: government

minister or secretary (government)
type: Concept
preferred label: وزراء (حكومة) @ar
preferred label: Minister @de
preferred label: Minister eller statsråd @se
preferred label: Ministres @fr
preferred label: Ministros (gobierno) @es
preferred label: ministro (governo) @pt-pt
preferred label: minister (regering) @dk
preferred label: 部长（政府） @zh-hans
preferred label: minister/statsråd @no-nb
definition: Senior government official, either elected or appointed, who heads a government department or leads an initiative
definition: Regeringsmedlem som är chef för ett departement eller ansvarig för ett visst politikområde. @se
definition: Führungsebene verschiedener Regierungsministerien, auch bekannt als Staatssekretäre. Auf anderen Ebenen bilden sie die Legislative. Der oberste Minister ist entweder der Bundeskanzler oder der Vizekanzler @de
definition: Político que chefia um departamento do governo e trabalha em conjunto com outros ministros para tomar e implementar decisões políticas. @pt-pt
definition: Medlem af en regering og leder af et ministerium. @dk
definition: 各级政府部门的首长。在另一个层次上，它们构成一个立法机构。首席部长不是首相就是总理 @zh-hans
in scheme: Media Topic
created: 2009-10-22T02:00:00+00:00
modified: 2025-03-31T12:00:00+00:00
broader: government

national government
type: Concept
preferred label: حكومة مركزية @ar
preferred label: Gobierno nacional @es
preferred label: Bundesregierung @de
preferred label: Gouvernement national @fr
preferred label: Regeringen @se
preferred label: governo nacional @pt-pt
preferred label: national regering @dk
preferred label: 中央政府 @zh-hans
preferred label: nasjonale myndigheter @no-nb
preferred label: nasjonale styresmakter @no-nn
definition: The ruling body of a nation
definition: Högsta styrelsen för ett land. @se
definition: Die herrschende, regulierende Kraft eines Staates @de
definition: Corpo governativo de uma nação. @pt-pt
definition: Et lands styrende organ. @dk
definition: 一个国家的统治机构 @zh-hans
in scheme: Media Topic
created: 2009-10-22T02:00:00+00:00
modified: 2021-02-18T12:00:00+00:00
broader: government

legislative body
type: Concept
preferred label: Riksdagen @se
preferred label: Parlement @fr
preferred label: Parlament @de
preferred label: Parlamento @es
preferred label: برلمان @ar
preferred label: parlamento @pt-pt
preferred label: lovgivende parlament @dk
preferred label: 立法机构 @zh-hans
preferred label: nasjonalforsamling/parlament @no-nb
definition: A legislature of elected officials representing the people that has the authority to make laws
definition: Folkrepresentationen i ett land, namnet på Sveriges folkvalda parlament. @se
definition: Die kollektive Gemeinschaft gewählter Volksvertreter @de
definition: Corpo coletivo dos representantes eleitos do povo. @pt-pt
definition: Folkevalgt forsamling der udgør den øverste lovgivende magt i et land. @dk
definition: 代表人民的民选官员组成的立法机构 @zh-hans
in scheme: Media Topic
created: 2009-10-22T02:00:00+00:00
modified: 2021-03-31T12:00:00+00:00
broader: government
narrower: lower house (legislature)
narrower: upper house (legislature)

regional authority
type: Concept
preferred label: سلطة اقليمية @ar
preferred label: Institutions régionales @fr
preferred label: Autoridades regionales @es
preferred label: Bundesland/Kanton @de
preferred label: Regional myndighet @se
preferred label: governo e autoridades regionais @pt-pt
preferred label: region @dk
preferred label: 地区政府和机构 @zh-hans
preferred label: regionale myndigheter @no-nb
preferred label: regional government
preferred label: regionale styresmakter @no-nn
definition: Myndigheter som verkar på en nivå mellan den lokala och den nationella. @se
definition: Regierungseinheiten auf Ebenen, die für mehr als eine Gerichtsbarkeit zuständig sind, wie z.B. Länder der BRD oder Österreich, Kantone der Schweiz @de
definition: Authorities at a level above the local and below the national, such as a state or province
definition: Autoridades acima do nível local e abaixo do nível nacional. Pode tratar-se de estado, província, departamento, região etc. @pt-pt
definition: Myndigheder, der arbejder på et niveau mellem det lokale og det nationale. @dk
definition: 地方以上各级政府和国家以下各级政府。可以命名为州、省、部门等 @zh-hans
in scheme: Media Topic
created: 2009-10-22T02:00:00+00:00
modified: 2025-03-31T12:00:00+00:00
broader: government

lobbying
type: Concept
preferred label: مجموعة ضغط @ar
preferred label: Cabildeo @es
preferred label: Lobby @de
preferred label: Lobbyverksamhet @se
preferred label: Groupe de pression @fr
preferred label: lobby @pt-pt
preferred label: lobbyvirksomhed @dk
preferred label: 游说 @zh-hans
preferred label: lobbyvirksomhet @no-nb
preferred label: lobbyverksamd @no-nn
definition: Bearbetning av beslutsfattare för att åstadkomma beslut i en viss riktning. @se
definition: Advocacy to influence legislators or government officials
definition: Der Versuch nichtregierender Einheiten und Einzelner durch Überzeugung oder Fürsprache die Durchsetzung eines Gesetzes zu beeinflussen. @de
definition: Tentativa, exercida por grupos e indivíduos não governamentais, de afetar o resultado dos processos de legislação através de persuasão verbal ou outra. @pt-pt
definition: Påvirkning af f.eks. embedsmænd eller politikere til at tage bestemte beslutninger i forbindelse med udarbejdelse og vedtagelse af love etc.. @dk
definition: 非政府组织和个人试图通过口头或其他方式说服来影响立法结果 @zh-hans
definition: The attempt by non-government bodies and individuals to affect the outcome of legislation through verbal, or other, persuasion
in scheme: Media Topic
created: 2009-10-22T02:00:00+00:00
modified: 2025-03-31T12:00:00+00:00
broader: government

political parties and movements
type: Concept
preferred label: Partidos políticos @es
preferred label: احزب وحركات @ar
preferred label: Politiska partier och rörelser @se
preferred label: Politische Parteien und Bewegungen @de
preferred label: Partis politiques @fr
preferred label: partidos e movimentos políticos @pt-pt
preferred label: politisk parti og bevægelse @dk
preferred label: 政党和运动 @zh-hans
preferred label: partier og politiske bevegelser @no-nb
preferred label: politisk parti og rørsler @no-nn
definition: Covers both formally recognised and informal political associations
definition: Sammanslutning eller grupp av väljare som uppträder i val under särskild beteckning samt mer informella politiska formationer. @se
definition: Umfasst sowohl formelle und informelle politische Zusammenschlüsse. @de
definition: Inclui associações políticas formalmente reconhecidas e informais. @pt-pt
definition: Sammenslutning eller gruppe af vælgere, der optræder i valg under særlig udpegning såvel som mere uformelle politiske formationer. @dk
definition: 包括正式认可的和非正式的政治协会 @zh-hans
definition: Covers both formally recognized and informal political associations
change note: Retired. Use political party (medtop:20001384) or political movement and association (medtop:20001385) instead.
in scheme: Media Topic
created: 2009-10-22T02:00:00+00:00
retired: 2025-03-31T12:00:00+00:00
modified: 2025-03-31T12:00:00+00:00
broader: government

political development
type: Concept
preferred label: Histoire politique @fr
preferred label: Politikgeschichte @de
preferred label: Politisk utveckling @se
preferred label: تطوير سياسي @ar
preferred label: Historia política @es
preferred label: desenvolvimento político @pt-pt
preferred label: politisk udvikling @dk
preferred label: 政治发展 @zh-hans
preferred label: politisk utvikling @no-nb
definition: Skapandet och framväxten av politiska system och historien om de personer och nationer som förknippas med dessa. @se
definition: Entstehung und Entwicklung politischer Systeme und die Geschichte der Menschen und Nationen, die mit diesen in Zusammenhang stehen. @de
definition: The creation and rise of political systems and the history of the people and nations that are associated with those systems.
definition: Criação e evolução de sistemas políticos e a história dos povos e nações que estão associados a esses sistemas. @pt-pt
definition: Oprettelsen og opkomsten af politiske systemer og historien til de mennesker og nationer, der er forbundet med disse systemer. @dk
definition: 政治制度的建立和兴起以及与这些制度有关的人民和国家的历史 @zh-hans
change note: Retired. Use medtop:11000000 politics instead.
in scheme: Media Topic
created: 2009-10-22T02:00:00+00:00
retired: 2025-03-31T12:00:00+00:00
modified: 2025-03-31T12:00:00+00:00
broader: government

political system
type: Concept
preferred label: Système politique @fr
preferred label: Politisches System @de
preferred label: Sistema político @es
preferred label: نظام سياسي @ar
preferred label: Politiska system @se
preferred label: sistemas políticos @pt-pt
preferred label: politisk system @dk
preferred label: 政治制度 @zh-hans
definition: Den regeringsform som används, erkänns eller på annat sätt deklareras av ett samhälle eller en stat. @se
definition: The form of government that is observed, recognised or otherwise declared by a society or state
definition: Systeme, die geschaffen sind um der Regierung ein Regelwerk zur Verfügung zu stellen @de
definition: Sistemas desenvolvidos para a organização do governo. @pt-pt
definition: Et system med embedsmænd og institutioner, der sammen udøver politisk magt. @dk
definition: 为政府提供秩序的制度 @zh-hans
in scheme: Media Topic
created: 2009-10-22T02:00:00+00:00
modified: 2025-03-31T12:00:00+00:00
broader: government
narrower: democracy
narrower: dictatorship
narrower: communism
narrower: democratic socialism
narrower: theocracy
narrower: absolute monarchy

regulatory authority
type: Concept
preferred label: Tillsynsmyndigheter @se
preferred label: entidade reguladora @pt-pt
preferred label: agência reguladora @pt-br
preferred label: styrelse og tilsyn @dk
preferred label: 监管机构 @zh-hans
preferred label: tilsynsmyndighet @no-nb
preferred label: Regulierungsbehörde @de
preferred label: Autorité de régulation @fr
preferred label: Autoridad de regulación @es
preferred label: هيئة منظمة @ar
preferred label: tilsynsorgan @no-nn
definition: Myndigheter som är ansvariga för att reglera och övervaka en bransch. @se
definition: Authority responsible for the regulation or supervision of a business sector.
definition: Autoridade responsável pela regulamentação ou supervisão de um setor empresarial. @pt-pt
definition: Myndigheder, der er ansvarlige for at regulere og føre tilsyn med en branche. @dk
definition: 负责管理或监督商业部门的机构。 @zh-hans
definition: Behörde, die für die Regulierung oder Überwachung eines Wirtschaftssektors zuständig ist. @de
change note: Retired. Use medtop:20000636 regulation of industry instead.
in scheme: Media Topic
created: 2016-04-04T12:00:00+00:00
retired: 2025-03-31T12:00:00+00:00
modified: 2025-03-31T12:00:00+00:00
broader: government

political party convention
type: Concept
preferred label: politisk kongres eller årsmøde @dk
preferred label: landsmøte @no-nb
preferred label: convenção partidária @pt-pt
preferred label: Partikongress @se
preferred label: 政治会议 @zh-hans
preferred label: politischer Konvent @de
preferred label: Congrès politique @fr
preferred label: Congreso partidario @es
preferred label: مؤتمر سياسي @ar
definition: Et års- eller landsmøde, hvor et politisk parti fastlægger sin politik, foretager valg til tillidsposter og udnævner kandidater. @dk
definition: Meeting of political party to nominate a candidate, choose a party leader or set policy
definition: Reunião de um partido político para nomear um candidato, escolher um líder ou definir políticas. @pt-pt
definition: Kongress, stämma eller möte inom ett politiskt parti för att nominera kandidater, välja ledare och ta beslut om partiprogram. @se
definition: 政党进行候选人提名、选举政党领袖或制定政策的会议 @zh-hans
definition: Treffen der politischen Partei zur Nominierung eines Kandidaten, zur Wahl eines Parteivorsitzenden oder zur Festlegung der Politik @de
in scheme: Media Topic
created: 2019-09-05T12:00:00+00:00
modified: 2025-03-31T12:00:00+00:00
broader: government

political committee
type: Concept
preferred label: politisk udvalg @dk
preferred label: politiske komitéer @no-nb
preferred label: comissão parlamentar @pt-br
preferred label: Politisk kommitté @se
preferred label: 政治委员会 @zh-hans
preferred label: politische Ausschüsse @de
preferred label: Commissions parlementaires @fr
preferred label: Comisiones parlamentarias @es
preferred label: لجان برلمانية @ar
preferred label: politiske komitear @no-nn
definition: A legislative sub-group that focuses on a specific area or action
definition: Subgrupo legislativo que se centra numa área ou ação específica. @pt-pt
definition: Subgrupo legislativo que se centra em uma área ou ação específica. @pt-br
definition: En underafdeling af en lovgivende forsamling, der beskæftiger sig med et særligt emne eller geografisk område. @dk
definition: En grupp som satts samman med representanter för olika partier för att fokusera på en viss fråga. @se
definition: 专注于特定领域或行动的立法小组 @zh-hans
definition: Eine legislative Untergruppe, die sich auf einen bestimmten Bereich oder eine bestimmte Aktion konzentriert @de
in scheme: Media Topic
created: 2019-09-05T12:00:00+00:00
modified: 2025-03-31T12:00:00+00:00
broader: government

head of government
type: Concept
preferred label: regeringschef @dk
preferred label: regjeringssjef @no-nb
preferred label: chefe de governo @pt-br
preferred label: Regeringschef @se
preferred label: 政治首脑 @zh-hans
preferred label: Regierungschefs @de
preferred label: Chef du gouvernement @fr
preferred label: Jefes de gobierno @es
preferred label: رؤساء حكومات @ar
definition: Den øverste politiske ansvarlige i en stat eller et selvstyreområde. @dk
definition: The highest official in the executive branch of a political entity
definition: Funcionário mais elevado do ramo executivo de um estado soberano, de um estado federado ou de uma colônia autônoma. @pt-br
definition: Funcionário mais elevado do ramo executivo de um estado soberano, de um estado federado ou de uma colónia autónoma. @pt-pt
definition: Högsta ansvarig i den verkställande makten i ett land, delstat eller liknande. @se
definition: 主权国家、联邦国家或自治殖民地行政部门中的最高官员 @zh-hans
definition: Der höchste Beamte in der Exekutive eines souveränen Staates, eines föderierten Staates oder einer selbstverwalteten Kolonie @de
in scheme: Media Topic
created: 2019-09-05T12:00:00+00:00
modified: 2025-03-31T12:00:00+00:00
broader: government

public inquiry
type: Concept
preferred label: kommission @dk
preferred label: offentlig utredning @no-nb
preferred label: inquérito público @pt-br
preferred label: Offentlig utredning @se
preferred label: 公开调查 @zh-hans
preferred label: öffentliche Untersuchung @de
preferred label: Enquête publique @fr
preferred label: Consulta pública @es
preferred label: تحقيق عام @ar
preferred label: offentleg utgreiing @no-nn
definition: En officiel undersøgelse af en begivenhed eller sag, som er iværksat af en statslig myndighed. @dk
definition: An official review of events or actions ordered by a government body, including royal commissions
definition: Investigação oficial de eventos ou de ações, ordenada por um órgão governamental, incluindo comissões reais. @pt-br
definition: Utredning av händelser och aktioner utförda av styrande myndigheter. @se
definition: 由政府下令发起的对事件、行动的正式审查，包括皇家委员会 @zh-hans
definition: Eine offizielle Überprüfung von Ereignissen oder Handlungen, die von einer Regierungsstelle, einschließlich königlicher Kommissionen, angeordnet wurde @de
in scheme: Media Topic
created: 2019-09-05T12:00:00+00:00
modified: 2021-07-12T12:00:00+00:00
broader: government

political leadership
type: Concept
preferred label: partiledelse @no-nb
preferred label: Politiskt ledarskap @se
preferred label: liderança política @pt-pt
preferred label: 政治领导 @zh-hans
preferred label: Parteivorsitzende @de
preferred label: Dirigeants politiques @fr
preferred label: Dirigentes políticos @es
preferred label: قادة سياسيون @ar
preferred label: partileiing @no-nn
definition: Positions of leadership within political parties and discussion around whether leadership changes need to be made
definition: Företrädare för ett politiskt parti samt diskussioner om förändringar i ledarskapet inom ett politiskt parti. @se
definition: Ledelsen i et politisk partis landsorganisation eller folketingsgruppe. @dk
definition: Os líderes de um partido político. @pt-pt
definition: 政党领导人 @zh-hans
definition: Die Führer innerhalb einer politischen Partei @de
in scheme: Media Topic
created: 2021-02-18T12:00:00+00:00
modified: 2025-03-31T12:00:00+00:00
broader: government

political party
type: Concept
preferred label: politisk parti @no-nb
preferred label: Partei @de
definition: Organisation that coordinates candidates to run to represent that party in an election
definition: Organization that coordinates candidates to run to represent that party in an election
definition: Organisation, die Kandidaten koordiniert, die bei einer Wahl für diese Partei kandidieren. @de
in scheme: Media Topic
created: 2025-03-31T12:00:00+00:00
modified: 2025-03-31T12:00:00+00:00
broader: government

political movement and association
type: Concept
preferred label: politisk bevegelse @no-nb
preferred label: politisk rørsle @no-nn
preferred label: Politische Bewegung und Zusammenschluss @de
definition: A collective of people with the aim to change government policy or social values in opposition to the status quo
definition: Eine Gruppe von Menschen, die sich zum Ziel gesetzt hat, die Politik der Regierung oder gesellschaftliche Werte zu verändern, um sich gegen den Status quo zu stellen. @de
in scheme: Media Topic
created: 2025-03-31T12:00:00+00:00
modified: 2025-03-31T12:00:00+00:00
broader: government

civilian service
type: Concept
preferred label: Civilsamhälleligt arbete @se
preferred label: Zivildienst @de
preferred label: serviço cívico @pt-pt
preferred label: serviço alternativo @pt-br
preferred label: civil embedsvæsen @dk
preferred label: 公民服务 @zh-hans
preferred label: frivillig samfunnstjeneste @no-nb
preferred label: Service civil @fr
preferred label: Servicio civil @es
preferred label: خدمة مدنية @ar
preferred label: frivillig samfunnsteneste @no-nn
definition: Unbezahlter Dienst für die Gemeinschaft als Zivilist @de
definition: Unpaid service for the community as civilian
definition: Arbete som utförs av den del av samhället där människor hjälper varandra utan inblandning av det offentliga, staten eller kommuner. @se
definition: Serviço não remunerado feito por um civil para a comunidade. @pt-pt
definition: Arbejde udført af den del af samfundet, hvor mennesker hjælper hinanden uden inddragelse af offentligheden, staten eller kommunerne. @dk
definition: 向社区百姓提供的无偿服务 @zh-hans
change note: Retired. Use medtop:20001277 volunteering instead.
in scheme: Media Topic
created: 2012-10-04T12:00:00+00:00
retired: 2025-03-31T12:00:00+00:00
modified: 2021-07-12T12:00:00+00:00
broader: civil and public service

armed forces
type: Concept
preferred label: Streitkräfte/Bundeswehr @de
preferred label: Fuerzas armadas @es
preferred label: قوات مسلحة @ar
preferred label: Väpnade styrkor @se
preferred label: Forces armées @fr
preferred label: forças armadas @pt-pt
preferred label: væbnet styrke @dk
preferred label: 武装力量 @zh-hans
preferred label: væpnede styrker @no-nb
preferred label: væpna styrkar @no-nn
definition: The organizations and individuals that serve as part of the military of a political entity
definition: Die Angestellten der Regierung, die im Krieg eingesetzt werden oder die Sicherheit einer Nation durchsetzen @de
definition: De personer och medel som används för att försvara en nation eller föra krig. @se
definition: Funcionários de um governo incumbidos de gerir um conflito armado ou de garantir a segurança de uma nação. @pt-pt
definition: De, der er ansat af staten til, at føre krig eller forsvare kongeriget. @dk
definition: 被政府雇佣组织实施战争或维护国家安全的人 @zh-hans
in scheme: Media Topic
created: 2009-10-22T02:00:00+00:00
modified: 2025-03-31T12:00:00+00:00
broader: national security
narrower: veterans' affairs
narrower: military service

military equipment
type: Concept
preferred label: Försvarsmateriel @se
preferred label: Militärische Ausrüstung @de
preferred label: Équipement militaire @fr
preferred label: معدات عسكرية @ar
preferred label: Equipamiento militar @es
preferred label: equipamento militar @pt-pt
preferred label: militært udstyr @dk
preferred label: 军事装备 @zh-hans
preferred label: militært materiell @no-nb
definition: Ausrüstung der bewaffneten Streitkräfte @de
definition: Utrustning som används av medlemmar i ett lands väpnade styrkor. @se
definition: Equipment issued to members of the armed forces
definition: Equipamento atribuído a membros das forças armadas. @pt-pt
definition: Udstyr brugt af medlemmer af et lands væbnede styrker. @dk
definition: 发给武装部队成员的装备 @zh-hans
change note: 2025-03-31: Retired. Use military weaponry and equipment (medtop:20000602) instead.
in scheme: Media Topic
created: 2009-10-22T02:00:00+00:00
retired: 2025-03-31T12:00:00+00:00
modified: 2025-03-31T12:00:00+00:00
broader: national security

military weaponry and equipment
type: Concept
preferred label: Militär utrustning @se
preferred label: Waffen @de
preferred label: Armement @fr
preferred label: اسلحة @ar
preferred label: Armas @es
preferred label: armamento militar @pt-pt
preferred label: våben @dk
preferred label: 军事武器 @zh-hans
preferred label: våpenarsenal @no-nb
definition: Die gesamte Waffensammlung eines Landes @de
definition: De vapen och den utrustning som används av en försvarsmakt samt i vapenhandel. @se
definition: The equipment and weapons used by armed forces and the trade of armaments between political entities
definition: Conjunto do armamento militar de um país. @pt-pt
definition: Et lands samling af våben. @dk
definition: 一个国家的武器储备 @zh-hans
in scheme: Media Topic
created: 2009-10-22T02:00:00+00:00
modified: 2025-03-31T12:00:00+00:00
broader: national security

security measures (defence)
type: Concept
preferred label: Säkerhetsåtgärder @se
preferred label: Medidas de seguridad @es
preferred label: Sicherheitsmaßnahme (Verteidigung) @de
preferred label: Mesures de sécurité @fr
preferred label: اجراءات امنية @ar
preferred label: medidas de segurança @pt-pt
preferred label: sikkerhedstiltag (forsvar) @dk
preferred label: 安全措施（国防） @zh-hans
preferred label: sikkerhetstiltak (forsvar) @no-nb
preferred label: security measures (defense)
preferred label: tryggingstiltak (forsvar) @no-nn
definition: Mittel eine Nation, einen Staat, ein Gebäude oder eine Person vor Verletzung und äußeren Eingriffen zu schützen @de
definition: Means of making a nation, a state, a building or a person secure from harm and outside interference.
definition: Medel för att skydda en stat, en byggnad eller en person från skada. @se
definition: Meios para proteger uma nação, um estado, um edifício ou uma pessoa de danos e interferências exteriores. @pt-pt
definition: Midler til at beskytte en stat, bygning eller person mod skade. @dk
definition: 使一个民族、国家、建筑物或个人免受伤害和外来干涉的手段 @zh-hans
change note: 2025-03-31: Retired. Use national security (medtop:20000598) instead.
in scheme: Media Topic
created: 2009-10-22T02:00:00+00:00
retired: 2025-03-31T12:00:00+00:00
modified: 2025-03-31T12:00:00+00:00
broader: national security
narrower: national security

espionage and intelligence
type: Concept
preferred label: Spioneri och underrättelseverksamhet @se
preferred label: تجسس واستخبارات @ar
preferred label: Espionaje e inteligencia @es
preferred label: Espionnage @fr
preferred label: Spionage und Geheimdienst @de
preferred label: espionagem e inteligência @pt-pt
preferred label: spionage- og efterretningsaktivitet @dk
preferred label: 间谍活动和情报 @zh-hans
preferred label: etterretning og spionasje @no-nb
definition: Versteckte Beschaffung von Informationen @de
definition: Hemligt, ibland olagligt, insamlande av information. @se
definition: Covert collection of information
definition: Recolha secreta de informações. @pt-pt
definition: Skjult indsamling af information. @dk
definition: 秘密收集信息 @zh-hans
in scheme: Media Topic
created: 2009-10-22T02:00:00+00:00
modified: 2025-03-31T12:00:00+00:00
broader: national security

veterans' affairs
type: Concept
preferred label: Veteran @de
preferred label: شؤون المحاربين القدامى @ar
preferred label: Veteranos de guerra @es
preferred label: Militära veteraner @se
preferred label: Anciens combattants @fr
preferred label: veteranos @pt-pt
preferred label: veterananliggende @dk
preferred label: 退伍军人事务 @zh-hans
preferred label: forsvarsveteraner @no-nb
preferred label: forsvarsveteranar @no-nn
definition: Saker som rör före detta anställda hos försvarsmakten. @se
definition: Care and provision for those who served in the military
definition: Versorgung und Pensionen für ehemalige Soldaten @de
definition: Cuidado e assistência para antigos combatentes das forças armadas. @pt-pt
definition: Anliggender der vedrører de tidligere ansatte i de væbnede styrker. @dk
definition: 为那些在军队服过役的人提供照顾和给养 @zh-hans
definition: Saker som vedgår personar som har tenestegjort i forsvaret, særleg i stridssituasjonar. @no-nn
definition: Saker som angår personer som har tjenestegjort i forsvaret, særlig i stridssituasjoner. @no-nb
in scheme: Media Topic
created: 2009-10-22T02:00:00+00:00
modified: 2021-05-05T12:00:00+00:00
broader: armed forces

military service
type: Concept
preferred label: Värnplikt @se
preferred label: Militärdienst @de
preferred label: serviço militar @pt-pt
preferred label: værnepligt/militærtjeneste @dk
preferred label: 服兵役 @zh-hans
preferred label: militærtjeneste @no-nb
preferred label: Service militaire @fr
preferred label: Servicio militar @es
preferred label: خدمة عسكرية @ar
preferred label: militærteneste @no-nn
definition: Service by an individual in an army or militia. Service may be on a volunteer basis or a result of an involuntary draft or government requirement.
definition: Verpflichtender Dienst beim nationalen Militär für eine begrenzte Zeit @de
definition: Medborgares skyldighet att utbilda sig för att delta i sitt lands militära försvar. @se
definition: Serviço obrigatório nas forças militares nacionais por um período limitado de tempo. @pt-pt
definition: Obligatorisk tjeneste for borgerne ved det nationale militær i en begrænset periode. @dk
definition: 在国家军队强制服役一段有限的时间 @zh-hans
in scheme: Media Topic
created: 2012-10-04T12:00:00+00:00
modified: 2021-07-12T12:00:00+00:00
broader: armed forces

national security
type: Concept
preferred label: Nationale Sicherheit @de
preferred label: Sécurité nationale @fr
preferred label: امن قومي @ar
preferred label: Nationell säkerhet @se
preferred label: Seguridad nacional @es
preferred label: segurança nacional @pt-pt
preferred label: national sikkerhed @dk
preferred label: 国家安全 @zh-hans
preferred label: rikets sikkerhet @no-nb
preferred label: rikets sikkerheit @no-nn
definition: Arbetet med att säkra en stat och dess gränser samt att upprätthålla medborgarnas välmående. @se
definition: The philosophy of securing a nation and its borders, as well as the well-being of its citizens
definition: Die Sicherheitsvorstellungen ein Land und seine Grenzen zu schützen, genauso wie das Wohlergehen der Bürger @de
definition: Filosofia de proteger o país, as suas fronteiras e o bem-estar dos seus cidadãos. @pt-pt
definition: Filosofia de proteger o país, suas fronteiras e o bem-estar de seus cidadãos. @pt-br
definition: Arbejdet med at sikre en stat og dens grænser mod udefra- og indefrakommende trusler og bevare borgernes trivsel. @dk
definition: 保障一个国家及其边界以及公民幸福的理念 @zh-hans
change note: 2025-03-31: Retired. Use national security (medtop:20000598) instead.
in scheme: Media Topic
created: 2009-10-22T02:00:00+00:00
retired: 2025-03-31T12:00:00+00:00
modified: 2025-03-31T12:00:00+00:00
broader: security measures (defence)

public finance
type: Concept
preferred label: Offentliga finanser @se
preferred label: Finances publiques @fr
preferred label: Finanzas públicas @es
preferred label: مالية عامة @ar
preferred label: Öffentliche Gelder @de
preferred label: finanças públicas @pt-pt
preferred label: offentlige finanser @dk
preferred label: 公共财政 @zh-hans
preferred label: offentlige midler @no-nb
preferred label: offentlege middel @no-nn
definition: The money of government used for paying for public programmes and services and public debt
definition: Regierungsgelder, die für öffentliche Programme, Dienstleistungen und öffentliche Schulden ausgegeben werden @de
definition: De pengar som används av staten för att betala statliga program och åtgärder samt statsskulden. @se
definition: Dinheiro que o governo usa para financiar programas e serviços públicos e pagar a dívida pública. @pt-pt
definition: De offentlige finanser er en samlet betegnelse for den offentlige sektors indtægter og udgifter. @dk
definition: 政府用于支付公共项目、服务和公共债务的资金 @zh-hans
definition: The money of government used for paying for public programs and services and public debt
change note: 2025-03-31: Retired. Use government budget (medtop:20000607) or government debt (medtop:20000368) instead.
in scheme: Media Topic
created: 2009-10-22T02:00:00+00:00
retired: 2025-03-31T12:00:00+00:00
modified: 2025-03-31T12:00:00+00:00
broader: government budget

lower house (legislature)
type: Concept
preferred label: مجلس النواب @ar
preferred label: Cámara baja @es
preferred label: Chambre basse @fr
preferred label: Unterhaus @de
preferred label: Andra kammaren @se
preferred label: câmara baixa (legislatura) @pt-pt
preferred label: nedre hus (parlament) @dk
preferred label: 下议院（议会） @zh-hans
preferred label: underhus @no-nb
definition: Untere Kammer der Legislative. @de
definition: Lower chamber of a legislative body, such as the US House of Representatives or UK House of Commons
definition: Den direktvalda delen av ett parlament. @se
definition: Câmara inferior de um órgão legislativo, como a Câmara dos Deputados do Brasil, a Câmara dos Representantes dos EUA ou a Câmara dos Comuns do Reino Unido. @pt-pt
definition: Den direkte valgte del af et parlament. @dk
definition: 立法机构的下议院 @zh-hans
editorial note: Note to translators: the examples in the English definition should be converted to relevant examples in countries which speak the target language.
in scheme: Media Topic
created: 2009-10-22T02:00:00+00:00
modified: 2021-02-18T12:00:00+00:00
broader: legislative body

upper house (legislature)
type: Concept
preferred label: Första kammaren @se
preferred label: مجلس الشيوخ @ar
preferred label: Oberhaus @de
preferred label: Chambre haute @fr
preferred label: Cámara alta @es
preferred label: câmara alta (legislatura) @pt-pt
preferred label: øverste hus (parlament) @dk
preferred label: 上议院（议会） @zh-hans
preferred label: overhus @no-nb
definition: Obere Kammer der Legislative. @de
definition: Den indirekt valda delen av ett parlament. @se
definition: Senior chamber of a legislative body, such as the US Senate or UK House of Lords
definition: Câmara superior de um órgão legislativo, como o Senado Federal do Brasil, o Senado dos EUA ou a Câmara dos Lordes do Reino Unido. @pt-pt
definition: Den indirekte valgte del af et parlament. @dk
definition: 立法机构的高级议院 @zh-hans
editorial note: Note to translators: the examples in the English definition should be converted to relevant examples in countries which speak the target language.
in scheme: Media Topic
created: 2009-10-22T02:00:00+00:00
modified: 2021-02-18T12:00:00+00:00
broader: legislative body

safety of citizens
type: Concept
preferred label: Seguridad ciudadana @es
preferred label: Sécurité publique @fr
preferred label: Medborgerlig säkerhet @se
preferred label: امن عام @ar
preferred label: Innere Sicherheit @de
preferred label: segurança dos cidadãos @pt-pt
preferred label: borgeres sikkerhed @dk
preferred label: 公民安全 @zh-hans
preferred label: samfunnssikkerhet @no-nb
preferred label: samfunnstryggleik @no-nn
definition: Regierungspolitik, die das Wohlergehen der Bürger schützt @de
definition: Politik som syftar till att skydda medborgarna. @se
definition: Government policies to protect the well-being of its citizens
definition: Políticas do governo para proteger o bem-estar dos seus cidadãos. @pt-pt
definition: Políticas do governo para proteger o bem-estar de seus cidadãos. @pt-br
definition: Politikker, der sigter mod at beskytte borgerne. @dk
definition: 保护公民福祉的政府政策 @zh-hans
change note: Retired. Use other terms such as public health (medtop:20001358) or emergency response (medtop:20000168) instead.
in scheme: Media Topic
created: 2009-10-22T02:00:00+00:00
retired: 2025-03-31T12:00:00+00:00
modified: 2025-03-31T12:00:00+00:00
broader: government policy

taxation policy
type: Concept
preferred label: Skattepolitik @se
preferred label: Fiscalité @fr
preferred label: Impuestos @es
preferred label: Steuern @de
preferred label: فرض ضرائب @ar
preferred label: impostos @pt-pt
preferred label: skattepolitik @dk
preferred label: 税收 @zh-hans
preferred label: skattepolitikk @no-nb
definition: Politiska program för beskattning av medborgare, företag och organisationer. @se
definition: Abgabe zur Finanzierung von Staatsausgaben @de
definition: Government programmes and policies around the taxation of citizens and entities
definition: Taxa imposta às pessoas físicas e jurídicas de um Estado, via coerção legislativa, para custear despesas do governo. @pt-pt
definition: Politik, der vedrører opkrævning af skatter og afgifter til bl.a. finansiering af offentlige udgifter. @dk
definition: 为资助政府开支而征收的税款 @zh-hans
definition: Government programs and policies around the taxation of citizens and entities
in scheme: Media Topic
created: 2009-10-22T02:00:00+00:00
modified: 2025-03-31T12:00:00+00:00
broader: government policy
broad match: http://cv.iptc.org/newscodes/subjectcode/11013000

interior policy
type: Concept
preferred label: Politique Intérieure @fr
preferred label: سياسة داخلية @ar
preferred label: Innenpolitik @de
preferred label: Políticas internas @es
preferred label: Inrikespolitik @se
preferred label: política interna @pt-pt
preferred label: indenrigspolitik @dk
preferred label: 国内政策 @zh-hans
preferred label: innenrikspolitikk @no-nb
preferred label: innanrikspolitikk @no-nn
definition: Government policies affecting internal affairs
definition: Politisk verksamhet som gäller de inre förhållandena i det egna landet. @se
definition: Regierungspolitik bezogen auf die inneren Angelegenheiten eines Landes. @de
definition: Políticas governamentais que afetam assuntos internos. @pt-pt
definition: Politik der vedrører et lands interne anliggender. @dk
definition: 影响内部事务的政府政策 @zh-hans
change note: Retired. Use more specific terms instead.
in scheme: Media Topic
created: 2009-10-22T02:00:00+00:00
retired: 2025-03-31T12:00:00+00:00
modified: 2025-03-31T12:00:00+00:00
broader: government policy

data protection policy
type: Concept
preferred label: Datasäkerhetspolitik @se
preferred label: حماية معلومات @ar
preferred label: Protección de datos @es
preferred label: Confidentialité des données @fr
preferred label: Datenschutz @de
preferred label: política de proteção de dados @pt-pt
preferred label: IT-sikkerhedspolitik @dk
preferred label: 数据保护政策 @zh-hans
preferred label: datasikkerhetspolicy @no-nb
preferred label: datatryggleiks-policy @no-nn
definition: Bemühungen, persönliche Informationen in geschriebener, gesprochener oder elektronischer Form zu schützen @de
definition: Politiska program för att skydda personuppgifter i skriftlig, muntlig eller elektronisk form och föreskrifter kring vilka personuppgifter som kan samlas in av företag, myndigheter eller andra. @se
definition: Efforts to protect personal information in written, oral or electronic form and regulations around what personal information can be collected by the government or other entities
definition: Esforços para proteger dados pessoais sob forma escrita, oral ou eletrónica. @pt-pt
definition: Esforços para proteger dados pessoais sob forma escrita, oral ou eletrônica. @pt-br
definition: Politikker, der sigter mod at beskytte data i it-systemer. @dk
definition: 保护书面、口头或电子形式的个人资料 @zh-hans
in scheme: Media Topic
created: 2009-10-22T02:00:00+00:00
modified: 2025-03-31T12:00:00+00:00
broader: government policy

housing and urban planning policy
type: Concept
preferred label: Wohnungs- und Städtebaupolitik @de
preferred label: Vivienda y planificación urbana @es
preferred label: Urbanisme @fr
preferred label: Bostadspolitik och stadsplanering @se
preferred label: تخطيط الاسكان والمدن @ar
preferred label: política de habitação e urbanismo @pt-pt
preferred label: bolig- og byplanlægningspolitik @dk
preferred label: 住房和城市规划 @zh-hans
preferred label: by- og boligplanlegging @no-nb
preferred label: by- og bustadplanlegging @no-nn
definition: Systematiskt planerande av städer och förorter och byggandet av hus i dessa. @se
definition: Systematic planning of urban and suburban areas and the housing within those areas
definition: Systematisches Planen von städtischen und vorstädtischen Gebieten und deren Bebauung @de
definition: Planeamento sistemático de áreas urbanas e suburbanas e da habitação dentro dessas áreas. @pt-pt
definition: Planejamento sistemático de áreas urbanas e suburbanas e da habitação dentro dessas áreas. @pt-br
definition: Systematisk planlægning af by- og forstadsområder og boliger inden for disse områder. @dk
definition: 系统规划的城市和郊区及其范围内的住房 @zh-hans
in scheme: Media Topic
created: 2009-10-22T02:00:00+00:00
modified: 2025-03-31T12:00:00+00:00
broader: government policy

policy towards indigenous people
type: Concept
preferred label: Politik gegenüber indigener Bevölkerung @de
preferred label: Autochtones @fr
preferred label: سكان اصليون @ar
preferred label: Minoritetspolitik @se
preferred label: Indígenas @es
preferred label: política para os povos indígenas @pt-pt
preferred label: politik for indfødte @dk
preferred label: 对原住民政策 @zh-hans
preferred label: urfolkspolitikk @no-nb
definition: Politik einer Regierung in Bezug auf die indigene Bevölkerung @de
definition: Government progams and policies toward indigenous peoples, such as land allocation, rights protection and financial support
definition: Politiska program som påverkar statens förhållande till nationella minoriteter och urfolk såsom språk, rätt till landområden och ekonomiskt stöd. @se
definition: Políticas governamentais relativas a povos indígenas. @pt-pt
definition: Politikker, der påvirker statens forhold til nationale mindretal. @dk
definition: 政府对原住民的政策 @zh-hans
in scheme: Media Topic
created: 2009-10-22T02:00:00+00:00
modified: 2025-03-31T12:00:00+00:00
broader: government policy

pension and welfare policy
type: Concept
preferred label: Pensiones y asistencia social @es
preferred label: Assistance sociale @fr
preferred label: رواتب تقاعد ومعونات اجتماعية @ar
preferred label: Social välfärd @se
preferred label: Sozialpolitik @de
preferred label: política de pensões e benefícios sociais @pt-pt
preferred label: pensions- og velfærdspolitik @dk
preferred label: 养老金和福利政策 @zh-hans
preferred label: velferds- og sosialpolitikk @no-nb
definition: Politiska program för ekonomiskt stöd till medborgarna genom som arbetslöshetsersättningar, pensioner och ekonomiskt stöd till de fattiga. @se
definition: Government policies supporting citizens financially through programs such as unemployment payments, pensions and financial support for the poor
definition: Politik der Regierung das Wohlbefinden der Bürger zu unterstützen durch Arbeitslosengeld, Sozialhilfe und vergleichbare Zahlungen. @de
definition: Políticas governamentais que afetam o bem-estar dos cidadãos através de subsídios de desemprego, pensões e outros pagamentos similares. @pt-pt
definition: Políticas governamentais que afetam o bem-estar dos cidadãos através de seguros-desemprego, pensões e outros pagamentos similares. @pt-br
definition: Politik, der påvirker borgernes velbefindende, såsom arbejdsløshedsunderstøttelse, folkepension og lignende. @dk
definition: 通过失业救济金、国家养老金和其他类似款项影响公民福利的政府政策 @zh-hans
in scheme: Media Topic
created: 2009-10-22T02:00:00+00:00
modified: 2025-03-31T12:00:00+00:00
broader: government policy

personal data collection policy
type: Concept
preferred label: Persondatalagstiftning @se
preferred label: Datos personales @es
preferred label: Volkszählung @de
preferred label: جمع معلومات شخصية @ar
preferred label: Données personnelles @fr
preferred label: política de recolha de dados pessoais @pt-pt
preferred label: politik for personlig dataindsamling @dk
preferred label: 个人数据收集政策 @zh-hans
preferred label: personvernpolicy @no-nb
preferred label: personvern-policy @no-nn
definition: Bestämmelser som reglerar skydd för behandling av personuppgifter samt det fria flödet av sådana uppgifter. @se
definition: Datensammlung über Einzelpersonen durch die Regierung und andere Behörden @de
definition: The collection, by government or other entities of information on individuals
definition: Recolha de informação sobre indivíduos, por parte do governo ou de outras entidades. @pt-pt
definition: Bestemmelser om beskyttelse af behandling af personoplysninger herunder den frie strøm af sådanne data. @dk
definition: 由政府或其他实体收集有关个人的信息 @zh-hans
change note: Retired. Use data protection policy (medtop:20000627) instead.
in scheme: Media Topic
created: 2009-10-22T02:00:00+00:00
retired: 2025-03-31T12:00:00+00:00
modified: 2025-03-31T12:00:00+00:00
broader: government policy

personal weapon control policy
type: Concept
preferred label: مراقبة الاسلحة الفردية @ar
preferred label: Contrôle des armes personnelles @fr
preferred label: Waffenkontrolle @de
preferred label: Vapenlagstiftning @se
preferred label: Control de armas personales @es
preferred label: política de controlo de armas pessoais @pt-pt
preferred label: controle de armas pessoais @pt-br
preferred label: våbenlovgivning @dk
preferred label: 私人武器控制政策 @zh-hans
preferred label: våpenpolitikk @no-nb
definition: Kontrolle der Regierung über den persönlichen Besitz von Gewehren und anderen Waffen, umfasst die Kontrolle von Sportwaffen über Lizenzen und andere Mittel @de
definition: Government policies and regulations around the personal ownership of firearms and other weapons
definition: Bestämmelser som reglerar innehav av vapen och ammunition. @se
definition: Controlo governamental da posse de armas de fogo e de outras armas ofensivas, incluindo controlo de armas usadas em desportos, através de licenças e outros meios. @pt-pt
definition: Controle governamental da posse de armas de fogo e de outras armas ofensivas, incluindo controle de armas usadas em esportes, através de licenças e outros meios. @pt-br
definition: Bestemmelser om besiddelse af våben og ammunition. @dk
definition: 政府对个人拥有火器和其他进攻性武器的管制，包括通过许可证和其他手段管制用于体育运动的武器 @zh-hans
in scheme: Media Topic
created: 2009-10-22T02:00:00+00:00
modified: 2025-03-31T12:00:00+00:00
broader: government policy

planning inquiries
type: Concept
preferred label: Planfeststellungsverfahren @de
preferred label: برامج مسح @ar
preferred label: Estudio de utilidad pública @es
preferred label: Byggprojektering @se
preferred label: Enquête d'utilité publique @fr
preferred label: consultas públicas @pt-pt
preferred label: bygge- og anlægshøring @dk
preferred label: 规划咨询 @zh-hans
preferred label: offentlig høring @no-nb
preferred label: offentleg høyring @no-nn
definition: Öffentliche Anhörungen oder Planverfahren über beabsichtigte Bauvorhaben, wie z.B. der Bau eines Wasserkraftwerkes in einem Nationalpark @de
definition: Public hearings or planning inquiries on proposed constructions, e.g. Construction of water driven power station in a National Park.
definition: Tekniska samråd om föreslagna byggnadskonstruktioner. @se
definition: Audiências públicas ou consultas de planeamento sobre propostas de obras públicas, como a construção de uma central elétrica num parque nacional. @pt-pt
definition: Audiências públicas ou consultas de planejamento sobre propostas de obras públicas, como a construção de uma central elétrica em um parque nacional. @pt-br
definition: Teknisk høring om foreslåede bygningsstrukturer. @dk
definition: 就拟建工程的公众聆讯或规划查询，例如在国家公园兴建水力发电站 @zh-hans
change note: Retired. Use zoning policy (medtop:20001383), environmental policy (medtop:20000423) or other more specific terms instead.
in scheme: Media Topic
created: 2009-10-22T02:00:00+00:00
retired: 2025-03-31T12:00:00+00:00
modified: 2025-03-31T12:00:00+00:00
broader: government policy

immigration policy
type: Concept
preferred label: هجرة @ar
preferred label: Migrations @fr
preferred label: Migración @es
preferred label: Migrationspolitik @se
preferred label: Migration @de
preferred label: política de migração @pt-pt
preferred label: migration @dk
preferred label: 人口迁移 @zh-hans
preferred label: innvandringspolitikk @no-nb
definition: Politiska program för in- och utvandring i ett land såsom begränsningar, deportation och integrationsprogram. @se
definition: Policies around immigration into a country such as who may immigrate to a country, how many people are allowed in each year, deportation of illegal immigrants and integration programmes that help new immigrants assimilate to a country's culture
definition: Bewegung einer Gemeinschaft von Menschen von einem Ort zu einem anderen @de
definition: Deslocação de uma comunidade de pessoas de um lugar para outro. @pt-pt
definition: Politik vedrørende modtagelse af mennesker fra andre lande. @dk
definition: 一群人从一个地方到另一个地方的移动 @zh-hans
definition: Policies around immigration into a country such as who may immigrate to a country, how many people are allowed in each year, deportation of illegal immigrants and integration programs that help new immigrants assimilate to a country's culture
in scheme: Media Topic
created: 2009-10-22T02:00:00+00:00
modified: 2025-03-31T12:00:00+00:00
broader: government policy

nuclear policy
type: Concept
preferred label: Kärnkraftspolitik @se
preferred label: Politique Nucléaire @fr
preferred label: سياسة نووية @ar
preferred label: Atompolitik @de
preferred label: Políticas nucleares @es
preferred label: política nuclear @pt-pt
preferred label: atompolitik @dk
preferred label: 核政策 @zh-hans
preferred label: atompolitikk @no-nb
definition: Politik der Regierung in Bezug auf die Nutzung von nuklearer Energie- oder Waffenproduktion @de
definition: Politik som styr användandet av kärnkraft som energikälla eller som del av en vapenarsenal. @se
definition: Government policies around the production of use of nuclear power and weapons
definition: Políticas governamentais relativas ao uso de energia nuclear para a produção de energia ou de armas. @pt-pt
definition: Politikker, der vedrører kernekraft som energikilde eller som del af et våbenarsenal. @dk
definition: 政府关于将核燃料用于发电或武器的政策 @zh-hans
in scheme: Media Topic
created: 2009-10-22T02:00:00+00:00
modified: 2025-03-31T12:00:00+00:00
broader: government policy

regulation of industry
type: Concept
preferred label: Regulierungsbehörde @de
preferred label: سياسة تنظيمية وتنظيم @ar
preferred label: Mediador @es
preferred label: Branschlagstiftning @se
preferred label: Médiateur @fr
preferred label: autoridades reguladoras @pt-pt
preferred label: regulering af industri @dk
preferred label: 行业规制 @zh-hans
preferred label: næringspolitikk @no-nb
definition: Government regulation dictating how companies operate
definition: Die Regeln und ausführenden Organe, national und international, die Interessenskonflikte regulieren und für gute Praktizierbarkeit sorgen @de
definition: Regler och organisationer, både nationella och internationella, som används för att lösa intressekonflikter och skapa bra regleringar inom en del av näringslivet. @se
definition: Normas e entidades, nacionais e internacionais, que regem os conflitos de interesse e as regulações de boas práticas. @pt-pt
definition: Regler og organisationer, både nationale og internationale, der bruges til at løse interessekonflikter og skabe gode regler i en del af erhvervslivet. @dk
definition: 管理利益冲突和良好做法规则的国家和国际规则及机构 @zh-hans
in scheme: Media Topic
created: 2009-10-22T02:00:00+00:00
modified: 2025-03-31T12:00:00+00:00
broader: government policy
narrower: food and drink regulations

cultural policy
type: Concept
preferred label: Kulturpolitik @se
preferred label: política cultural @pt-pt
preferred label: kulturpolitik @dk
preferred label: 文化政策 @zh-hans
preferred label: kulturpolitikk @no-nb
preferred label: Politique culturelle @fr
preferred label: Política cultural @es
preferred label: سياسة ثقافية @ar
definition: Government policies related to the promotion and support of the arts
definition: Politik einer Regierung kulturelle Themen betreffend @de
definition: Politiska program för kulturlivet. @se
definition: Políticas governamentais relativas a assuntos culturais. @pt-pt
definition: Politik, der påvirker kulturlivet. @dk
definition: 影响文化事务的政府政策 @zh-hans
in scheme: Media Topic
created: 2012-10-04T12:00:00+00:00
modified: 2025-03-31T12:00:00+00:00
broader: government policy

integration policy
type: Concept
preferred label: Integrationspolitik @se
preferred label: Integration @de
preferred label: política de integração @pt-pt
preferred label: integrationspolitik @dk
preferred label: 移民融合政策 @zh-hans
preferred label: integreringspolitikk @no-nb
preferred label: Politique d'intégration @fr
preferred label: Política de integración @es
preferred label: سياسة دمج @ar
definition: Improving the co-existence of groups of the society
definition: Verbesserung des Gemeinsamen von Gruppen der Gesellschaft @de
definition: Politik som syftar till lika rättigheter och möjligheter för alla, oavsett etnisk eller kulturell bakgrund, en samhällsgemenskap med samhällets mångfald som grund samt en samhällsutveckling präglad av ömsesidig respekt och tolerans. @se
definition: Políticas para melhorar a coexistência de grupos da sociedade. @pt-pt
definition: Politik om indvandring og integration, herunder hvordan man sikrer at nye medborgere finder sig til rette i samfundet. @dk
definition: 促进社会各群体的共存 @zh-hans
change note: Retired. Use medtop:20000634 immigration policy instead.
in scheme: Media Topic
created: 2012-10-04T12:00:00+00:00
retired: 2025-03-31T12:00:00+00:00
modified: 2025-03-31T12:00:00+00:00
broader: government policy

sports policies
type: Concept
preferred label: Idrottspolitik @se
preferred label: Sportpolitik @de
preferred label: políticas desportivas @pt-pt
preferred label: políticas esportivas @pt-br
preferred label: Idrætspolitik @dk
preferred label: 体育政策 @zh-hans
preferred label: idrettspolitikk @no-nb
preferred label: Politique sportive @fr
preferred label: Política deportiva @es
preferred label: سياسة رياضية @ar
definition: Politik einer Regierung sportliche Themen betreffend @de
definition: Government policies regulating sports, including sports betting, performance enhancing drug laws and the promition of sports to children for health purposes
definition: Politik som påverkar idrotten. @se
definition: Políticas governamentais relativas ao desporto. @pt-pt
definition: Políticas governamentais relativas ao esporte. @pt-br
definition: Politik, der påvirker sport. @dk
definition: 影响体育的政府政策 @zh-hans
in scheme: Media Topic
created: 2012-10-04T12:00:00+00:00
modified: 2025-03-31T12:00:00+00:00
broader: government policy

regional development policy
type: Concept
preferred label: Regionalpolitik @se
preferred label: política de desenvolvimento regional @pt-pt
preferred label: regional udviklingspolitik @dk
preferred label: 区域发展政策 @zh-hans
preferred label: distriktspolitikk @no-nb
preferred label: regionale Entwicklungspolitik @de
preferred label: Politique d'aménagement du territoire @fr
preferred label: Política de desarrollo regional @es
preferred label: سياسة التنمية الاقليمية @ar
definition: Government or private policies, such as business incentives, aimed at the development of a region
definition: Politik som syftar till att trygga likvärdiga förutsättningar för samhällsutvecklingen i olika delar av ett land. @se
definition: Ações públicas ou privadas realizadas com o objetivo de desenvolver uma região. @pt-pt
definition: Politikker, der sigter mod at sikre lige vilkår for udviklingen af samfundet i forskellige dele af et land. @dk
definition: 为发展某一地区而采取的公共或私人行动 @zh-hans
definition: Öffentliche oder private Aktionen, die zur Entwicklung einer Region durchgeführt werden. @de
in scheme: Media Topic
created: 2016-04-04T12:00:00+00:00
modified: 2025-03-31T12:00:00+00:00
broader: government policy

infrastructure policy
type: Concept
preferred label: infrastrukturpolitik @dk
preferred label: samferdselspolitikk @no-nb
preferred label: política de infraestruturas @pt-br
preferred label: Infrastrukturpolitik @se
preferred label: 基础设施政策 @zh-hans
preferred label: Politique d'infrastructure @fr
preferred label: Política de infraestructura @es
preferred label: سياسة البنى التحتية @ar
definition: Politik, der fastlægger retningen for nybyggeri og vedligeholdelse af grundlæggende faciliteter som veje og kommunikation. @dk
definition: Policies regarding the development and maintenance of the fundamental facilities of a country, city or other area, such as communication, transportation and distribution networks
definition: Políticas relativas ao desenvolvimento e manutenção das instalações fundamentais de um país, cidade ou outra área que possibilitam a atividade comercial, como redes de comunicação, de transporte e de distribuição. @pt-br
definition: Politiska program för att utveckla och underhålla kommunikationer, transporter, distributionsnät och annan infrastruktur i samhället. @se
definition: 有关国家、城市或其他地区的基础设施的开发和维护的政策，这些基础设施使商业活动成为可能，例如通讯、交通运输和销售网络 @zh-hans
definition: Politik in Bezug auf die Entwicklung und Instandhaltung der grundlegenden Einrichtungen eines Landes, einer Stadt oder eines anderen Gebiets, die eine Geschäftstätigkeit ermöglichen, wie Kommunikations-, Transport- und Vertriebsnetze @de
in scheme: Media Topic
created: 2019-09-05T12:00:00+00:00
modified: 2025-03-31T12:00:00+00:00
broader: government policy

local government policy
type: Concept
preferred label: lokalt selvstyre @dk
preferred label: lokalpolitikk @no-nb
preferred label: política de governo local @pt-br
preferred label: Lokalpolitik @se
preferred label: 地方政府政策 @zh-hans
preferred label: Kommunalpolitik @de
preferred label: Politique de gouvernement local @fr
preferred label: Política de gobierno local @es
preferred label: سياسة الحكومة المحلية @ar
definition: Politik, der uddelegerer beslutningskompetence til politiske enheder på lokalt niveau. @dk
definition: Policies for the development and maintenance of a local government area
definition: Políticas para o desenvolvimento e manutenção de uma área do governo local. @pt-br
definition: Politiska frågor som handlar om ett visst område, ofta en del av ett land. @se
definition: 地方政府管辖区域内发展和管理的政策 @zh-hans
definition: Politik für die Entwicklung und Erhaltung eines lokalen Regierungsgebiets @de
in scheme: Media Topic
created: 2019-09-05T12:00:00+00:00
modified: 2021-07-12T12:00:00+00:00
broader: government policy

education policy
type: Concept
preferred label: utdanningspolitikk @no-nb
preferred label: Utbildningspolitik @se
preferred label: Política educativa @es
preferred label: Politique de l'éducation @fr
preferred label: سياسة تعليمية @ar
preferred label: Bildungspolitik @de
definition: Government programmes and policies related to education, such as the funding of schools and standardised testing
definition: Government programmes and policies related to education, such as the funding of schools and standardized testing
definition: Politiska program för utbildning och som berör skolväsendet. @se
definition: Regierungsprogramme und bildungspolitische Maßnahmen sowie Vorschläge zur Änderung oder Proteste gegen diese Positionen @de
change note: Moved from medtop:05000000 to medtop:20000621
in scheme: Media Topic
created: 2021-12-17T12:00:00+00:00
modified: 2025-03-31T12:00:00+00:00
broader: government policy

zoning policy
type: Concept
preferred label: reguleringsplan @no-nb
preferred label: Flächennutzungsplan @de
definition: Polices around the division of land into zones, each of which has a set of regulations for new development
definition: Richtlinien zur Aufteilung von Land in Zonen, für die jeweils bestimmte Vorschriften für neue Bauvorhaben gelten. @de
in scheme: Media Topic
created: 2025-03-31T12:00:00+00:00
modified: 2025-03-31T12:00:00+00:00
broader: government policy

food and drink regulations
type: Concept
preferred label: Lebensmittelkontrolle @de
preferred label: Reglamento sobre alimentos y bebidas @es
preferred label: Règlement sur les aliments et les boissons @fr
preferred label: قوانين الغذاء والمشروبات @ar
preferred label: Livsmedelspolitik @se
preferred label: regulamentação sobre alimentos e bebidas @pt-pt
preferred label: fødevarepolitik @dk
preferred label: 食品和饮料法规 @zh-hans
preferred label: næringsmiddelpolitikk @no-nb
preferred label: matvarepolitikk @no-nn
definition: Government policies relating to the production and selling of food and drink, including ensuring food safety
definition: Politiska program för produktion och försäljning av mat och dryck, inklusive livsmedelssäkerhet. @se
definition: Regierungspolitik bezogen auf Lebensmittel und Getränke @de
definition: Políticas governamentais relativas a alimentos e bebidas. @pt-pt
definition: Politik, der påvirker mad og drikke. @dk
definition: 与食品和饮料有关的政府政策 @zh-hans
in scheme: Media Topic
created: 2009-10-22T02:00:00+00:00
modified: 2025-03-31T12:00:00+00:00
broader: regulation of industry
broad match: http://cv.iptc.org/newscodes/subjectcode/11022000

diplomacy
type: Concept
preferred label: Diplomatie @fr
preferred label: Diplomacia @es
preferred label: دبلوماسية @ar
preferred label: Diplomati @se
preferred label: diplomacia @pt-pt
preferred label: diplomati @dk
preferred label: 外交 @zh-hans
definition: Anwendung sprachlicher oder schreibender Fähigkeiten, um andere von den eigenen Standpunkten zu überzeugen @de
definition: Förhandlingar mellan representanter för nationer eller grupper av nationer och de diplomater som är involverade i samtalen. @se
definition: Negotiations between representatives of nations or groups of nations and the diplomats who are involved in the talks
definition: Uso das capacidades orais e de escrita para persuadir outros ao seu ponto de vista. @pt-pt
definition: Aktiviteter i forbindelse med mellemstatslige politiske forbindelser. @dk
definition: 运用口头和书面技巧来说服别人接受你的观点 @zh-hans
in scheme: Media Topic
created: 2009-10-22T02:00:00+00:00
modified: 2025-03-31T12:00:00+00:00
broader: international relations
narrower: summit meeting
narrower: treaty

economic sanction
type: Concept
preferred label: Wirtschaftliche Sanktion @de
preferred label: Ekonomiska sanktioner @se
preferred label: Sanción económica @es
preferred label: عقوبات اقتصادية @ar
preferred label: Sanction économique @fr
preferred label: sanções económicas @pt-pt
preferred label: sanções econômicas @pt-br
preferred label: økonomisk sanktion @dk
preferred label: 经济制裁 @zh-hans
preferred label: økonomiske sanksjoner @no-nb
preferred label: økonomiske sanksjonar @no-nn
definition: Strafende Handlungen eines Staates gegen einen anderen, Handelseinschränkungen, Embargos etc. beinhaltend @de
definition: Ekonomiska åtgärder som vidtagits av ett land eller en mellanstatlig organisation mot en annan stat eller organisation, såsom handelsrestriktioner och embargon. @se
definition: Economic measures taken by one country or intergovernmental agency against another such as trade restrictions and embargoes
definition: Ações punitivas tomadas por um país contra outro, incluindo restrições comerciais, embargos, etc. @pt-pt
definition: Ações punitivas tomadas por um país contra outro, incluindo restrições comerciais, embargos etc. @pt-br
definition: En stats eller international organisations afbrydelse af økonomiske forbindelser med en anden stat for at nå politiske mål eller håndhæve regler. @dk
definition: 一国对另一国采取的惩罚性行动，包括贸易限制、禁运等 @zh-hans
in scheme: Media Topic
created: 2009-10-22T02:00:00+00:00
modified: 2025-03-31T12:00:00+00:00
broader: international relations

foreign aid
type: Concept
preferred label: Auslandshilfe @de
preferred label: Utlandsbistånd @se
preferred label: Aide internationale @fr
preferred label: Ayuda internacional @es
preferred label: مساعدات اجنبية @ar
preferred label: ajuda externa @pt-pt
preferred label: udviklingsbistand @dk
preferred label: 对外援助 @zh-hans
preferred label: bistand @no-nb
definition: Stöd från en nation till en annan för ändamål som katastrof, allmän ekonomisk utveckling eller diplomati. @se
definition: Support from one nation to another for purposes such as disaster, general economic development or diplomacy
definition: Hilfe, die ein Land einem anderen gewährt @de
definition: Auxílio prestado por uma nação a outra. @pt-pt
definition: Hjælp fra én stat til en anden. @dk
definition: 一个国家向另一个国家提供的帮助 @zh-hans
in scheme: Media Topic
created: 2009-10-22T02:00:00+00:00
modified: 2025-03-31T12:00:00+00:00
broader: international relations

international organisation
type: Concept
preferred label: معاهدات ومنظمات دولية @ar
preferred label: Internationella organisation @se
preferred label: Internationale Organisation @de
preferred label: Organisation internationale @fr
preferred label: Organización internacional @es
preferred label: organizações internacionais @pt-pt
preferred label: 国际组织 @zh-hans
preferred label: internasjonal organisasjon @no-nb
preferred label: international organization
definition: Organisation with members and functions that cross international borders
definition: Organisation med medlemmar och verksamhet som går över internationella gränser. @se
definition: Beinhaltet Organisationen mit Mitgliedern und Aufgaben, die internationale Grenzen überschreiten, können auch zwischenstaatliche Organisationen und Organisationen von unabhängigen Staaten beinhalten @de
definition: Inclui organizações com membros e funções que atravessam fronteiras internacionais e pode incluir organizações intergovernamentais de nações soberanas. @pt-pt
definition: Organisationer med medlemmer og funktioner, der krydser internationale grænser, kan omfatte mellemstatslige organisationer. @dk
definition: 包括成员和职能跨越国际边界的组织，也可能包括主权国家的政府间组织 @zh-hans
definition: Organization with members and functions that cross international borders
in scheme: Media Topic
created: 2009-10-22T02:00:00+00:00
modified: 2025-03-31T12:00:00+00:00
broader: international relations

refugees and internally displaced people
type: Concept
preferred label: Réfugiés @fr
preferred label: Flykting @se
preferred label: لاجئون @ar
preferred label: Flüchtling @de
preferred label: Refugiados @es
preferred label: refugiados e deslocados @pt-pt
preferred label: flygtning og internt fordrevet @dk
preferred label: 难民和流离失所者 @zh-hans
preferred label: flyktninger @no-nb
preferred label: flyktning @no-nn
definition: Den som söker skydd eller asyl i ett annat land på grund av viss rädsla för förföljelse, konflikt eller naturkatastrof i sitt eget hemland. @se
definition: People seeking shelter or asylum in another region because of some fear of persecution, conflict, or natural disaster in their own region
definition: Eine in einem anderen Land schutzsuchende Person, die Angst vor Verfolgung durch das eigene Land hat @de
definition: Pessoa que procura abrigo noutro país por medo de perseguição no seu próprio país. @pt-pt
definition: Pessoa que procura abrigo em outro país por medo de perseguição em seu próprio país. @pt-br
definition: En person, der undgik enhver fare, især fare for liv, frihed og mere i sit hjemland på grund af race, religion, nationalitet, tilhørende en bestemt social gruppe eller politisk mening. @dk
definition: 因为害怕在自己的国家受到迫害而到另一个国家寻求庇护的人 @zh-hans
in scheme: Media Topic
created: 2009-10-22T02:00:00+00:00
modified: 2025-03-31T12:00:00+00:00
broader: international relations

border dispute
type: Concept
preferred label: grensekonflikter @no-nb
preferred label: Gränskonflikt @se
preferred label: grænsestridigheder @dk
preferred label: conflitos fronteiriços @pt-pt
preferred label: 边界争端 @zh-hans
preferred label: Grenzstreitigkeit @de
preferred label: Conflit frontalier @fr
preferred label: Disputas fronterizas @es
preferred label: نزاع حدودي @ar
preferred label: grensekonflikt @no-nn
definition: Diplomatic issues between two countries regarding territorial borders
definition: Konflikt mellan länder kring territoriella gränser. @se
definition: Diplomatiske uengheder mellem to lande, der grænser op til hinanden. Kan udvikle sig til kamphandlinger. @dk
definition: Litígios diplomáticos entre países por causa de uma fronteira, por vezes envolvendo conflitos militares. @pt-pt
definition: 两国围绕边界的外交问题，有时涉及军事冲突 @zh-hans
definition: Diplomatische Angelegenheiten zwischen zwei Ländern im Grenzbereich, manchmal mit militärischen Auseinandersetzungen @de
in scheme: Media Topic
created: 2021-02-18T12:00:00+00:00
modified: 2025-03-31T12:00:00+00:00
broader: international relations

summit meeting
type: Concept
preferred label: Gipfel @de
preferred label: Sommet @fr
preferred label: Cumbre @es
preferred label: قمة @ar
preferred label: Toppmöte @se
preferred label: cimeiras @pt-pt
preferred label: cúpulas @pt-br
preferred label: topmøde @dk
preferred label: 峰会 @zh-hans
preferred label: toppmøter @no-nb
preferred label: toppmøte @no-nn
definition: Möte på hög nivå mellan länder med syfte att diskutera gemensamma mål eller att genom diplomatiska förhandlingar lindra internationella spänningar. @se
definition: Meetings between high-level government officials or heads of state for the purpose of diplomatic negotiations to ease international tensions or to discuss common goals
definition: Umfasst Treffen von Regierenden, Außen- und Finanzministern der Gruppe der acht größten Staaten und der Gruppe der sieben Industriestaaten (G7/G8) @de
definition: Inclui reuniões de líderes, ministros dos negócios estrangeiros e das finanças do Grupo dos Oito maiores países (G8) ou do Grupo dos Sete dos países mais industrializados (G7). @pt-pt
definition: Inclui reuniões de líderes, ministros das relações exteriores e das finanças do Grupo dos Oito maiores países (G8) ou do Grupo dos Sete dos países mais industrializados (G7). @pt-br
definition: Møder på højt niveau, ofte mellem stats- eller regeringschefer. @dk
definition: 包括八国集团和七国集团领导人、外长和财政部长的会议 @zh-hans
in scheme: Media Topic
created: 2009-10-22T02:00:00+00:00
modified: 2025-03-31T12:00:00+00:00
broader: diplomacy

treaty
type: Concept
preferred label: Traktat och fördrag @se
preferred label: معاهدات ومنظمات دولية @ar
preferred label: Internationaler Vertrag @de
preferred label: Tratado @es
preferred label: Traité @fr
preferred label: tratado @pt-pt
preferred label: traktat @dk
preferred label: 条约 @zh-hans
definition: A written agreement between international entities that is binding under international law
definition: Ein Vertrag (wie es durch die Wiener Vertragsrechtskonvention definiert ist) ist eine schriftliche Vereinbarung zwischen internationalen Gremien, die dem internationalen Recht unterliegt @de
definition: Ett skriftligt avtal mellan internationella enheter som är bindande enligt internationell rätt. @se
definition: Um tratado (de acordo com a Convenção de Viena sobre o Direito dos Tratados) é um acordo escrito entre entidades internacionais vinculativo à luz do direito internacional. @pt-pt
definition: En skriftlig aftale mellem internationale enheder, der er bindende i henhold til folkeretten. @dk
definition: 条约（按照《维也纳条约法公约》的定义）是国际实体之间根据国际法具有约束力的书面协定 @zh-hans
in scheme: Media Topic
created: 2009-10-22T02:00:00+00:00
modified: 2025-03-31T12:00:00+00:00
broader: diplomacy

democracy
type: Concept
preferred label: Democracia @es
preferred label: Demokrati @se
preferred label: Démocratie @fr
preferred label: ديموقراطية @ar
preferred label: Demokratie @de
preferred label: democracia @pt-pt
preferred label: demokrati @dk
preferred label: 民主 @zh-hans
definition: Regierung, in der entweder die Menschen die direkte Macht innehaben, oder durch gewählte Vertreter. @de
definition: Politiskt system i vilket regeringsmakten i princip företräder folkviljan, sådan den framkommer genom fria, allmänna och hemliga val. @se
definition: Form of government in which the people hold the power, either directly or through elected officials
definition: Governo no qual o povo detém o poder de maneira direta ou por meio de representantes governamentais eleitos. @pt-pt
definition: Regering, hvor folket besidder magten enten direkte eller gennem valgte embedsmænd. @dk
definition: 人民直接或者通过选举产生的官员行使权力的政府 @zh-hans
in scheme: Media Topic
created: 2009-10-22T02:00:00+00:00
modified: 2025-03-31T12:00:00+00:00
broader: political system

dictatorship
type: Concept
preferred label: Dictadura @es
preferred label: Diktatur @de
preferred label: ديكتاتورية @ar
preferred label: Dictature @fr
preferred label: ditadura @pt-pt
preferred label: diktatur @dk
preferred label: 独裁 @zh-hans
definition: Regierung in der ein einzelner oder eine kleine Gruppe von Einzelnen die Macht haben ohne Einverständnis der Bevölkerung @de
definition: Form of government in which a single individual or a small group of individuals hold power without the consent of the people
definition: Politiskt system där all statsmakt är koncentrerad till en viss person eller en viss grupp, utan folkviljans samtycke genom fria, allmänna och hemliga val. @se
definition: Governo em que um único indivíduo ou um pequeno grupo de indivíduos detém o poder sem o consentimento da população. @pt-pt
definition: Regeringsform, hvor al statsmagt er koncentreret til en bestemt person eller gruppe. @dk
definition: 未经人民同意而由一个人或一小群人掌权的政府 @zh-hans
in scheme: Media Topic
created: 2009-10-22T02:00:00+00:00
modified: 2025-03-31T12:00:00+00:00
broader: political system
broad match: http://cv.iptc.org/newscodes/subjectcode/11006000

communism
type: Concept
preferred label: kommunisme @no-nb
preferred label: Kommunismus @de
definition: Form of government that aims to replace private property and a profit-based economy with public ownership and communal control of the means of production and the natural resources within in society
definition: Eine Regierungsform, die darauf abzielt, Privateigentum und eine gewinnorientierte Wirtschaft durch öffentliches Eigentum und kommunale Kontrolle über die Produktionsmittel und natürlichen Ressourcen innerhalb der Gesellschaft zu ersetzen. @de
in scheme: Media Topic
created: 2025-03-31T12:00:00+00:00
modified: 2025-03-31T12:00:00+00:00
broader: political system

democratic socialism
type: Concept
preferred label: demokratisk sosialisme @no-nb
preferred label: Sozialismus @de
definition: Form of government that consists of a socialist economy in which the means of production are socially and collectively owned or controlled alongside a democratic political system of government with officials elected to office by citizens
definition: Eine Regierungsform, die aus einer sozialistischen Wirtschaft besteht, in der die Produktionsmittel in gesellschaftlichem und kollektivem Besitz sind oder kontrolliert werden, und einem demokratischen politischen Regierungssystem, in dem die Amtsträger von den Bürgern gewählt werden. @de
in scheme: Media Topic
created: 2025-03-31T12:00:00+00:00
modified: 2025-03-31T12:00:00+00:00
broader: political system

theocracy
type: Concept
preferred label: teokrati @no-nb
preferred label: Theokratie @de
definition: Form of government in which authority comes from a religion and the leaders are thought to be divinely guided
definition: Eine Regierungsform, in der eine einzelne Person oder eine kleine Gruppe von Personen ohne die Zustimmung des Volkes die Macht ausübt. @de
in scheme: Media Topic
created: 2025-03-31T12:00:00+00:00
modified: 2025-03-31T12:00:00+00:00
broader: political system

absolute monarchy
type: Concept
preferred label: enevelde @no-nb
preferred label: einevelde @no-nn
preferred label: Monarchie @de
definition: Form of government in which a person, who is part of a hereditary line, reigns as head of state for life or until abdication
definition: Staatsform, in der eine Person, die Teil einer Erbfolge ist, als Staatsoberhaupt auf Lebenszeit oder bis zu ihrer Abdankung regiert. @de
in scheme: Media Topic
created: 2025-03-31T12:00:00+00:00
modified: 2025-03-31T12:00:00+00:00
broader: political system

Budismo
type: Concept
preferred label: Buddhism
preferred label: Bouddhisme @fr
preferred label: Buddhismus @de
preferred label: بوذية @ar
preferred label: budismo @pt-pt
preferred label: buddhisme @dk
preferred label: 佛教 @zh-hans
definition: An Asian religion founded in the 6th century BC in India based on the teachings of the Buddha with the goal of overcoming suffering and transcending desire and the individual self to achieve nirvana
definition: Eine verbreitete asiatische Religion, gegründet von Buddha im 6ten Jahrhundert vor Christus in Indien, die verkündet, dass richtiges Denken und Selbstverleugnung in einen göttlichen Geisteszustand frei von Wünschen führt. @de
definition: En österländsk religion, grundan i Indien cirka 600 före kristus som lägger stor vikt vid frigörelsen från det världsliga. I enlighet med Buddhas lärdomar. @se
definition: Importante religião asiática, fundada por Buda no séc. VI a.C. na Índia, que prega que o bom uso da razão e a abnegação conduzem a um estado divino sem desejo. @pt-pt
definition: En østlig religion, der baserer sig på Buddhas lære. @dk
definition: 公元前6世纪由佛陀在印度创立的一种主要的亚洲宗教，宣扬正确的思想和自我否定将导致一个没有欲望的神圣国度 @zh-hans
in scheme: Media Topic
created: 2009-10-22T02:00:00+00:00
modified: 2021-12-21T12:00:00+00:00
broader: belief systems

Christianity
type: Concept
preferred label: Christentum @de
preferred label: Christianisme @fr
preferred label: مسيحية @ar
preferred label: Kristendom @se
preferred label: Cristianismo @es
preferred label: cristianismo @pt-pt
preferred label: kristendom/folkekirke @dk
preferred label: 基督教 @zh-hans
preferred label: kristendom @no-nb
definition: Den religion som utgår från Jesus Kristus och hans predikningar. Samt bibeln. @se
definition: Menschen, die Jesus Christus und seine Lehren als das Zentrum ihres Glaubens sehen. @de
definition: Religions that follow the teachings of Jesus Christ and the Bible
definition: Aqueles que usam Jesus Cristo e os seus ensinamentos como centro da sua crença religiosa. @pt-pt
definition: Aqueles que usam Jesus Cristo e seus ensinamentos como centro de sua crença religiosa. @pt-br
definition: Religion baseret på Jesus Kristus og hans prædikener. @dk
definition: 那些以耶稣基督和他的教导为信仰中心的人 @zh-hans
in scheme: Media Topic
created: 2009-10-22T02:00:00+00:00
modified: 2021-12-21T12:00:00+00:00
broader: belief systems
narrower: ecumenism
narrower: Mormon
narrower: Old Catholic
narrower: Christian Orthodoxy
narrower: Protestantism
narrower: Roman Catholic
narrower: Catholicism

Confucianism
type: Concept
preferred label: كونفوشية @ar
preferred label: Confucianismo @es
preferred label: Confucianisme @fr
preferred label: Konfuzianismus @de
preferred label: Konfucianism @se
preferred label: confucionismo @pt-pt
preferred label: konfucianisme @dk
preferred label: 儒家思想 @zh-hans
preferred label: konfusianisme @no-nb
definition: Der Weg des Lebens, der durch Konfuzius propagiert wurde im 6.-5. Jahrhundert vor Christus und den die chinesische Bevölkerung seit mehr als 2000 Jahren befolgt. Die Einflüsse haben sich ausgedehnt nach Korea, Japan und Vietnam. @de
definition: En kinesisk vishets- och samhällslära, baserad på idéer från tänkaren Konfucius. @se
definition: A system of thought and behaviour originating in ancient China and based on the teachings of the philosopher Confucius
definition: Doutrina de vida propagada por Confúcio no séc. VI-V a.C. e seguida pelo povo chinês há mais de 2000 anos. A sua influência estendeu-se até à Coreia, ao Japão e ao Vietname. @pt-pt
definition: Doutrina de vida propagada por Confúcio no séc. VI-V A.C. e seguida pelo povo chinês por mais de 2000 anos. Sua influência se estendeu até a Coreia, o Japão e o Vietnã. @pt-br
definition: En kinesisk visdom og social lære, der er baseret på idéer fra tænkeren Confucius. @dk
definition: 孔子在公元前6-5世纪传播的生活方式，中国人沿袭了2000多年。 它的影响已经扩展到韩国、日本和越南 @zh-hans
definition: A system of thought and behavior originating in ancient China and based on the teachings of the philosopher Confucius
in scheme: Media Topic
created: 2009-10-22T02:00:00+00:00
modified: 2021-12-17T12:00:00+00:00
broader: belief systems

cult
type: Concept
preferred label: Kult und Sekte @de
preferred label: Cultos y sectas @es
preferred label: Cultes et sectes @fr
preferred label: Kulter och sekter @se
preferred label: معتقدات وطوائف @ar
preferred label: cultos e seitas @pt-pt
preferred label: kult og sekt @dk
preferred label: 膜拜教派 @zh-hans
preferred label: kulter og sekter @no-nb
preferred label: kultar og sektar @no-nn
definition: Religiösa grupperingar som karaktäriseras av en diffus organisation och av ett i förhållande till andra religiösa grupper avvikande trossystem. Följer ofta en karismatisk ledare. @se
definition: Randerscheinungen von anerkannten religiösen Einheiten, oder kleine eng konzentrierte Gruppen, verbreitet durch ein oder zwei Einzelpersonen @de
definition: A group that consists of followers who are fully devoted to a charismatic leader. Members are sometimes exploited financially or subject to emotional or physical harm
definition: Ramificações de corpos religiosos estabelecidos ou grupo restrito disseminado por um ou dois indivíduos. @pt-pt
definition: Religiøse grupperinger, der er kendetegnet ved en diffus organisation og et afvigende trossystem i forhold til andre religiøse grupper. @dk
definition: 由一两个人发布的宗教团体的分支或小范围的团体 @zh-hans
in scheme: Media Topic
created: 2009-10-22T02:00:00+00:00
modified: 2021-12-21T12:00:00+00:00
broader: belief systems

Freemasonry
type: Concept
preferred label: Frimureri @se
preferred label: Masonería @es
preferred label: Franc-maçonnerie @fr
preferred label: Freimaurer @de
preferred label: ماسونية @ar
preferred label: maçonaria @pt-pt
preferred label: frimureri @dk
preferred label: 共济会 @zh-hans
preferred label: frimurari @no-nn
definition: Eine geheime internationale Gemeinschaft, die auf den Prinzipien von Brüderlichkeit, Wohltätigkeit und gegenseitiger Hilfe basiert. @de
definition: Den verksamhet som bedrivs av hemliga ordenssällskap som vill verka för medlemmarnas personliga utveckling till bättre människor. @se
definition: A secret international society based on the principles of brotherhood, charity and mutual aid
definition: Sociedade secreta internacional baseada nos princípios de irmandade, caridade e ajuda mútua. @pt-pt
definition: Et hemmeligt internationalt samfund baseret på principperne om broderskab, velgørenhed og gensidig hjælp. @dk
definition: 一个以兄弟情谊、慈善和互助原则为基础的秘密国际组织 @zh-hans
change note: Retired in December 2021
in scheme: Media Topic
created: 2009-10-22T02:00:00+00:00
retired: 2021-12-17T12:00:00+00:00
modified: 2021-12-17T12:00:00+00:00
broader: belief systems

Hinduism
type: Concept
preferred label: Hinduismo @es
preferred label: Hindouisme @fr
preferred label: هندوسية @ar
preferred label: Hinduismus @de
preferred label: hinduísmo @pt-pt
preferred label: hinduisme @dk
preferred label: 印度教 @zh-hans
definition: A religion and social system originating in India that includes a caste system, a belief in reincarnation and the worship of multiple deities
definition: Ein religiöses und soziales System, Glaube an ein Kastensystem, in dem der Brahmane die Höchste und die Unberührbaren die niedrigste Stufe darstellen. @de
definition: En indisk religion och samhällssystem med kaster med tro på själavandring och det gudomligas närvaro i varje del av världsalltet. @se
definition: Sistema religioso e social que acredita num sistema de castas, com os brâmanes na casta mais alta e os intocáveis na casta mais baixa. @pt-pt
definition: En indisk religion med en tro på selvtransformation og den guddommelige tilstedeværelse i alle dele af universet. @dk
definition: 一种宗教和社会制度，相信婆罗门最高，贱民最低的种姓制度 @zh-hans
in scheme: Media Topic
created: 2009-10-22T02:00:00+00:00
modified: 2021-12-21T12:00:00+00:00
broader: belief systems

Islam
type: Concept
preferred label: اسلام @ar
preferred label: islão @pt-pt
preferred label: islã @pt-br
preferred label: islam @dk
preferred label: 伊斯兰教 @zh-hans
definition: Monotheistic religion that considers Muhammad as a prophet and the Qur'an as holy scripture
definition: Monoteistisk religion som räknar Muhammed som profet och Koranen som helig skrift. @se
definition: Diejenigen die Allah und seine Lehren als Zentrum ihres Glaubens betrachten. @de
definition: Aqueles que usam Alá e os seus ensinamentos como centro da sua crença religiosa. @pt-pt
definition: Aqueles que usam Alá e seus ensinamentos como centro de sua crença religiosa. @pt-br
definition: Monoteistisk religion, der regner Muhammed som en profet og Koranen som hellig skrift. @dk
definition: 那些以安拉和他的教导为信仰中心的人 @zh-hans
in scheme: Media Topic
created: 2009-10-22T02:00:00+00:00
modified: 2021-12-17T12:00:00+00:00
broader: belief systems
narrower: Shia Islam
narrower: Sunni Islam

Jainism
type: Concept
preferred label: Jainismo @es
preferred label: جاينية @ar
preferred label: Jainismus @de
preferred label: Jaïnisme @fr
preferred label: jainismo @pt-pt
preferred label: jainisme @dk
preferred label: 耆那教 @zh-hans
definition: Eine indische Religion, die einen Weg lehrt zu spiritueller Reinheit und Erleuchtung, durch einen disziplinierten Lebensstil auf der Tradition von Gewaltlosigkeit gegenüber allen Lebewesen. Begann im 7.-5. Jahrhundert vor Christus. @de
definition: A religion beginning in the 7th-5th century BC in India that teaches a path to spiritual purity and enlightenment through a disciplined mode of life founded upon the tradition of ahimsa, nonviolence to all living creatures
definition: En indisk religion som är besläktad med buddhismen. Uppkom cirka 700-500 före kristus. @se
definition: Religião da Índia que ensina o caminho para a pureza e a iluminação espirituais através de um modo de vida disciplinado fundado na tradição de ainsa, não-violência para todas as criaturas vivas. Teve origem nos séculos VII-V a.C. @pt-pt
definition: Religião da Índia que ensina o caminho para a pureza e a iluminação espirituais através de um modo de vida disciplinado fundado na tradição de ainsa, não violência para todas as criaturas vivas. Teve origem nos séculos VII-V a.C. @pt-br
definition: Jainisme er en indisk religion baseret på Mahavir Swamis forkyndelser. @dk
definition: 印度的一种宗教，通过一种建立在对所有生物非暴力的传统基础上的有纪律的生活方式，教导人们通往精神纯洁和启蒙的道路。它开始于公元前7 -5世纪。 @zh-hans
in scheme: Media Topic
created: 2009-10-22T02:00:00+00:00
modified: 2021-12-21T12:00:00+00:00
broader: belief systems

Judaism
type: Concept
preferred label: Judaïsme @fr
preferred label: يهودية @ar
preferred label: Judentum @de
preferred label: Judaísmo @es
preferred label: Judendom @se
preferred label: judaísmo @pt-pt
preferred label: jødedom @dk
preferred label: 犹太教 @zh-hans
definition: A monotheistic religion and culture that follows the teachings of the Torah
definition: Eine Gruppe, die an einen Gott glaubt, deren Glauben auf den geschriebene heiligen Schriften und dem Talmud beruht, die das erste Erscheinen des Messias beinhalten. @de
definition: Monoteistisk religion där Toran är lagen, den motsvarar moseböckerna i gamla testamentet. @se
definition: Grupo que acredita em um só deus, baseando as suas crenças nas escrituras e no Talmude, incluindo a primeira vinda do Messias. @pt-pt
definition: Grupo que acredita em um só deus, baseando suas crenças nas escrituras e no Talmude, incluindo a primeira vinda do Messias. @pt-br
definition: Monoteistisk religion baseret på Det Gamle Testamente. @dk
definition: 信仰一个神的团体，他们的信仰建立在书面经文和犹太法典上，包括弥赛亚的第一次降临 @zh-hans
in scheme: Media Topic
created: 2009-10-22T02:00:00+00:00
modified: 2021-12-21T12:00:00+00:00
broader: belief systems
narrower: Hasidism

nature religion
type: Concept
preferred label: Naturreligioner @se
preferred label: Naturreligion @de
preferred label: Animisme @fr
preferred label: عبادة الطبيعة @ar
preferred label: Animismo @es
preferred label: religião natural @pt-pt
preferred label: naturreligion @dk
preferred label: 自然宗教 @zh-hans
definition: Dyrkan av naturliga element, såsom eld, vatten, träd och berg, vilket anses förkroppsliga gudomlighet. @se
definition: Verehrung von Naturelementen wie Feuer, Wasser, Bäume, Berge @de
definition: Religions that believe nature and the natural world is an embodiment of divinity, sacredness or spiritual power, including indigenous religions practiced in various parts of the world, and modern Pagan faiths, such as Wicca
definition: Adoração de elementos naturais como fogo, água, árvores, montanhas. @pt-pt
definition: Tilbedelse af naturlige elementer som ild, vand, træer og bjerge. @dk
definition: 崇拜火、水、树、山等自然元素 @zh-hans
in scheme: Media Topic
created: 2009-10-22T02:00:00+00:00
modified: 2021-12-21T12:00:00+00:00
broader: belief systems

Zoroastrianism
type: Concept
preferred label: Zoroastrismus @de
preferred label: Zoroastrism @se
preferred label: بارسيس @ar
preferred label: Parsismo @es
preferred label: Parsasm @fr
preferred label: parsismo @pt-pt
preferred label: zoroastrianisme @dk
preferred label: 琐罗亚斯德教 @zh-hans
preferred label: zoroastrisme @no-nb
definition: Eine indische Religion, die der Lehre von Zarathustra folgt, meistens in Bombay, aber auch in (Karachi) Pakistan. @de
definition: A religion originating in ancient Iran following the teachings of the prophet Zoroaster, predicting the triumph of good over evil and exalting the benevolent deity of wisdom, Ahura Mazda (Wise Lord), as its supreme being
definition: En persisk religion, numera mest utövad i Indien, som följer den iranske profeten Zarathustra. @se
definition: Religião da Índia que segue o profeta iraniano Zoroastro, ou Zaratustra, sobretudo em Bombaim, mas também em Carachi (Paquistão). @pt-pt
definition: Religião da Índia que segue o profeta iraniano Zoroastro, ou Zaratustra, sobretudo em Bombaim, mas também em Karachi (Paquistão). @pt-br
definition: En religion i Indien efter den iranske profet Zoroaster, hovedsageligt i Bombay, men også i Karachi (Pakistan). @dk
definition: 印度的一种宗教，追随伊朗先知琐罗亚斯德，主要在孟买，也在卡拉奇(巴基斯坦) @zh-hans
in scheme: Media Topic
created: 2009-10-22T02:00:00+00:00
modified: 2021-12-17T12:00:00+00:00
broader: belief systems

Scientologi
type: Concept
preferred label: Cientología @es
preferred label: Scientology
preferred label: علموية @ar
preferred label: Scientologie @fr
preferred label: cientologia @pt-pt
preferred label: 山达基教 @zh-hans
preferred label: scientologi @no-nb
definition: Der Gaube dass der Mensch ein spirituelles Wesen ist, ausgestattet mit Fähigkeiten, hinter den für gewöhnlich sichtbaren, er ist in der Lage seine eigenen Probleme zu lösen, Großes zu schaffen und dauerhaftes Glück zu erlangen. @de
definition: A set of beliefs and practices invented by American science fiction author L. Ron Hubbard asserting that a human is an immortal, spiritual being (Thetan) that is resident in a physical body
definition: En psykologiserande, delvis kommersiell frälsningsrörelse, kännetecknad av idéer om självförverkligande genom personlig andlig kraft. Startad av L Ron Hubbard. @se
definition: Crença de que o homem é um ser espiritual dotado de capacidades que vão além do que ele normalmente considera. @pt-pt
definition: Scientology er en nyreligiøs bevægelse startet omkring 1951 af den amerikanskfødte forfatter L. Ron Hubbard med oprindelse i hans Dianetik. @dk
definition: 相信人是一种精神上的存在，被赋予的能力远远超出他通常所能想象的 @zh-hans
in scheme: Media Topic
created: 2009-10-22T02:00:00+00:00
modified: 2021-12-21T12:00:00+00:00
broader: belief systems

Schintoismus
type: Concept
preferred label: Shintoism
preferred label: شينتوية @ar
preferred label: Shintoïsme @fr
preferred label: Shintoismo @es
preferred label: xintoísmo @pt-pt
preferred label: shintoisme @dk
preferred label: 日本神道教 @zh-hans
definition: En japansk religion i vilken naturgudar och döda hjältars andar dyrkas genom offergåvor, danser med mera. @se
definition: An indigenous Japanese polytheistic religion that revolves around kami, supernatural entities believed to inhabit all things
definition: Ursprünglicher religiöser praktizierter Glaube in Japan. Die Bezeichnung Shinto wurde eingeführt um den ursprünglichen japanischen Glauben vom Buddhismus zu trennen. @de
definition: Crenças e práticas religiosas autóctones do Japão. A palavra xintó foi adotada para distinguir as crenças autóctones japonesas do budismo. @pt-pt
definition: Urbefolkningens religiøse overbevisning og praksis i Japan. Ordet Shinto kom i brug for at skelne den oprindelige japanske tro fra buddhismen. @dk
definition: 日本的土著宗教信仰和习俗。 神道教这个词的出现是为了区分日本本土信仰和佛教 @zh-hans
in scheme: Media Topic
created: 2009-10-22T02:00:00+00:00
modified: 2021-12-17T12:00:00+00:00
broader: belief systems

Sikhism
type: Concept
preferred label: Sikhismus @de
preferred label: سيخ @ar
preferred label: Sikhisme @fr
preferred label: Sikhismo @es
preferred label: siquismo @pt-pt
preferred label: sikhisme @dk
preferred label: 锡克教 @zh-hans
definition: En religion i framför allt Punjab i norra Indien, som har utvecklats ur hinduismen, men lär att det bara finns en gud. @se
definition: An Indian Dharmic religion that originated at the end of the 15th century CE in the Punjab region, developed from the spiritual teachings of Guru Nanak
definition: Religion einer indischen Gruppe, die Hinduismus und islamische Elemente verbindet, die in Punjab entdeckt wurde im späten 15. Jahrhundert von Guru Nanak. @de
definition: Religião de um grupo indiano, que combina elementos hindus e islâmicos, fundada no Punjabe (ou Punjab) no final do séc. XV pelo guru Nanak. @pt-pt
definition: En religion, som kombinerer hinduistiske og islamiske elementer og blev grundlagt i Punjabi slutningen af det 15. århundrede e.Kr. af Guru Nanak. @dk
definition: 一个印度群体的宗教，结合了印度教和伊斯兰元素，由纳纳克大师于公元15世纪末在旁遮普（或旁遮普）建立。 @zh-hans
in scheme: Media Topic
created: 2009-10-22T02:00:00+00:00
modified: 2021-12-17T12:00:00+00:00
broader: belief systems

Taoism
type: Concept
preferred label: Daoism @se
preferred label: Taoismus @de
preferred label: Taoïsme @fr
preferred label: Taoismo @es
preferred label: طاوية @ar
preferred label: taoismo @pt-pt
preferred label: taoisme @dk
preferred label: 道教 @zh-hans
definition: Ursprüngliche chinesische religiöse und philosophische Tradition, die seit mehr als 2000 Jahren das chinesische Leben beeinflusst. @de
definition: En kinesisk vishetslära som förespråkar ett enkelt liv i samklang med naturen. @se
definition: A philosophical and spiritual tradition originating in the 4th century BCE in China which emphasizes living in harmony with the Tao, the source, pattern and substance of everything that exists
definition: Tradição religiosa e filosófica autóctone que molda a cultura chinesa há mais de 2000 anos. @pt-pt
definition: En kinesisk visdomslære, der går ind for et enkelt liv i harmoni med naturen. @dk
definition: 一种对中国人的生活产生了2000多年影响的本土宗教信仰 @zh-hans
in scheme: Media Topic
created: 2009-10-22T02:00:00+00:00
modified: 2021-12-17T12:00:00+00:00
broader: belief systems

Unificationism
type: Concept
preferred label: Vereinigungsbewegung @de
preferred label: Iglesia de la Unificación @es
preferred label: توحيد @ar
preferred label: Église de l'Unification @fr
preferred label: Moonrörelsen @se
preferred label: unificacionismo @pt-pt
preferred label: Moon-bevægelsen @dk
preferred label: 统一教 @zh-hans
preferred label: Den forente familie @no-nb
preferred label: Den sameinte familien @no-nn
definition: Tidigare namn på Familjefederationen för världsfred och enighet, en nyreligiös rörelse grundad i Busan i Sydkorea av Sun Myung Moon. @se
definition: Das Glaubenssystem der Mitglieder der Vereinigungskirche, das von Sun Myung Moon festgelegt wurde. @de
definition: A religion founded in 1954 in South Korea following the teachings of Rev. Syn Myung Moon and known for its mass wedding ceremonies
definition: Sistema de crenças dos membros da Igreja da Unificação, estabelecida pelo reverendo Sun Myung Moon. @pt-pt
definition: Trosystemet for medlemmer af Unification Church oprettet af præsten Sun Myung Moon. @dk
definition: 由孙明文牧师建立的统一教会成员的信仰体系。 @zh-hans
in scheme: Media Topic
created: 2009-10-22T02:00:00+00:00
modified: 2021-12-17T12:00:00+00:00
broader: belief systems

atheism and agnosticism
type: Concept
preferred label: ateisme og agnostisisme @no-nb
preferred label: Atheism och Agnosticism @se
preferred label: Ateísmo y agnosticismo @es
preferred label: Athéisme et agnosticisme @fr
preferred label: إلحاد ولاأدرية @ar
preferred label: Atheismus und Agnostizismus @de
definition: The belief that god does not exist or that it is impossible to know whether a god exists
definition: Ateister anser att det inte finns någon gud, agnostiker att man inte kan veta. @se
definition: Der Glaube, dass Gott nicht existiert oder dass es unmöglich ist, zu wissen, ob ein Gott existiert @de
in scheme: Media Topic
created: 2021-12-17T12:00:00+00:00
modified: 2021-12-21T12:00:00+00:00
broader: belief systems

ecumenism
type: Concept
preferred label: Oecuménisme @fr
preferred label: Ekumenik @se
preferred label: Ecumenismo @es
preferred label: مسكونية @ar
preferred label: Ökumene @de
preferred label: ecumenismo @pt-pt
preferred label: økumeni @dk
preferred label: 普世教会 @zh-hans
preferred label: økumenikk @no-nb
definition: Samlande benämning på kyrkliga enhetssträvanden. @se
definition: Beziehungen zwischen christlichen Kirchen @de
definition: Relations between Christian churches
definition: Relações entre igrejas cristãs. @pt-pt
definition: Forholdet mellem kristne kirker. @dk
definition: 基督教会之间的关系 @zh-hans
change note: Retired in December 2021. Use Christianity (medtop:20000659) instead.
in scheme: Media Topic
created: 2009-10-22T02:00:00+00:00
retired: 2021-12-17T12:00:00+00:00
modified: 2021-02-18T12:00:00+00:00
broader: Christianity

Mormon
type: Concept
preferred label: مورمون @ar
preferred label: Mormonism
preferred label: Mormón @es
preferred label: Mormonen @de
preferred label: mórmon @pt-pt
preferred label: mormon @dk
preferred label: 摩门教 @zh-hans
preferred label: mormonisme @no-nb
definition: En kristen rörelse som tror på Mormons bok och Joseph Smiths uppenbarelser. Grundad i staten New York kring 1820. @se
definition: Mitglieder einer christlichen Gemeinschaft, die an das Buch Mormone und die Visionen des Gründers M.J. Smith glauben. @de
definition: Christian religion founded in New York State in the 1820s that follows the teachings of Joseph Smith and the *Book of Mormon*
definition: Membros de uma comunidade religiosa que acredita no *Livro de Mórmon* e nas revelações do fundador M. J. Smith. @pt-pt
definition: En kristen bevægelse, hvis grundlag foruden Bibelen bl.a. er *Mormons Bog*, som blev åbenbaret for J. Smith i 1827. @dk
definition: 信奉《摩门经》和创始人M.J.史密斯启示的宗教团体的成员 @zh-hans
in scheme: Media Topic
created: 2009-10-22T02:00:00+00:00
modified: 2021-12-21T12:00:00+00:00
broader: Christianity

Old Catholic
type: Concept
preferred label: Gammalkatolicism @se
preferred label: كنيسة كاثوليكية قديمة @ar
preferred label: Antiguo católico @es
preferred label: Vieux Catholique @fr
preferred label: Altkatholiken @de
preferred label: veterocatólico @pt-pt
preferred label: gammelkatolik @dk
preferred label: 老天主教 @zh-hans
preferred label: gammelkatolisisme @no-nb
preferred label: gammalkatolisisme @no-nn
definition: En sammanslutning av självständiga och episkopalt styrda kyrkor, som står utanför gemenskapen med påven och den romersk-katolska kyrkan. @se
definition: Mitglieder einer katholischen Kirche, die 1870 entstand und die die Lehre über die Unfehlbarkeit des Papstes ablehnt. @de
definition: Members of a catholic church which started in 1870 and denies the dogma of the infallibility of the pope
definition: Membros de uma igreja católica que começou em 1870 e que nega o dogma da infalibilidade do papa. @pt-pt
definition: Medlemmer af en katolsk kirke, der startede i 1870 og benægter dogmen om pavens ufejlbarhed. @dk
definition: 1870年成立的天主教会成员并否认教皇的教义是绝对正确的 @zh-hans
change note: Retired in December 2021. Use Catholicism (medtop:20001344) instead.
in scheme: Media Topic
created: 2009-10-22T02:00:00+00:00
retired: 2021-12-17T12:00:00+00:00
modified: 2021-02-18T12:00:00+00:00
broader: Christianity

Christian Orthodoxy
type: Concept
preferred label: Orthodoxe @de
preferred label: Ortodoxo @es
preferred label: ارثوذكس @ar
preferred label: Orthodoxie @fr
preferred label: Ortodox kristendom @se
preferred label: ortodoxia @pt-pt
preferred label: ortodoks @dk
preferred label: 东正教 @zh-hans
preferred label: ortodoks kristendom @no-nb
definition: Kirchen des byzantinischen Ritus, die in der apostolischen Tradition stehen, vor allem in Ost- und Südosteuropa sowie im Mittleren Osten. @de
definition: En kristen riktning, särskilt verksam i Östeuropa, som karaktäriseras av dess fortsatta tro på kyrkofäderna och dessas liturgi. @se
definition: Eastern rite churches which are characterised by their continuity with the apostolic church, their liturgy and their territorial churches, mainly in eastern and south-eastern Europe and the Middle East
definition: Igrejas de rito oriental que se caracterizam pela sua continuidade com a igreja apostólica, a sua liturgia e as suas igrejas territoriais, sobretudo no leste e sudeste da Europa e no Médio Oriente. @pt-pt
definition: Igrejas de rito oriental que se caracterizam pela sua continuidade com a igreja apostólica, sua liturgia e suas igrejas territoriais, sobretudo no leste e sudeste da Europa e no Oriente Médio. @pt-br
definition: En kristen retning, især aktiv i Østeuropa, kendetegnet ved dens fortsatte tro på kirkefædre og deres liturgi. @dk
definition: 主要分布在东欧和东南欧以及中东地区的东方仪式教堂，其特点是与使徒教会、礼拜仪式和领土教堂的连续性 @zh-hans
definition: Eastern rite churches which are characterized by their continuity with the apostolic church, their liturgy and their territorial churches, mainly in eastern and south-eastern Europe and the Middle East
in scheme: Media Topic
created: 2009-10-22T02:00:00+00:00
modified: 2021-12-17T12:00:00+00:00
broader: Christianity

Protestantism
type: Concept
preferred label: Protestantisme @fr
preferred label: Evangelische Kirche @de
preferred label: بروتستانت @ar
preferred label: Protestante @es
preferred label: protestante @pt-pt
preferred label: protestant @dk
preferred label: 新教 @zh-hans
preferred label: protestantisme @no-nb
definition: En kristen riktning som uppkom genom utbrytning ur den katolska kyrkan och omfattar lutheraner och reformerta. @se
definition: Christian denominations that were formed through the 16th century Reformation movement
definition: Oberbegriff für christliche Kirchen und religiöse Gemeinschaften, entstanden aus der Reformation des 16. Jahrhunderts @de
definition: Termo genérico para igrejas cristãs e comunidades religiosas que se formaram durante a Reforma Protestante do séc. XVI. @pt-pt
definition: Generel betegnelse for kristne kirker og religiøse samfund, der udviklede sig gennem reformeringen i det 16. århundrede. @dk
definition: 泛指16世纪通过宗教改革而发展起来的基督教教堂和宗教团体 @zh-hans
definition: Kristne retningar som oppstod under og etter reformasjonen på 1500-talet. @no-nn
definition: Kristne retninger som oppsto under og etter reforamsjonen på 1500-tallet. @no-nb
in scheme: Media Topic
created: 2009-10-22T02:00:00+00:00
modified: 2021-12-17T12:00:00+00:00
broader: Christianity
narrower: Anglican
narrower: Baptist
narrower: Lutheran
narrower: Mennonite
narrower: Methodist
narrower: Reformed

Roman Catholic
type: Concept
preferred label: Catholicisme romain @fr
preferred label: Católico romano @es
preferred label: كاثوليك @ar
preferred label: Katolicism @se
preferred label: Römisch-Katholische Kirche @de
preferred label: católico romano @pt-pt
preferred label: romersk-katolsk @dk
preferred label: 罗马天主教 @zh-hans
preferred label: den romersk-katolske kirke @no-nb
preferred label: den romersk-katolske kyrkja @no-nn
definition: Den form av kristendom som utövas inom den stora, internationella kyrka som har sitt centrum i Rom och som är dominerande bland annat i Sydeuropa och Latinamerika. @se
definition: Weltweit größte christliche Kirche, die ihre Ursprünge auf Jesus Christus zurückführt. @de
definition: Biggest Christian church worldwide tracing its origins back to Jesus Christ
definition: Maior igreja cristã do mundo, cuja origem remonta a Jesus Cristo. @pt-pt
definition: Den største kristne kirke verden over, der sporer dens oprindelse til Jesus Kristus. @dk
definition: 世界上最大的基督教会，其起源可以追溯到耶稣基督 @zh-hans
change note: Retired in December 2021. Use Catholicism (medtop:20001344) instead.
in scheme: Media Topic
created: 2009-10-22T02:00:00+00:00
retired: 2021-12-17T12:00:00+00:00
modified: 2021-02-18T12:00:00+00:00
broader: Christianity
narrower: concordat

Catholicism
type: Concept
preferred label: katolisisme @no-nb
preferred label: Katolicism @se
preferred label: Catolicismo @es
preferred label: Catholicisme @fr
preferred label: كاثوليكية @ar
preferred label: Katholizismus @de
definition: Largest Christian religion in the world encompassing the Roman Catholic Church which is led by the pope, and Old Catholicism, a breakaway movement founded in 1870 that denies the dogma of infallibility of the pope
definition: Katolicism, katolsk, är en kristen term avseende katolska kyrkans religion. Största kristna trosinriktningen. Leds av påven. @se
definition: Größte christliche Religion der Welt, bestehend aus der römisch-katholischen Kirche, die vom Papst geleitet wird, und dem Altkatholizismus, einer 1870 gegründeten abtrünnigen Bewegung, die das Dogma der Unfehlbarkeit des Papstes ablehnt @de
in scheme: Media Topic
created: 2021-12-17T12:00:00+00:00
modified: 2021-12-21T12:00:00+00:00
broader: Christianity

Anglican
type: Concept
preferred label: Anglicanisme @fr
preferred label: Anglikanism @se
preferred label: Anglikaner @de
preferred label: انغليكان @ar
preferred label: Anglicano @es
preferred label: anglicano @pt-pt
preferred label: anglikansk @dk
preferred label: 英国圣公会 @zh-hans
preferred label: den anglikanske kirke @no-nb
preferred label: den anglikanske kyrkja @no-nn
definition: Mitglieder der weltweiten anglikanischen Gemeinschaft, entstanden im 16. Jahrhundert in England nach dem Bruch mit der römisch-katholischen Kirche. @de
definition: Den läromässiga, liturgiska och etiska hållning som utmärker den engelska statskyrkan. @se
definition: Members of the worldwide Anglican communion which started in the 16th century in England as a breakaway church from the roman catholic church
definition: Membros da comunidade anglicana mundial, que nasceu no séc. XVI na Inglaterra, em resultado da cisão com a igreja católica romana. @pt-pt
definition: Den pædagogiske, liturgiske og etiske holdning, der kendetegner den engelske statskirke. @dk
definition: 世界圣公会的成员，起源于16世纪的英格兰，当时是罗马天主教会的一个分支 @zh-hans
change note: Retired in December 2021. Use Protestantism (medtop:20000664) instead.
in scheme: Media Topic
created: 2009-10-22T02:00:00+00:00
retired: 2021-12-17T12:00:00+00:00
modified: 2021-02-18T12:00:00+00:00
broader: Protestantism

Baptist
type: Concept
preferred label: Baptism @se
preferred label: Église Baptiste @fr
preferred label: معمدانية @ar
preferred label: Baptisten @de
preferred label: Bautista @es
preferred label: batista @pt-pt
preferred label: baptist @dk
preferred label: 浸信会 @zh-hans
preferred label: baptisme @no-nb
definition: En kristen riktning som hävdar att dopet måste föregås av ett medvetet val och som därför förkastar barndopet. @se
definition: Members of a Christian church which only baptises adults who truly believe in Christ
definition: Mitglieder einer christlichen Kirche, die nur Erwachsene tauft. @de
definition: Membros de uma igreja cristã que apenas batiza adultos que creem verdadeiramente em Cristo. @pt-pt
definition: En kristen retning, der hævder, at dåb skal foregå med et bevidst valg, og som derfor afviser børnedåb. @dk
definition: 只给真正相信基督的成年人施洗的基督教会的成员 @zh-hans
definition: Members of a Christian church which only baptizes adults who truly believe in Christ
change note: Retired in December 2021. Use Protestantism (medtop:20000664) instead.
in scheme: Media Topic
created: 2009-10-22T02:00:00+00:00
retired: 2021-12-17T12:00:00+00:00
modified: 2021-07-12T12:00:00+00:00
broader: Protestantism

Lutheran
type: Concept
preferred label: لوثرية @ar
preferred label: Lutheranism @se
preferred label: Luterano @es
preferred label: Luthérianisme @fr
preferred label: Lutheraner @de
preferred label: luterano @pt-pt
preferred label: luthersk @dk
preferred label: 路德教 @zh-hans
preferred label: den evangelisk-lutherske kirke @no-nb
preferred label: den evangelisk-lutherske kyrkja @no-nn
definition: Christians who follow the teaching of reformer Martin Luther
definition: Christen, die der Lehre des Reformers Martin Luther folgen. @de
definition: Sammanfattande benämning på de kyrkor och det fromhetsliv som utgår från Martin Luther och den lutherska reformationen. @se
definition: Cristãos que seguem os ensinamentos do reformista Martinho Lutero. @pt-pt
definition: En kortfattet beskrivelse af kirkerne og fromhedslivet baseret på Martin Luther og den lutherske reformation. @dk
definition: 信奉改革家马丁·路德教义的基督徒 @zh-hans
change note: Retired in December 2021. Use Protestantism (medtop:20000664) instead.
in scheme: Media Topic
created: 2009-10-22T02:00:00+00:00
retired: 2021-12-17T12:00:00+00:00
modified: 2021-02-18T12:00:00+00:00
broader: Protestantism

Mennonite
type: Concept
preferred label: Mennonisme @fr
preferred label: Mennoniter @se
preferred label: Mennoniten @de
preferred label: Menonita @es
preferred label: مينونيون @ar
preferred label: menonita @pt-pt
preferred label: mennonit @dk
preferred label: 门诺教 @zh-hans
preferred label: mennonitter @no-nb
preferred label: mennonittane @no-nn
definition: Mitglieder einer aus dem 16. Jahrhundert stammenden christlichen Kirche, die gegen Militärdienst und Kindertaufe sind. @de
definition: Medlemmar av en protestantisk, pacifistisk församlingsrörelse, som eftersträvar en kyrka fri från statlig inblandning och att församlingarna ska bestå av troendedöpta. @se
definition: Members of a 16th century Christian church which is against military service and baptising infants
definition: Membros de uma igreja cristã do séc. XVI que é contra o serviço militar e o batismo de crianças. @pt-pt
definition: Medlemmer af en kristen kirke fra 1500-tallet, som er imod militærtjeneste og at døbe spædbørn. @dk
definition: 16世纪反对服兵役和给婴儿洗礼的基督教会的成员 @zh-hans
definition: Members of a 16th century Christian church which is against military service and baptizing infants
change note: Retired in December 2021. Use Protestantism (medtop:20000664) instead.
in scheme: Media Topic
created: 2009-10-22T02:00:00+00:00
retired: 2021-12-17T12:00:00+00:00
modified: 2021-12-17T12:00:00+00:00
broader: Protestantism

Methodist
type: Concept
preferred label: Methodisten @de
preferred label: ميثودية @ar
preferred label: Méthodisme @fr
preferred label: Metodista @es
preferred label: Metodism @se
preferred label: metodista @pt-pt
preferred label: methodist @dk
preferred label: 卫理公会 @zh-hans
preferred label: metodisme @no-nb
definition: Followers of John and Charles Wesley who tried to reform the Church of England in the 18th century and turned into a separate church
definition: En frikyrklig rörelse med inriktning på noga planerat fromhetsliv. @se
definition: Anhänger von John und Charles Wesley, die im 18. Jahrhundert die Kirche von England reformieren wollten und dadurch eine eigene Kirche gründeten. @de
definition: Seguidores de John e Charles Wesley, que tentaram reformar a igreja de Inglaterra no séc. XVIII e formaram uma igreja separada. @pt-pt
definition: En frikirkebevægelse med fokus på omhyggeligt planlagt fromhedsliv. @dk
definition: 约翰和查尔斯·卫斯理的追随者，他们在18世纪试图改革英国国教，后来变成了一个独立的教会 @zh-hans
change note: Retired in December 2021. Use Protestantism (medtop:20000664) instead.
in scheme: Media Topic
created: 2009-10-22T02:00:00+00:00
retired: 2021-12-17T12:00:00+00:00
modified: 2021-02-18T12:00:00+00:00
broader: Protestantism

Reformed
type: Concept
preferred label: Reformert kristendom @se
preferred label: Reformado @es
preferred label: Reformierte @de
preferred label: Calvinisme @fr
preferred label: بروتستانت @ar
preferred label: reformado @pt-pt
preferred label: reformert @dk
preferred label: 基督教改革宗 @zh-hans
preferred label: kalvinisme @no-nb
definition: Christen, die der Lehre der Reformer Johannes Calvin und Ulrich Zwingli folgen. @de
definition: Christians who follow the teaching of reformers Johannes Calvin and Ulrich Zwingli
definition: En utveckling inom kristendomen för att förändra kyrkan, ett exempel är kalvinism. Den betonar att Gud har all makt och att Bibeln ska styra både kyrkan och samhället. @se
definition: Cristãos que seguem os ensinamentos dos reformistas João Calvino e Ulrico Zuínglio. @pt-pt
definition: Kristne, der følger undervisningen af reformatorerne Johannes Calvin og Ulrich Zwingli. @dk
definition: 追随改革者约翰·卡尔文和乌尔里希·茨温利教义的基督教徒 @zh-hans
change note: Retired in December 2021. Use Protestantism (medtop:20000664) instead.
in scheme: Media Topic
created: 2009-10-22T02:00:00+00:00
retired: 2021-12-17T12:00:00+00:00
modified: 2021-02-18T12:00:00+00:00
broader: Protestantism

concordat
type: Concept
preferred label: Konkordat @se
preferred label: Concordato @es
preferred label: Concordat @fr
preferred label: معاهدة بابوية @ar
preferred label: concordata @pt-pt
preferred label: konkordat @dk
preferred label: 协定 @zh-hans
definition: Völkerrechtlich verbindlicher Vertrag zwischen dem Heiligen Stuhl und einem anderen Land. @de
definition: Avtal mellan en stat och den romersk-katolska kyrkan. @se
definition: Treaty between the Holy See and another country for the regulation of ecclesiastical affairs in the territory of the latter
definition: Tratado entre a Santa Sé e um país para a regulação de assuntos eclesiásticos nesse país. @pt-pt
definition: Aftale mellem en stat og den romersk-katolske kirke. @dk
definition: 罗马教廷与另一个国家之间关于管理后者领土内教会事务的条约 @zh-hans
change note: Retired in December 2021. Use Catholicism (medtop:20001344) instead.
in scheme: Media Topic
created: 2009-10-22T02:00:00+00:00
retired: 2021-12-17T12:00:00+00:00
modified: 2021-12-17T12:00:00+00:00
broader: Roman Catholic

Shia Islam
type: Concept
preferred label: sjiaislam @no-nb
preferred label: Shiaislamism @se
preferred label: Chiismo @es
preferred label: Chiisme @fr
preferred label: شيعة @ar
preferred label: Schiitentum @de
definition: The second largest branch of Islam believing that the Prophet Muhammad designated Ali ibn Abi Talib as his successor
definition: Näst största trosinriktningen inom Islam där anhängarna tror att ättlingar till Muhammed är bäst lämpade att leda religionen. @se
definition: Der zweitgrößte Zweig des Islam, der glaubt, dass der Prophet Mohammed Ali ibn Abi Talib zu seinem Nachfolger bestimmt hat @de
in scheme: Media Topic
created: 2021-12-17T12:00:00+00:00
modified: 2021-12-21T12:00:00+00:00
broader: Islam

Sunni Islam
type: Concept
preferred label: sunniislam @no-nb
preferred label: Sunni-islamism @se
preferred label: Sunismo @es
preferred label: Sunnisme @fr
preferred label: سنّة @ar
preferred label: Sunnitentum @de
definition: The largest branch of Islam believing that the Prophet Muhammad did not designate a successor
definition: Största trosinriktningen inom Islam där den bäst lämpade ska leda religionen. @se
definition: Der größte Zweig des Islams, der glaubt, dass der Prophet Mohammed keinen Nachfolger ernannt hat @de
in scheme: Media Topic
created: 2021-12-17T12:00:00+00:00
modified: 2021-12-21T12:00:00+00:00
broader: Islam

Hasidism
type: Concept
preferred label: hasidisme @no-nb
preferred label: Chassidism @se
preferred label: Jasidismo @es
preferred label: Hassidisme @fr
preferred label: حسيدية @ar
preferred label: Chassidismus @de
definition: Jewish religious group that believes that the Torah is the literal word of God and that carrying out this word is what gives meaning and purpose to life
definition: Strikt judisk trosinriktning som uppstod i Ukraina under 1700-talet. @se
definition: Jüdische religiöse Gruppe, die glaubt, dass die Thora das wörtliche Wort Gottes ist und dass die Umsetzung dieses Wortes dem Leben Sinn und Zweck verleiht @de
in scheme: Media Topic
created: 2021-12-17T12:00:00+00:00
modified: 2021-12-21T12:00:00+00:00
broader: Judaism

Christmas
type: Concept
preferred label: Noël @fr
preferred label: Weihnachten @de
preferred label: Jul @se
preferred label: عيد الميلاد @ar
preferred label: Navidad @es
preferred label: natal @pt-pt
preferred label: jul @dk
preferred label: 圣诞节 @zh-hans
definition: En kristen högtid till minne av Kristi födelse kring den 25 december. Men firas också av icke troende. @se
definition: Fest zur Erinnerung an die Geburt von Jesus Christus @de
definition: Christian holiday that celebrates the birth of Jesus Christ. Is also celebrated by many as a secular holiday.
definition: Festa cristã que comemora o nascimento de Jesus Cristo. @pt-pt
definition: Kristen højtid til minde om Jesu Kristi fødsel. @dk
definition: 纪念耶稣基督诞生的基督教节日 @zh-hans
in scheme: Media Topic
created: 2009-10-22T02:00:00+00:00
modified: 2021-12-21T12:00:00+00:00
broader: religious festival and holiday

Easter
type: Concept
preferred label: Semana santa @es
preferred label: Påsk @se
preferred label: عيد الفصح @ar
preferred label: Pâques @fr
preferred label: Ostern @de
preferred label: páscoa @pt-pt
preferred label: påske @dk
preferred label: 复活节 @zh-hans
definition: En kristen vårhögtid till minne av Jesu korsfästelse och uppståndelse. @se
definition: Christian festival commemorating the resurrection of Jesus Christ. Is also celebrated by many as a secular holiday.
definition: Fest zur Erinnerung an die Auferstehung von Jesus Christus. @de
definition: Festa cristã que comemora a ressurreição de Jesus Cristo. @pt-pt
definition: Kristen højtid til minde om Jesu Kristi opstandelse. @dk
definition: 纪念耶稣基督复活的基督教节日 @zh-hans
in scheme: Media Topic
created: 2009-10-22T02:00:00+00:00
modified: 2021-12-17T12:00:00+00:00
broader: religious festival and holiday

Pentecost
type: Concept
preferred label: عيد العنصرة وعيد الحصاد (اليهود) @ar
preferred label: Pentecôte @fr
preferred label: Pfingsten @de
preferred label: Pentecostés @es
preferred label: Pingst @se
preferred label: pentecostes @pt-pt
preferred label: pinse @dk
preferred label: 五旬节 @zh-hans
definition: Christian festival, celebrated on the 50th day after Easter commemorating the descent of the Holy Spirit, also known as Whitsun
definition: En kristen högtid som firas (i maj eller juni) till minne av det tillfälle då apostlarna enligt Bibeln uppfylldes av helig ande. @se
definition: 50 Tage nach Ostern begangenes Fest zur Erinnerung an das Herabkommen des Heiligen Geistes. @de
definition: Festa cristã, celebrada no 50.º dia depois da Páscoa, que comemora a descida do Espírito Santo. @pt-pt
definition: Kristen højtid, fejret 50 dage efter påske til minde om Helligåndens komme. @dk
definition: 基督教节日，在复活节后的第50天庆祝，以纪念圣灵的降临 @zh-hans
in scheme: Media Topic
created: 2009-10-22T02:00:00+00:00
modified: 2021-12-17T12:00:00+00:00
broader: religious festival and holiday

Ramadan
type: Concept
preferred label: Ramadán @es
preferred label: رمضان @ar
preferred label: ramadão @pt-pt
preferred label: ramadã @pt-br
preferred label: ramadan @dk
preferred label: 斋月 @zh-hans
definition: Den muslimska fastemånaden. @se
definition: Holy month of fasting in Islam concluding in Eid al-Fitr
definition: Heiliger Fastenmonat des Islam. @de
definition: Mês sagrado de jejum no Islão. @pt-pt
definition: Mês sagrado de jejum no Islã. @pt-br
definition: Den muslimske fastemåned. @dk
definition: 伊斯兰教斋月 @zh-hans
in scheme: Media Topic
created: 2009-10-22T02:00:00+00:00
modified: 2021-12-17T12:00:00+00:00
broader: religious festival and holiday

Yom Kippur
type: Concept
preferred label: Yom kippur @es
preferred label: Jom Kippur @de
preferred label: عيد الغفران @ar
preferred label: Yom Kippour @fr
preferred label: Jom kippur @se
preferred label: yom kippur @pt-pt
preferred label: 赎罪日 @zh-hans
preferred label: jom kippúr @no-nb
definition: Försoningsdag inom den judiska religionen firad på hösten. @se
definition: Höchster jüdischer Feiertag, beginnt bei Sonnenuntergang vor dem 10. Tischri und dauert bis zum nächsten Sonnenuntergang (September oder Oktober) @de
definition: Most solemn of Jewish religious holidays, observed on the 10th day of the lunar month of tishri by fasting and prayer from sunset to sundown the following day
definition: O mais solene dos dias santos judaicos, celebrado no 10.º dia do mês lunar de tishri (entre setembro e outubro), quando os judeus buscam a reconciliação com deus. @pt-pt
definition: Forsoningsdag inden for den jødiske religion fejret i efteråret. @dk
definition: 最隆重的犹太宗教节日，在太阴月的第10天庆祝(在9月和10月期间，犹太人寻求与上帝和解) @zh-hans
in scheme: Media Topic
created: 2009-10-22T02:00:00+00:00
modified: 2021-12-17T12:00:00+00:00
broader: religious festival and holiday

All Saints Day
type: Concept
preferred label: allehelgensdag @dk
preferred label: Dia de Todos os Santos @pt-br
preferred label: Alla helgons dag @se
preferred label: 诸圣节 @zh-hans
preferred label: Allerheiligen @de
preferred label: Toussaint @fr
preferred label: Día de Todos los Santos @es
preferred label: عيد جميع القديسين @ar
definition: En fejring af alle helgener, som ikke er en dansk helligdag. Ligger altid 1. november. @dk
definition: Christian festival celebrated in honour of all the saints, known and unknown. Holiday is also known as All Hallows' Day, Hallowmas, Feast of All Saints or Solemnity of All Saints.
definition: Celebração cristã em homenagem a todos os santos, conhecidos e desconhecidos. O feriado também é conhecido como Festa de Todos os Santos ou Solenidade de Todos os Santos. @pt-pt
definition: Kristen högtid då de avlidna hyllas. @se
definition: 纪念所有已知和未知圣徒的基督教节日 @zh-hans
definition: Christliches Fest, das zu Ehren aller bekannten und unbekannten Heiligen gefeiert wird. Der Feiertag ist auch als Allerheiligentag, Halloween, Allerheiligenfest oder Allerheiligenfeiertag bekannt. @de
definition: Christian festival celebrated in honor of all the saints, known and unknown. Holiday is also known as All Hallows' Day, Hallowmas, Feast of All Saints or Solemnity of All Saints.
in scheme: Media Topic
created: 2019-09-05T12:00:00+00:00
modified: 2021-12-17T12:00:00+00:00
broader: religious festival and holiday

Walpurgis night
type: Concept
preferred label: valborgsaften @dk
preferred label: valborgsnatten @no-nb
preferred label: Noite de Santa Valburga @pt-br
preferred label: Sista april @se
preferred label: 五朔节前夕 @zh-hans
preferred label: Walpurgisnacht @de
preferred label: Nuit de Walpurgis @fr
preferred label: Noche de Walpurgis @es
preferred label: عيد القديسة فالبرغا @ar
preferred label: valborgsnatta @no-nn
definition: En tradition, hvor man tæner bål aftenen før 1. maj for at holde heksene væk. Er ikke særligt udbredt i Danmark længere @dk
definition: The eve of the Christian feast day of Saint Walpurga, an 8th-century abbess in Francia, celebrated on the night of 30 April and the day of 1 May
definition: Véspera do dia da festa cristã de Santa Valburga, abadessa do século VIII na Frância, celebrada na noite de 30 de abril e no dia 1 de maio. @pt-pt
definition: Kristen högtid som firas till minne av Saint Walpurga, en nunna från 700-talet. @se
definition: 4月30日晚到5月1日拂晓前，纪念八世纪的女圣徒Saint Walpurga的基督教节日 @zh-hans
definition: Der Vorabend des christlichen Festtages der Heiligen Walpurga, einer Äbtissin aus dem 8. Jahrhundert in Frankreich, der in der Nacht vom 30. April auf den 1. Mai gefeiert wird @de
in scheme: Media Topic
created: 2019-09-05T12:00:00+00:00
modified: 2021-07-12T12:00:00+00:00
broader: religious festival and holiday

Eid al-Adha
type: Concept
preferred label: eid al-adha @no-nb
preferred label: Aïd al-Adha @fr
preferred label: أضحى @ar
definition: Muslim festival marking the culmination of the annual hajj pilgrimage and commemorating the willingness of the Prophet Ibrahim to sacrifice his son
definition: Eid al-adha, också kallad för offerhögtiden, stora eid eller bakr-eid, är en av de två islamska högtidsfester som firas av muslimer över hela världen och som baserar sig på Koranen. Muslimer och druser firar den till minne av Ibrahims villighet att offra sin son enligt Guds order. @se
definition: Muslimisches Fest, das den Höhepunkt der jährlichen Hadsch-Pilgerfahrt markiert und an die Bereitschaft des Propheten Ibrahim erinnert, seinen Sohn zu opfern @de
in scheme: Media Topic
created: 2021-12-17T12:00:00+00:00
modified: 2021-12-21T12:00:00+00:00
broader: religious festival and holiday

Hanukkah
type: Concept
preferred label: hanukka @no-nb
preferred label: Chanukka @se
preferred label: Janucá @es
preferred label: Hanouka @fr
preferred label: حانوكا @ar
definition: Jewish festival, sometimes spelled Chanukah, observed by lighting the candles of a menorah
definition: Judisk högtid som kallas ljuset fest eller invigningsfesten. @se
definition: Jüdisches Fest, manchmal auch Hanukkah genannt, bei dem die Kerzen einer Menora angezündet werden @de
in scheme: Media Topic
created: 2021-12-17T12:00:00+00:00
modified: 2021-12-21T12:00:00+00:00
broader: religious festival and holiday

baptism
type: Concept
preferred label: dåb @dk
preferred label: dåp @no-nb
preferred label: batismo @pt-br
preferred label: Dop @se
preferred label: 洗礼 @zh-hans
preferred label: Taufe @de
preferred label: Baptême @fr
preferred label: Bautismo @es
preferred label: العمادة @ar
definition: En kristen ceremoni, hvor man dypper en person i vand som et symbol på renselse og dens indtræden i den kristne kirke. @dk
definition: A Christian religious rite, sometimes also called a Christening, involving the sprinkling of holy water onto a person's forehead or immersing them in water, symbolising purification and admission to the Church
definition: Rito religioso cristão, realizado através da aspersão de água benta na testa de uma pessoa ou de sua imersão na água, simbolizando a purificação e a admissão na Igreja. @pt-br
definition: Rito religioso cristão, realizado através da aspersão de água benta na testa de uma pessoa ou da sua imersão na água, simbolizando a purificação e a admissão na Igreja. @pt-pt
definition: Kristen ritual där en person får heligt vatten på sig, eller nedsänks i heligt vatten. Ska representera upptagandet i den kyrliga gemenskapen. Ofta i samband med namngivning. @se
definition: 又译受洗、施洗，一种基督教仪式，通过把圣水撒向受洗者的额头或将受洗者浸入水中来象征净化并成为教徒 @zh-hans
definition: Ein christlicher religiöser Ritus, bei dem man einer Person Weihwasser auf die Stirn spritzt oder sie in Wasser taucht, was Reinigung und Aufnahme in die Kirche symbolisiert. @de
definition: A Christian religious rite, sometimes also called a Christening, involving the sprinkling of holy water onto a person's forehead or immersing them in water, symbolizing purification and admission to the Church
in scheme: Media Topic
created: 2019-09-05T12:00:00+00:00
modified: 2021-12-17T12:00:00+00:00
broader: religious ritual

bar and bat mitzvah
type: Concept
preferred label: bar og bat mitzva @no-nb
preferred label: Bar mitzvah @se
preferred label: Bar Mitzvah y Bat Mitzvah @es
preferred label: Bar Mitzvah et Bat Mitzvah @fr
preferred label: بار متسفا وبات متسفا @ar
preferred label: Bar Mitzwa und Bat Mitzwa @de
definition: Young person becoming an adult in the Jewish faith
definition: Termerna bar mitzvah och bat mitzvah hänvisar till ritualen för att bli myndig inom judendomen. Bar används för en pojke, medan bat används för en flicka. @se
definition: Junge Menschen, die im jüdischen Glauben erwachsen werden @de
in scheme: Media Topic
created: 2021-12-17T12:00:00+00:00
modified: 2021-12-21T12:00:00+00:00
broader: religious ritual

canonisation
type: Concept
preferred label: canonization
preferred label: kanonisering @no-nb
preferred label: Helgonförklaring @se
preferred label: Canonización @es
preferred label: Canonisation @fr
preferred label: إعلان قداسة @ar
preferred label: Heiligsprechung @de
definition: The declaration of a deceased person as an officially recognised saint
definition: The declaration of a deceased person as an officially recognized saint
definition: Kanonisering, kanonisation, helgonförklaring, är den akt där kyrklig myndighet förklarar någon vara ett helgon. Ordet kanonisering härleds ur grekiskans kanonizein *reglera*, *bemyndiga*. @se
definition: Offisiell helgenkåring av ein død person. @no-nn
definition: Offisiell helgenkåring av en død person. @no-nb
definition: Die Erklärung einer verstorbenen Person als offiziell anerkannter Heiliger @de
in scheme: Media Topic
created: 2021-12-17T12:00:00+00:00
modified: 2021-12-21T12:00:00+00:00
broader: religious ritual

church
type: Concept
preferred label: Iglesia @es
preferred label: Kyrkor @se
preferred label: كنيسة @ar
preferred label: Kirche @de
preferred label: Église @fr
preferred label: igreja @pt-pt
preferred label: kirke @dk
preferred label: 教堂 @zh-hans
preferred label: kirker @no-nb
preferred label: kyrkjer @no-nn
definition: Ein erkennbares Gebäude als Ort für den Gottesdienst der christlichen Religion @de
definition: En byggnad som används för olika riter inom kristendomen. @se
definition: A building used as a place of worship for the Christian religion
definition: Em geral, edifício identificável como local de culto para a religião cristã. @pt-pt
definition: Generelt en bygning, der kan identificeres som et sted for tilbedelse for den kristne religion. @dk
definition: 通常指基督教的礼拜场所 @zh-hans
in scheme: Media Topic
created: 2009-10-22T02:00:00+00:00
modified: 2021-12-17T12:00:00+00:00
broader: religious facility
broad match: http://cv.iptc.org/newscodes/subjectcode/12000000

mosque
type: Concept
preferred label: مسجد @ar
preferred label: Moschee @de
preferred label: Mosquée @fr
preferred label: Moskeér @se
preferred label: Mezquita @es
preferred label: mesquita @pt-pt
preferred label: moské @dk
preferred label: 清真寺 @zh-hans
definition: En byggnad som används för olika riter inom islam. @se
definition: Ein erkennbares Gebäude als Ort für den Gottesdienst des Islam @de
definition: A building used as a place of worship for the Islamic religion
definition: Em geral, edifício identificável como local de culto para a religião muçulmana. @pt-pt
definition: Generelt en bygning, der kan identificeres som et sted for tilbedelse for den islamiske religion. @dk
definition: 通常指伊斯兰教的礼拜场所 @zh-hans
in scheme: Media Topic
created: 2009-10-22T02:00:00+00:00
modified: 2021-12-17T12:00:00+00:00
broader: religious facility
broad match: http://cv.iptc.org/newscodes/subjectcode/12000000

synagogue
type: Concept
preferred label: Synagogue @fr
preferred label: كنيس @ar
preferred label: Sinagoga @es
preferred label: Synagoge @de
preferred label: Synagogor @se
preferred label: sinagoga @pt-pt
preferred label: synagoge @dk
preferred label: 会堂 @zh-hans
definition: A building used as a place of worship for the Jewish religion
definition: Ein erkennbares Gebäude als Ort für den Gottesdienst des Judentums @de
definition: En byggnad som används för olika riter inom judendomen. @se
definition: Em geral, edifício identificável como local de culto para a religião judaica. @pt-pt
definition: Generelt en bygning, der kan identificeres som et sted for tilbedelse for den jødiske religion. @dk
definition: 通常指犹太宗教的礼拜场所 @zh-hans
in scheme: Media Topic
created: 2009-10-22T02:00:00+00:00
modified: 2021-12-17T12:00:00+00:00
broader: religious facility
broad match: http://cv.iptc.org/newscodes/subjectcode/12000000

temple
type: Concept
preferred label: Templo @es
preferred label: Tempel @se
preferred label: Temple @fr
preferred label: معبد @ar
preferred label: templo @pt-pt
preferred label: tempel @dk
preferred label: 寺庙 @zh-hans
definition: Ein erkennbares Gebäude als Ort für den Gottesdienst @de
definition: Generally an edifice identifiable as a place of worship
definition: En byggnad som används för olika religiösa riter. @se
definition: Em geral, edifício identificável como local de culto. @pt-pt
definition: Generelt en bygning, der kan identificeres som et sted for tilbedelse. @dk
definition: 通常指进行礼拜的场所 @zh-hans
change note: Retired in December 2021. Use religious facility (medtop:20000697) instead.
in scheme: Media Topic
created: 2009-10-22T02:00:00+00:00
retired: 2021-12-17T12:00:00+00:00
modified: 2021-02-18T12:00:00+00:00
broader: religious facility
broad match: http://cv.iptc.org/newscodes/subjectcode/12000000

pope
type: Concept
preferred label: Papa @es
preferred label: البابا @ar
preferred label: Påven @se
preferred label: Papst @de
preferred label: Pape @fr
preferred label: papa @pt-pt
preferred label: pave @dk
preferred label: 教皇 @zh-hans
definition: Head of the Roman Catholic Church worldwide
definition: Den högsta ledaren för romersk-katolska kyrkan. @se
definition: Weltweites Oberhaupt der römisch-katholischen Kirche @de
definition: Chefe da igreja católica romana no mundo. @pt-pt
definition: Den øverste leder af den romersk-katolske kirke. @dk
definition: 罗马天主教世界领袖 @zh-hans
in scheme: Media Topic
created: 2009-10-22T02:00:00+00:00
modified: 2021-12-17T12:00:00+00:00
broader: religious leader

Bible
type: Concept
preferred label: Bibeln @se
preferred label: Bibel @de
preferred label: Biblia @es
preferred label: الكتاب المقدس @ar
preferred label: Bíblia @pt-pt
preferred label: 圣经 @zh-hans
preferred label: Bibelen @no-nb
definition: Heilige Schrift des Christentums, bestehend aus dem Alten und dem Neuen Testament @de
definition: Holy book of Christianity
definition: Kristendomens heliga bok, inkluderande Gamla och Nya testamentet. @se
definition: Escrituras sagradas do cristianismo que consistem no Velho e no Novo Testamento. @pt-pt
definition: Hellige skrifter om kristendommen bestående af det gamle og nye testamente. @dk
definition: 由旧约和新约组成的基督教圣典 @zh-hans
definition: Kristendommens hellige skrift. @no-nb
in scheme: Media Topic
created: 2009-10-22T02:00:00+00:00
modified: 2021-12-17T12:00:00+00:00
broader: religious text

Qur'an
type: Concept
preferred label: Corán @es
preferred label: القرآن @ar
preferred label: Koranen @se
preferred label: Coran @fr
preferred label: Koran @de
preferred label: Alcorão @pt-pt
preferred label: 古兰经 @zh-hans
definition: Heiliges Buch des Islam @de
definition: Islams heliga bok. @se
definition: Holy book of Islam
definition: Livro sagrado do Islão. @pt-pt
definition: Livro sagrado do Islã. @pt-br
definition: Den hellige islambog. @dk
definition: 又译可兰经，伊斯兰教圣典 @zh-hans
definition: Islams hellige skrift. @no-nb
in scheme: Media Topic
created: 2009-10-22T02:00:00+00:00
modified: 2021-02-18T12:00:00+00:00
broader: religious text

Thora
type: Concept
preferred label: Toran @se
preferred label: Torah
preferred label: Tora @es
preferred label: توراة @ar
preferred label: Torá @pt-br
preferred label: 妥拉 @zh-hans
preferred label: Toraen @no-nb
definition: Heiliges Buch des Judentums @de
definition: Judendomens heliga skrifter. @se
definition: Holy book of Judaism
definition: Escrituras sagradas do judaísmo. @pt-pt
definition: Jødedommens hellige skrifter. @dk
definition: 又译托辣、托拉，为犹太教的核心 @zh-hans
definition: Jødedommens hellige skrift. @no-nb
in scheme: Media Topic
created: 2009-10-22T02:00:00+00:00
modified: 2021-12-17T12:00:00+00:00
broader: religious text

biotechnology
type: Concept
preferred label: Bioteknologi @se
preferred label: Biotechnologie @de
preferred label: Biotecnología @es
preferred label: علم التكنولوجيا الحيوية @ar
preferred label: biotecnologia @pt-pt
preferred label: bioteknologi @dk
preferred label: 生物技术 @zh-hans
definition: The scientific manipulation of living organisms and biological processes for scientific, medical or agricultural purposes
definition: Alle Aspekte des menschlichen Verständnisses sowie der methodischen Erforschung der Natur-, Form- und Sozialwissenschaften, wie Astronomie, Linguistik oder Ökonomie @de
definition: Det vetenskapliga manipulerandet av levande organismer och biologiska processer i vetenskapligt, medicinskt eller jordbrukande syfte. @se
definition: Manipulation scientifique d'organismes vivants et de processus biologiques à des fins scientifiques, médicales ou agricoles @fr
definition: Manipulación científica de organismos vivos y procesos biológicos para fines científicos, médicos o agrícolas @es
definition: Manipulação científica de organismos vivos e processos biológicos para fins científicos, médicos ou agrícolas. @pt-pt
definition: Den videnskabelige manipulation af levende organismer og biologiske processer til videnskabelige, medicinske eller landbrugsmæssige formål. @dk
definition: 以科学、医学或农业为目的，对生物体和生物学过程的科学操作 @zh-hans
in scheme: Media Topic
created: 2009-10-22T02:00:00+00:00
modified: 2021-02-18T12:00:00+00:00
broader: biomedical science

mechanical engineering
type: Concept
preferred label: Maschinenbau @de
preferred label: Maskinteknik @se
preferred label: Génie mécanique @fr
preferred label: Ingeniería mecánica @es
preferred label: هندسة ميكانيكية @ar
preferred label: engenharia mecânica @pt-pt
preferred label: maskiningeniør @dk
preferred label: 机械工程 @zh-hans
preferred label: maskinteknikk @no-nb
definition: The study and application of the design, construction and operation of mechanical systems
definition: Wissenschaft und Anwendung des Designs, der Konstruktion und des Funktionierens von mechanischen Systemen @de
definition: Vetenskapen om och användandet av design, konstruktion och hantering av mekaniska system. @se
definition: Estudo e aplicação da planificação, construção e operação de sistemas mecânicos. @pt-pt
definition: Videnskaben og brugen af design, konstruktion og håndtering af mekaniske systemer. @dk
definition: 机械系统设计、建造和运行的研究与应用 @zh-hans
in scheme: Media Topic
created: 2009-10-22T02:00:00+00:00
modified: 2021-02-18T12:00:00+00:00
broader: technology and engineering
broad match: http://cv.iptc.org/newscodes/subjectcode/13002000

astronomy
type: Concept
preferred label: Astronomía @es
preferred label: Astronomi @se
preferred label: Astronomie @de
preferred label: فلك @ar
preferred label: astronomia @pt-pt
preferred label: astronomi @dk
preferred label: 天文学 @zh-hans
definition: Das Studium von Himmelsobjekten durch direkte Beobachtung und theoretische Modelle @de
definition: Kunskapen om och det vetenskapliga studiet av himlakroppar och andra naturföreteelser utanför planeten jorden. @se
definition: The study of celestial objects through direct observation and theoretical models
definition: Etude des objets célestes réalisée par une observation directe et des modèles théoriques @fr
definition: El estudio de objetos celestes a través de la observación directa y de modelos teóricos @es
definition: Estudo de objetos celestes através da observação direta e de modelos teóricos. @pt-pt
definition: Undersøgelse af himmelobjekter gennem direkte observation og teoretiske modeller. @dk
definition: 通过直接观测和理论模型研究天体的科学 @zh-hans
in scheme: Media Topic
created: 2009-10-22T02:00:00+00:00
modified: 2021-02-18T12:00:00+00:00
broader: natural science

biology
type: Concept
preferred label: Biologi @se
preferred label: Biologie @de
preferred label: Biología @es
preferred label: علم الاحياء @ar
preferred label: biologia @pt-pt
preferred label: biologi @dk
preferred label: 生物学 @zh-hans
definition: Vetenskapen om de levande organismerna. @se
definition: The study of the anatomy, behaviour, origin, physiology and other aspects of living organisms
definition: Das Studium der Anatomie, des Verhaltens, der Herkunft, der Physiologie und anderer Aspekte lebender Organismen @de
definition: Etude de l'anatomie, du comportement, de l'origine, de la physiologie et d'autres aspects des organismes vivants @fr
definition: El estudio de la anatomía, comportamiento, origen, fisiología y otros aspectos de los organismos vivos @es
definition: Estudo da anatomia, do comportamento, da origem, da fisiologia e de outros aspetos dos organismos vivos. @pt-pt
definition: Estudo da anatomia, do comportamento, da origem, da fisiologia e de outros aspectos dos organismos vivos. @pt-br
definition: Videnskaben om de levende organismer. @dk
definition: 研究生物的解剖、行为、起源、生理学和其他方面的科学 @zh-hans
definition: The study of the anatomy, behavior, origin, physiology and other aspects of living organisms
in scheme: Media Topic
created: 2009-10-22T02:00:00+00:00
modified: 2021-02-18T12:00:00+00:00
broader: natural science
narrower: botany
narrower: genetics
narrower: palaeontology
narrower: physiology
narrower: zoology

chemistry
type: Concept
preferred label: Química @es
preferred label: Kemi @se
preferred label: Chemie @de
preferred label: كيمياء @ar
preferred label: Chimie @fr
preferred label: química @pt-pt
preferred label: kemi @dk
preferred label: 化学 @zh-hans
preferred label: kjemi @no-nb
definition: Vetenskapen om materiella ämnens sammansättning, egenskaper och omvandlingar. @se
definition: The study of the composition and properties of matter on the scale of atoms and molecules, and of the reactions between compounds
definition: Die Untersuchung der Zusammensetzung und Eigenschaften der Materie auf der Skala der Atome und Moleküle und der Reaktionen zwischen den Verbindungen @de
definition: Etude de la composition et des propriétés de la matière à l'échelle des atomes et des molécules et des réactions entre les composés @fr
definition: El estudio de la composición y propiedades de la materia en la escala de átomos y moléculas, y de las reacciones entre compuestos @es
definition: Estudo da composição e propriedades da matéria à escala dos átomos e das moléculas e das reações entre compostos. @pt-pt
definition: Undersøgelsen af stoffets sammensætning og egenskaber i skalaen fra atomer og molekyler og af reaktionerne mellem forbindelser. @dk
definition: 在原子和分子的尺度上研究物质的组成和性质，以及化合物之间的反应的学科 @zh-hans
in scheme: Media Topic
created: 2009-10-22T02:00:00+00:00
modified: 2021-02-18T12:00:00+00:00
broader: natural science

cosmology
type: Concept
preferred label: Kosmologie @de
preferred label: Cosmología @es
preferred label: Kosmologi @se
preferred label: علم الكون @ar
preferred label: Cosmologie @fr
preferred label: cosmologia @pt-pt
preferred label: kosmologi @dk
preferred label: 宇宙学 @zh-hans
definition: Die Erforschung der Entstehung, Entwicklung, Organisation und Struktur des Universums @de
definition: Vetenskapen om universums storskaliga byggnad, uppkomst och utveckling. @se
definition: The study of the origin, evolution, organisation and structure of the universe
definition: Etude de l'origine, de l'évolution, de l'organisation et de la structure de l'univers @fr
definition: El estudio del origen, la evolución, la organización y la estructura del universo @es
definition: Estudo da origem, evolução, organização e estrutura do universo. @pt-pt
definition: Undersøgelsen af universets oprindelse, evolution, organisering og struktur. @dk
definition: 研究宇宙起源、演化、组织和结构的学科 @zh-hans
definition: The study of the origin, evolution, organization and structure of the universe
in scheme: Media Topic
created: 2009-10-22T02:00:00+00:00
modified: 2021-02-18T12:00:00+00:00
broader: natural science

geology
type: Concept
preferred label: Geologi @se
preferred label: Geologie @de
preferred label: Geología @es
preferred label: علم طبقات الارض @ar
preferred label: Géologie @fr
preferred label: geologia @pt-pt
preferred label: geologi @dk
preferred label: 地质学 @zh-hans
definition: The study of Earth's physical processes, material structures and its properties
definition: Vetenskapen om jorden. @se
definition: Untersuchung der physikalischen Prozesse, der materiellen Strukturen und der Eigenschaften der Erde @de
definition: Etude des processus physiques, des structures matérielles et des propriétés de la Terre @fr
definition: El estudio de los procesos físicos, estructuras materiales y propiedades de la Tierra @es
definition: Estudo dos processos físicos da Terra, das estruturas de materiais e das suas propriedades. @pt-pt
definition: Undersøgelsen af Jordens fysiske processer, materielle strukturer og dens egenskaber. @dk
definition: 研究地球物理过程、物质结构及其性质的学科 @zh-hans
in scheme: Media Topic
created: 2009-10-22T02:00:00+00:00
modified: 2021-02-18T12:00:00+00:00
broader: natural science

horticulture
type: Concept
preferred label: Horticulture @fr
preferred label: Hortikultur @se
preferred label: Horticultura @es
preferred label: علم الاشجار @ar
preferred label: Gartenbau @de
preferred label: horticultura @pt-pt
preferred label: havebrug @dk
preferred label: 园艺 @zh-hans
preferred label: hagebruk/hortikultur @no-nb
definition: Vetenskapen om och konsten att odla, inklusive landskapsdesign. @se
definition: The study and art of plant cultivation, including landscape and garden design and plant conservation
definition: Studium und Kunst der Pflanzenzucht, einschließlich Landschafts- und Gartengestaltung und Pflanzenschutz @de
definition: Etude et l'art de la culture des plantes, comprenant la conception des paysages et des jardins et la conservation des plantes @fr
definition: El estudio y el arte del cultivo de plantas, incluyendo el diseño de paisajes y jardines y la conservación de plantas @es
definition: Estudo e arte do cultivo de plantas, incluindo design paisagístico e de jardins e conservação de plantas. @pt-pt
definition: Undersøgelse og kunst af plantedyrkning, herunder landskabs- og havedesign og plantebeskyttelse. @dk
definition: 植物栽培的研究和艺术，包括园林设计和植物保护 @zh-hans
in scheme: Media Topic
created: 2009-10-22T02:00:00+00:00
modified: 2021-02-18T12:00:00+00:00
broader: natural science
broad match: http://cv.iptc.org/newscodes/subjectcode/13004000

marine science
type: Concept
preferred label: Meeresforschung @de
preferred label: علوم بحرية @ar
preferred label: Oceanografía @es
preferred label: Oceanografi @se
preferred label: Océanographie @fr
preferred label: ciências marinhas @pt-pt
preferred label: marinevidenskab @dk
preferred label: 海洋科学 @zh-hans
preferred label: havforskning @no-nb
preferred label: havforsking @no-nn
definition: Vetenskapen om havet. @se
definition: The study of living organisms and environments in saltwater ecosystems
definition: Untersuchung von Lebewesen und Lebensräumen in Salzwasser-Ökosystemen @de
definition: Etude des organismes vivants et des environnements dans les écosystèmes d'eau salée @fr
definition: El estudio de los organismos vivos y su entorno en ecosistemas de agua salada @es
definition: Estudo de organismos vivos e de ambientes em ecossistemas de água salgada. @pt-pt
definition: Undersøgelsen af levende organismer og miljøer i saltvand økosystemer. @dk
definition: 咸水生态系统中生物与环境的研究 @zh-hans
in scheme: Media Topic
created: 2009-10-22T02:00:00+00:00
modified: 2021-02-18T12:00:00+00:00
broader: natural science

meteorology
type: Concept
preferred label: Meteorología @es
preferred label: ارصاد جوية @ar
preferred label: Meteorologi @se
preferred label: Meteorologie @de
preferred label: Climatologie @fr
preferred label: meteorologia @pt-pt
preferred label: meteorologi @dk
preferred label: 气象学 @zh-hans
definition: Vetenskapen om atmosfärens fysik och kemi. @se
definition: The study of atmospheric chemistry and physics, with a focus on weather forecasting
definition: Studium der Atmosphärenchemie und -physik mit Schwerpunkt Wettervorhersage @de
definition: Etude de la chimie et de la physique de l'atmosphère, en particulier des prévisions météorologiques @fr
definition: El estudio de la química y física atmosférica, con un enfoque en la predicción del tiempo @es
definition: Estudo da química e da física da atmosfera e física, com o foco na previsão do tempo. @pt-pt
definition: Undersøgelsen af atmosfærisk kemi og fysik med fokus på vejrprognose. @dk
definition: 研究大气及其物理现象的科学，以天气预报为重点 @zh-hans
in scheme: Media Topic
created: 2009-10-22T02:00:00+00:00
modified: 2021-02-18T12:00:00+00:00
broader: natural science

physics
type: Concept
preferred label: Physique @fr
preferred label: Fysik @se
preferred label: Física @es
preferred label: Physik @de
preferred label: فيزياء @ar
preferred label: física @pt-pt
preferred label: fysik @dk
preferred label: 物理学 @zh-hans
preferred label: fysikk @no-nb
definition: The study of the movement and structure of matter, and how it relates to energy
definition: Die Untersuchung der Bewegung und Struktur der Materie und ihrer Beziehung zur Energie @de
definition: Vetenskapen om materiens struktur på grundläggande nivå och dess uppträdande under skilda betingelser. @se
definition: Etude du mouvement et de la structure de la matière et de son lien avec l'énergie @fr
definition: El estudio del movimiento y de la estructura de la materia, y cómo se relaciona con la energía @es
definition: Estudo do movimento e estrutura da matéria e de como ela se relaciona com a energia. @pt-pt
definition: Undersøgelsen af materiens bevægelse og struktur, og hvordan den forholder sig til energi. @dk
definition: 研究物质的运动和结构，以及它与能量关系的学科 @zh-hans
in scheme: Media Topic
created: 2009-10-22T02:00:00+00:00
modified: 2021-02-18T12:00:00+00:00
broader: natural science
narrower: electromagnetism
narrower: nuclear physics

botany
type: Concept
preferred label: Botanik @se
preferred label: Botánica @es
preferred label: علم نباتات @ar
preferred label: Botanique @fr
preferred label: botânica @pt-pt
preferred label: botanik @dk
preferred label: 植物学 @zh-hans
preferred label: botanikk @no-nb
definition: Untersuchung der physikalischen und physiologischen Struktur, der Genetik, der Ökologie und anderer Aspekte von Pflanzen @de
definition: Vetenskapen om växterna. @se
definition: The study of the physical and physiological structure, genetics, ecology and other aspects of plants
definition: Etude de la structure physique et physiologique, de la génétique, de l'écologie et d'autres aspects des plantes @fr
definition: El estudio de la estructura física y fisiológica, la genética, la ecología y otros aspectos de las plantas @es
definition: Estudo da estrutura física e fisiológica, da genética, da ecologia e de outros aspetos das plantas. @pt-pt
definition: Estudo da estrutura física e fisiológica, da genética, da ecologia e de outros aspectos das plantas. @pt-br
definition: Planternes videnskab. @dk
definition: 研究植物的物理和生理结构、遗传学、生态学等方面的科学 @zh-hans
in scheme: Media Topic
created: 2009-10-22T02:00:00+00:00
modified: 2021-02-18T12:00:00+00:00
broader: biology

genetics
type: Concept
preferred label: Genetik @se
preferred label: Génétique @fr
preferred label: علم الوراثة @ar
preferred label: Genética @es
preferred label: genética @pt-pt
preferred label: genetik @dk
preferred label: 遗传学 @zh-hans
preferred label: genetikk @no-nb
definition: The study of genes in living organisms, and of their role in heredity, development or genetic adaptation
definition: Die Erforschung von Genen in lebenden Organismen und ihrer Rolle bei Vererbung, Entwicklung oder genetischer Anpassung @de
definition: Vetenskap som omfattar studiet av arvsmassans uppbyggnad och funktion, uppkomst av förändringar av arvsanlagen samt biologisk variation. @se
definition: Etude des gènes dans les organismes vivants et leur rôle dans l'hérédité, le développement ou l'adaptation génétique @fr
definition: El estudio de los genes en organismos vivos y su papel en la herencia, el desarrollo o la adaptación genética @es
definition: Estudo de genes em organismos vivos e do seu papel na hereditariedade, no desenvolvimento ou na adaptação genética. @pt-pt
definition: Estudo de genes em organismos vivos e de seu papel na hereditariedade, no desenvolvimento ou na adaptação genética. @pt-br
definition: Undersøgelse af gener i levende organismer og af deres rolle i arvelighed, udvikling eller genetisk tilpasning. @dk
definition: 研究生物体中的基因及其在遗传、发育或遗传适应中作用的科学 @zh-hans
in scheme: Media Topic
created: 2009-10-22T02:00:00+00:00
modified: 2021-02-18T12:00:00+00:00
broader: biology

palaeontology
type: Concept
preferred label: Paléontologie @fr
preferred label: Paläontologie @de
preferred label: Paleontología @es
preferred label: علم المتحجرات @ar
preferred label: Paleontologi @se
preferred label: paleontologia @pt-pt
preferred label: palæontologi @dk
preferred label: 古生物学 @zh-hans
preferred label: paleontologi @no-nb
preferred label: paleontology
definition: Studium ausgestorbener Tiere und Fossilien @de
definition: Vetenskapen om utdöda livsformer och om hur de utvecklades och levde. @se
definition: The study of prehistoric life forms, geological periods and fossils
definition: Estudo de formas de vida pré-históricas, períodos geológicos e fósseis. @pt-pt
definition: Undersøgelsen af forhistoriske livsformer, geologiske perioder og fossiler. @dk
definition: 研究史前生命形态、地质时期及化石的科学 @zh-hans
in scheme: Media Topic
created: 2009-10-22T02:00:00+00:00
modified: 2021-02-18T12:00:00+00:00
broader: biology

physiology
type: Concept
preferred label: Physiologie @de
preferred label: فيزيولوجيا (علم وظائف الاعضاء) @ar
preferred label: Fysiologi @se
preferred label: Fisiología @es
preferred label: fisiologia @pt-pt
preferred label: fysiologi @dk
preferred label: 生理学 @zh-hans
definition: Untersuchung der Lebensprozesse, inneren Organe oder Funktionsmechanismen lebender Organismen @de
definition: Vetenskapen om hur levande organismer, deras organ och vävnader fungerar. @se
definition: The study of the vital processes, internal organs or functional mechanisms of living organisms
definition: Etude des processus vitaux, des organes internes ou des mécanismes fonctionnels des organismes vivants @fr
definition: El estudio de los procesos vitales, de los órganos internos o de los mecanismos funcionales de los organismos vivos @es
definition: Estudo dos processos vitais, órgãos internos ou mecanismos funcionais dos organismos vivos. @pt-pt
definition: Undersøgelse af de vitale processer, indre organer eller funktionelle mekanismer i levende organismer. @dk
definition: 研究生物体的生命过程、内部器官或功能机制的科学 @zh-hans
in scheme: Media Topic
created: 2009-10-22T02:00:00+00:00
modified: 2021-02-18T12:00:00+00:00
broader: biology

zoology
type: Concept
preferred label: Zoologie @de
preferred label: Zoologi @se
preferred label: علم حيوانات @ar
preferred label: Zoología @es
preferred label: zoologia @pt-pt
preferred label: zoologi @dk
preferred label: 动物学 @zh-hans
definition: Vetenskapen om djuren. @se
definition: Das Studium der Biologie, Physiologie, Entwicklung, Verhalten oder andere Aspekte der Tiere @de
definition: The study of the biology, physiology, development, behaviour or other aspects of animals
definition: Etude de la biologie, de la physiologie, du développement, du comportement ou d'autres aspects des animaux @fr
definition: El estudio de la biología, de la fisiología, del desarrollo, del comportamiento u otros aspectos de los animales @es
definition: Estudo da biologia, da fisiologia, do desenvolvimento, do comportamento ou de outros aspetos dos animais. @pt-pt
definition: Estudo da biologia, da fisiologia, do desenvolvimento, do comportamento ou de outros aspectos dos animais. @pt-br
definition: Undersøgelsen af biologi, fysiologi, udvikling, adfærd eller andre aspekter af dyr. @dk
definition: 研究动物的生物学、生理学、发育、行为或其它方面的科学 @zh-hans
definition: The study of the biology, physiology, development, behavior or other aspects of animals
in scheme: Media Topic
created: 2009-10-22T02:00:00+00:00
modified: 2021-02-18T12:00:00+00:00
broader: biology

electromagnetism
type: Concept
preferred label: Electromagnetismo @es
preferred label: Elektromagnetismus @de
preferred label: Elektromagnetism @se
preferred label: Électromagnétisme @fr
preferred label: كهرمغناطيس @ar
preferred label: eletromagnetismo @pt-pt
preferred label: elektromagnetisme @dk
preferred label: 电磁学 @zh-hans
definition: The study of the physical interactions between electrically charged particles and magnetic fields
definition: Untersuchung der physikalischen Wechselwirkungen zwischen elektrisch geladenen Teilchen und Magnetfeldern @de
definition: Vetenskapen om sambandet mellan elektricitet och magnetism. @se
definition: Etude des interactions physiques entre particules chargées électriquement et champs magnétiques @fr
definition: El estudio de las interacciones físicas entre partículas cargadas eléctricamente y campos magnéticos @es
definition: Estudo das interações físicas entre partículas carregadas eletricamente e campos magnéticos. @pt-pt
definition: Undersøgelsen af de fysiske interaktioner mellem elektrisk ladede partikler og magnetiske felter. @dk
definition: 研究带电粒子与磁场之间物理相互作用的学科 @zh-hans
in scheme: Media Topic
created: 2009-10-22T02:00:00+00:00
modified: 2021-07-12T12:00:00+00:00
broader: physics
broad match: http://cv.iptc.org/newscodes/subjectcode/13001001

nuclear physics
type: Concept
preferred label: Kärnfysik @se
preferred label: فيزياء نووية @ar
preferred label: Physique nucléaire @fr
preferred label: Atomphysik @de
preferred label: Física nuclear @es
preferred label: física nuclear @pt-pt
preferred label: atomfysik @dk
preferred label: 核物理 @zh-hans
preferred label: kjernefysikk @no-nb
definition: The study of the structure and behaviour of atomic nuclei
definition: Vetenskapen om atomkärnornas struktur och kärnmateriens egenskaper. @se
definition: Untersuchung der Struktur und des Verhaltens von Atomkernen @de
definition: Etude de la structure et du comportement des noyaux atomiques @fr
definition: El estudio de la estructura y el comportamiento de los núcleos atómicos @es
definition: Estudo da estrutura e comportamento dos núcleos atómicos. @pt-pt
definition: Estudo da estrutura e comportamento dos núcleos atômicos. @pt-br
definition: Undersøgelsen af atomkerners struktur og opførsel. @dk
definition: 研究原子核的结构和变化规律的学科 @zh-hans
definition: The study of the structure and behavior of atomic nuclei
in scheme: Media Topic
created: 2009-10-22T02:00:00+00:00
modified: 2021-02-18T12:00:00+00:00
broader: physics
narrower: particle physics
broad match: http://cv.iptc.org/newscodes/subjectcode/13001001

particle physics
type: Concept
preferred label: Physique des particules @fr
preferred label: Teilchenphysik @de
preferred label: Partículas físicas @es
preferred label: فيزياء الجزيئات @ar
preferred label: Partikelfysik @se
preferred label: física de partículas @pt-pt
preferred label: partikelfysik @dk
preferred label: 粒子物理 @zh-hans
preferred label: partikkelfysikk @no-nb
definition: Die Untersuchung der Natur, der Eigenschaften und der Wechselwirkungen der Elementarteilchen, die die Materie ausmachen @de
definition: The study of the nature, properties and interactions of the elementary particles that constitute matter
definition: Vetenskapen om materiens minsta beståndsdelar, dessas struktur och inbördes växelverkan. @se
definition: Etude de la nature, des propriétés et des interactions des particules élémentaires constituant la matière @fr
definition: El estudio de la naturaleza, de las propiedades e interacciones de las partículas elementales que constituyen la materia @es
definition: Estudo da natureza, das propriedades e das interações das partículas elementares que constituem matéria. @pt-pt
definition: Videnskaben for de mindste bestanddele af stof, deres struktur og deres interaktion. @dk
definition: 对构成物质的基本粒子的性质、性质和相互作用的研究 @zh-hans
in scheme: Media Topic
created: 2009-10-22T02:00:00+00:00
modified: 2021-02-18T12:00:00+00:00
broader: nuclear physics

scientific innovation
type: Concept
preferred label: Innovación científica @es
preferred label: Innovation scientifique @fr
preferred label: Upptäckter och uppfinningar @se
preferred label: اكتشاف وابتكار @ar
preferred label: Forschung und Entwicklung @de
preferred label: inovação científica @pt-pt
preferred label: videnskabelig innovation @dk
preferred label: 科学创新 @zh-hans
preferred label: innovasjon @no-nb
definition: Die Entwicklung oder Schaffung neuer wissenschaftlicher oder technologischer Produkte oder Verfahren, wie z.B. biotechnologische oder künstliche Intelligenzanwendungen, robotische Gliedmaßen oder nanoskalige Kameras @de
definition: The development or creation of new scientific or technological products or processes, such as biotech or artificial intelligence applications, robotic limbs or nanoscale cameras
definition: Utvecklandet eller skapandet av nya vetenskapliga eller tekniska produkter eller processer, t ex AI-applikationer, robotarmar och nanokameror. @se
definition: Développement ou création de nouveaux produits ou processus scientifiques ou technologiques, tels que les applications biotechnologiques ou d'intelligence artificielle, les membres robotiques ou les caméras à l'échelle nanométrique @fr
definition: El desarrollo o la creación de nuevos productos o procesos científicos o tecnológicos, como aplicaciones de biotecnología o inteligencia artificial, miembros robóticos o cámaras a nanoescala @es
definition: Desenvolvimento ou criação de novos produtos ou processos científicos ou tecnológicos, como aplicações de biotecnologia ou de inteligência artificial, membros robóticos ou câmaras à escala nanométrica. @pt-pt
definition: Udvikling eller oprettelse af nye videnskabelige eller teknologiske produkter eller processer, såsom AI-applikationer, robotarme og nanokameraer. @dk
definition: 开发或创造新的科学或技术产品或工艺，如生物技术或人工智能应用、机械臂或纳米照相机 @zh-hans
in scheme: Media Topic
created: 2009-10-22T02:00:00+00:00
modified: 2021-02-18T12:00:00+00:00
broader: scientific research
broad match: http://cv.iptc.org/newscodes/subjectcode/13006000

medical research
type: Concept
preferred label: ابحاث طبية @ar
preferred label: Medicinsk forskning @se
preferred label: Investigación médica @es
preferred label: Medizinische Forschung @de
preferred label: Recherche médicale @fr
preferred label: investigação médica @pt-pt
preferred label: medicinsk forskning @dk
preferred label: 医学研究 @zh-hans
preferred label: medisinsk forskning @no-nb
preferred label: medisinsk forsking @no-nn
definition: Forskning inom hälsa och medicin, såsom genetiska studier, undersökning av sjukdomar eller farmaceutiska tester. @se
definition: Untersuchungen in den Bereichen Gesundheit und Medizin, wie z.B. genetische Studien, Krankheitsforschung oder Arzneimittelversuche @de
definition: Investigation conducted in the fields of health and medicine, such as genetic studies, disease research or pharmaceutical drug trials
definition: Investigation menée dans les domaines de la santé et de la médecine, tels que les études génétiques, la recherche sur les maladies ou les essais pharmaceutiques @fr
definition: Investigación llevada a cabo en los campos de la salud y la medicina, como estudios genéticos, investigación de enfermedades o ensayos de medicamentos farmacéuticos @es
definition: Investigação nas áreas de saúde e medicina, como estudos genéticos, pesquisa de doenças ou testes de drogas farmacêuticas. @pt-pt
definition: Undersøgelse foretaget inden for sundhed og medicin, såsom genetiske studier, sygdomsforskning eller farmaceutiske lægemiddelforsøg. @dk
definition: 在健康和医学领域进行的调查，如基因研究、疾病研究或药物试验 @zh-hans
in scheme: Media Topic
created: 2009-10-22T02:00:00+00:00
modified: 2021-02-18T12:00:00+00:00
broader: scientific research

scientific exploration
type: Concept
preferred label: Exploration scientifique @fr
preferred label: Exploración científica @es
preferred label: Vetenskaplig expedition @se
preferred label: استكشاف علمي @ar
preferred label: Wissenschaftliche Forschung @de
preferred label: exploração científica @pt-pt
preferred label: videnskabelig ekspedition @dk
preferred label: 科学探索 @zh-hans
preferred label: vitenskapelig ekspedisjon @no-nb
preferred label: vitskapleg ekspedisjon @no-nn
definition: Land, sea or space journeys undertaken to discover new information
definition: Land-, See- oder Weltraumreisen zur Entdeckung neuer Informationen @de
definition: Land-, havs- eller rymdfärder med syfte att samla in ny information. @se
definition: Voyages terrestres, maritimes ou spatiaux entrepris pour découvrir de nouvelles informations @fr
definition: Viajes terrestres, marítimos o espaciales llevados a cabo para descubrir nueva información @es
definition: Viagens em terra, no mar ou no espaço para descobrir novas informações. @pt-pt
definition: Land-, sø- eller rumrejser, der er foretaget for at finde nye oplysninger. @dk
definition: 为发现新信息而在陆地、海洋或太空中进行的探索活动 @zh-hans
in scheme: Media Topic
created: 2009-10-22T02:00:00+00:00
modified: 2021-02-18T12:00:00+00:00
broader: scientific research
narrower: space exploration

scientific publication
type: Concept
preferred label: دراسة علمية @ar
preferred label: Vetenskaplig avhandling @se
preferred label: Publicación científica @es
preferred label: Wissenschaftliche Veröffentlichung @de
preferred label: Publication scientifique @fr
preferred label: publicação científica @pt-pt
preferred label: videnskabelig publikation @dk
preferred label: 科技出版物 @zh-hans
preferred label: vitenskapelig publisering @no-nb
preferred label: vitskapleg publisering @no-nn
definition: Ett vetenskapligt arbete, oftast i bokform, som beskriver ett forskningsområde och resultat. @se
definition: Academic research findings published in a journal, book or thesis
definition: Wissenschaftliche Forschungsergebnisse, die in einer Zeitschrift, einem Buch oder einer Dissertation veröffentlicht wurden @de
definition: Résultats de recherches académiques publiés dans une revue, un livre ou une thèse @fr
definition: Resultados de la investigación académica publicados en una revista, libro o tesis @es
definition: Resultados de investigação académica publicados numa publicação periódica, num livro ou numa tese. @pt-pt
definition: Resultados de pesquisa acadêmica publicados em uma publicação periódica, em um livro ou em uma tese. @pt-br
definition: Akademiske forskningsresultater offentliggjort i et tidsskrift, bog eller speciale. @dk
definition: 发表在期刊、书籍或论文上的学术研究成果 @zh-hans
in scheme: Media Topic
created: 2009-10-22T02:00:00+00:00
modified: 2021-02-18T12:00:00+00:00
broader: scientific research
broad match: http://cv.iptc.org/newscodes/subjectcode/13006000

space exploration
type: Concept
preferred label: Exploration de l'Espace @fr
preferred label: Rymdforskning @se
preferred label: Exploración espacial @es
preferred label: Weltraumforschung @de
preferred label: برنامج فضائي @ar
preferred label: exploração espacial @pt-pt
preferred label: rumfart @dk
preferred label: 太空探索 @zh-hans
preferred label: romferd @no-nb
preferred label: romforsking @no-nn
definition: Die wissenschaftliche Erforschung des Weltraums durch bemannte und unbemannte Missionen @de
definition: The scientific exploration of outer space through manned and unmanned missions
definition: Det vetenskapliga utforskandet av yttre rymden genom bemannade och obemannade rymdfärder. @se
definition: Exploration scientifique de l'espace à travers des missions habitées et non habitées @fr
definition: La exploración científica del espacio exterior a través de misiones tripuladas y no tripuladas @es
definition: Exploração científica do espaço sideral através de missões tripuladas e não tripuladas. @pt-pt
definition: Den videnskabelige udforskning af det ydre rum gennem bemandede og ubemandede missioner. @dk
definition: 通过载人和无人飞行任务对外层空间进行科学探索 @zh-hans
in scheme: Media Topic
created: 2009-10-22T02:00:00+00:00
modified: 2021-02-18T12:00:00+00:00
broader: scientific exploration

anthropology
type: Concept
preferred label: Antropología @es
preferred label: Anthropologie @de
preferred label: Antropologi @se
preferred label: علم انسان @ar
preferred label: antropologia @pt-pt
preferred label: antropologi @dk
preferred label: 人类学 @zh-hans
definition: Vetenskapen om människosläktets utveckling och fysiska karakteristika samt världens olika kultur- och samhällstyper. @se
definition: The study of human behaviour and social interactions across time
definition: Die Untersuchung des menschlichen Verhaltens und der sozialen Interaktionen im Zeitablauf @de
definition: Etude du comportement humain et des interactions sociales dans le temps @fr
definition: El estudio del comportamiento humano y las interacciones sociales a lo largo del tiempo @es
definition: Estudo do comportamento humano e das interações sociais ao longo do tempo. @pt-pt
definition: Videnskab af menneskelig adfærd og sociale interaktioner på tværs af tiden. @dk
definition: 研究人类行为和社会互动的学科 @zh-hans
definition: The study of human behavior and social interactions across time
in scheme: Media Topic
created: 2009-10-22T02:00:00+00:00
modified: 2021-02-18T12:00:00+00:00
broader: social sciences

archaeology
type: Concept
preferred label: Arqueología @es
preferred label: Arkeologi @se
preferred label: علم آثار @ar
preferred label: Archäologie @de
preferred label: Archéologie @fr
preferred label: arqueologia @pt-pt
preferred label: arkæologi @dk
preferred label: 考古学 @zh-hans
preferred label: arkeologi @no-nb
preferred label: archeology
definition: Das Studium der menschlichen Tätigkeit im Laufe der Zeit und der Kulturgeschichte unter Verwendung von Artefakten, die von alten Völkern zurückgelassen wurden @de
definition: Vetenskap som med stöd av materiella lämningar studerar äldre tiders mänskliga kultur. @se
definition: The study of human activity throughout time and cultural history, using artefacts left behind by ancient peoples
definition: Etude de l'activité humaine à travers le temps et l'histoire culturelle, en utilisant des objets laissés par des peuples anciens @fr
definition: El estudio de la actividad humana a lo largo del tiempo y de la historia cultural a través de artefactos que dejaron los pueblos antiguos @es
definition: Estudo da atividade humana ao longo do tempo e da história cultural, usando artefactos deixados por povos antigos. @pt-pt
definition: Estudo da atividade humana ao longo do tempo e da história cultural, usando artefatos deixados por povos antigos. @pt-br
definition: Videnskab af menneskelig aktivitet gennem tid og kulturhistorie ved hjælp af artefakter, der er efterladt af gamle folk. @dk
definition: 利用古代人留下的文物，研究人类在整个时代和文化史上活动的学科 @zh-hans
in scheme: Media Topic
created: 2009-10-22T02:00:00+00:00
modified: 2021-02-18T12:00:00+00:00
broader: social sciences

economics
type: Concept
preferred label: Sciences économiques @fr
preferred label: Wirtschaftswissenschaft @de
preferred label: اقتصاد @ar
preferred label: Ekonomivetenskap @se
preferred label: Ciencias económicas @es
preferred label: economia @pt-pt
preferred label: økonomi (videnskab) @dk
preferred label: 经济学 @zh-hans
preferred label: økonomisk vitenskap @no-nb
preferred label: økonomisk vitskap @no-nn
definition: Das Studium der Gesetze und Prinzipien der Wirtschaft, wie z.B. der Produktion und des Vertriebs von Waren und Dienstleistungen @de
definition: Vetenskapen om resursers bildande, organisation och användning. @se
definition: The study of the laws and principles of economies, such as the production and distribution of goods and services
definition: Etude des lois et des principes des économies, tels que la production et la distribution de biens et de services @fr
definition: El estudio de las leyes y de los principios de la economía, como la producción y distribución de bienes y servicios @es
definition: Estudo das leis e princípios das economias, como a produção e distribuição de bens e serviços. @pt-pt
definition: Videnskab af økonomiernes love og principper, såsom produktion og distribution af varer og tjenester. @dk
definition: 研究经济规律和原则的学科，如商品和服务的生产和分配 @zh-hans
in scheme: Media Topic
created: 2009-10-22T02:00:00+00:00
modified: 2021-02-18T12:00:00+00:00
broader: social sciences
broad match: http://cv.iptc.org/newscodes/subjectcode/04017000

geography
type: Concept
preferred label: Géographie @fr
preferred label: Geografie @de
preferred label: Geografi @se
preferred label: جغرافيا @ar
preferred label: Geografía @es
preferred label: geografia @pt-pt
preferred label: geografi @dk
preferred label: 地理学 @zh-hans
definition: Vetenskapen om natur- och kulturlandskapets bildning, framväxt och förändringar och om samspelet mellan naturgivna och kulturbetingade förhållanden samt om rumsliga samband. @se
definition: Die Untersuchung der physikalischen Eigenschaften der Erdoberfläche und ihrer politischen Spaltungen @de
definition: The study of the physical features of the surface of Earth and its political divisions
definition: Etude des caractéristiques physiques de la surface de la Terre et de ses divisions politiques @fr
definition: El estudio de las características físicas de la superficie de la Tierra y sus divisiones políticas @es
definition: Estudo das características físicas da superfície da Terra e das suas divisões políticas. @pt-pt
definition: Estudo das características físicas da superfície da Terra e de suas divisões políticas. @pt-br
definition: Videnskaben af de fysiske træk ved jordoverfladen og dens politiske opdelinger. @dk
definition: 研究地球表面物理特征及其政治区划的学科 @zh-hans
in scheme: Media Topic
created: 2009-10-22T02:00:00+00:00
modified: 2021-02-18T12:00:00+00:00
broader: social sciences

history
type: Concept
preferred label: Historia @es
preferred label: تاريخ @ar
preferred label: Geschichte @de
preferred label: Histoire @fr
preferred label: história @pt-pt
preferred label: historie @dk
preferred label: 历史学 @zh-hans
definition: Wissenschaft menschlicher Ereignisse der Vergangenheit @de
definition: The study of human events of the past
definition: Vetenskapen om allt som hänt i människosläktets förflutna och utforskning och beskrivning av detta. @se
definition: Estudo de eventos humanos do passado. @pt-pt
definition: Videnskaben om alt, hvad der er sket i fortiden med den menneskelige race, og udforskningen og beskrivelsen af den. @dk
definition: 研究过去人类事件的学科 @zh-hans
in scheme: Media Topic
created: 2009-10-22T02:00:00+00:00
modified: 2021-02-18T12:00:00+00:00
broader: social sciences

information science
type: Concept
preferred label: Ciencias de la información @es
preferred label: Informationswissenschaft @de
preferred label: Informationsvetenskap @se
preferred label: Sciences de l'information @fr
preferred label: علم المعلومات @ar
preferred label: ciências da informação @pt-pt
preferred label: informationsvidenskab @dk
preferred label: 信息科学 @zh-hans
preferred label: informasjonsvitenskap @no-nb
preferred label: informasjonsvitskap @no-nn
definition: The study and practice of collecting, classifying, storing, retrieving and disseminating information
definition: Das Studium und die Praxis des Sammelns, Klassifizierens, Speicherns, Abrufens und Verbreitens von Informationen @de
definition: Brett vetenskapligt område knutet till studier av information, samt behandling av sådan i form av data. @se
definition: Etude et pratique de la collecte, de la classification, du stockage, de la récupération et de la diffusion de l'information @fr
definition: El estudio y la práctica de recopilar, clasificar, almacenar, recuperar y diseminar información @es
definition: Estudo e prática de recolher, classificar, armazenar, recuperar e disseminar informação. @pt-pt
definition: Videnskaben og praksis med at indsamle, klassificere, lagre, hente og formidle information. @dk
definition: 信息收集、分类、存储、检索和传播的研究与实践 @zh-hans
in scheme: Media Topic
created: 2009-10-22T02:00:00+00:00
modified: 2021-02-18T12:00:00+00:00
broader: social sciences
broad match: http://cv.iptc.org/newscodes/subjectcode/13003001

study of law
type: Concept
preferred label: دراسة حقوق @ar
preferred label: Derecho @es
preferred label: Le droit @fr
preferred label: Jura @de
preferred label: Juridik @se
preferred label: direito @pt-pt
preferred label: jura @dk
preferred label: 法学 @zh-hans
preferred label: rettsvitenskap @no-nb
preferred label: rettsvitskap @no-nn
definition: Vetenskapen om rättsreglerna och deras tillämpning. @se
definition: Wissenschaft der Gesetzgebung und der Philosophie des Rechts @de
definition: The study of legal systems and the philosophy of law
definition: Estudo dos sistemas jurídicos e da filosofia do direito. @pt-pt
definition: Videnskaben om juridiske regler og deres anvendelse. @dk
definition: 研究法律制度和法律哲学的学科 @zh-hans
in scheme: Media Topic
created: 2009-10-22T02:00:00+00:00
modified: 2023-10-02T12:00:00+00:00
broader: social sciences
broad match: http://cv.iptc.org/newscodes/subjectcode/13003001

linguistics
type: Concept
preferred label: Linguistique @fr
preferred label: Lingvistik @se
preferred label: Linguistik @de
preferred label: لغويات @ar
preferred label: Lingüística @es
preferred label: linguística @pt-pt
preferred label: lingvistik @dk
preferred label: 语言学 @zh-hans
preferred label: språkvitenskap/lingvistikk @no-nb
preferred label: språkvitskap/lingvistikk @no-nn
definition: Das Studium aller Aspekte der menschlichen Sprache wie Syntax, Phonetik, geschriebene und gesprochene Formen und Variationen im Laufe der Zeit @de
definition: Vetenskapen om språk. @se
definition: The study of all aspects of human language such as syntax, phonetics, written and spoken forms and variations over time
definition: Etude de tous les aspects du langage humain tels que la syntaxe, la phonétique, les formes écrites et parlées et les variations dans le temps @fr
definition: El estudio de todos los aspectos del lenguaje humano, como la sintaxis, la fonética, las formas escritas y habladas y las variaciones a lo largo del tiempo @es
definition: O estudo de todos os aspetos da linguagem humana, como a sintaxe, a fonética, formas escritas e faladas e variações ao longo do tempo. @pt-pt
definition: O estudo de todos os aspectos da linguagem humana, como a sintaxe, a fonética, formas escritas e faladas e variações ao longo do tempo. @pt-br
definition: Videnskaben af alle aspekter af det menneskelige sprog såsom syntaks, fonetik, skriftlige og talte former og variationer over tid. @dk
definition: 研究人类语言的各个方面的学科，如语法、语音学、书面和口头形式以及随时间的变化 @zh-hans
in scheme: Media Topic
created: 2009-10-22T02:00:00+00:00
modified: 2021-02-18T12:00:00+00:00
broader: social sciences
broad match: http://cv.iptc.org/newscodes/subjectcode/13000000

philosophy
type: Concept
preferred label: فلسفة @ar
preferred label: Philosophie @fr
preferred label: Filosofi @se
preferred label: Filosofía @es
preferred label: filosofia @pt-pt
preferred label: filosofi @dk
preferred label: 哲学 @zh-hans
definition: Das Studium der Prinzipien und grundsätzlichen Fragen zu Themen wie Geist, Vernunft, Moral oder Werte @de
definition: Vetenskapen om de grundläggande villkoren för tillvaron, vetandet och moralen. @se
definition: The study of the principles and fundamental questions about matters such as the mind, reason, morality or values
definition: Etude des principes et des questions fondamentales sur des sujets tels que l'esprit, la raison, la moralité ou les valeurs @fr
definition: El estudio de los principios y preguntas fundamentales sobre cuestiones como la mente, la razón, la moralidad o los valores @es
definition: Estudo dos princípios e das questões fundamentais sobre assuntos como a mente, a razão, a moralidade ou os valores. @pt-pt
definition: Videnskaben om de grundlæggende betingelser for eksistens, viden og moral. @dk
definition: 研究思想、理性、道德或价值观等问题的原理和基本问题的学科 @zh-hans
in scheme: Media Topic
created: 2009-10-22T02:00:00+00:00
modified: 2021-02-18T12:00:00+00:00
broader: social sciences

political science
type: Concept
preferred label: علوم سياسية @ar
preferred label: Statsvetenskap @se
preferred label: Ciencia política @es
preferred label: Sciences politiques @fr
preferred label: Politikwissenschaft @de
preferred label: ciência política @pt-pt
preferred label: statskundskab @dk
preferred label: 政治学 @zh-hans
preferred label: statsvitenskap @no-nb
preferred label: statsvitskap @no-nn
definition: The study of the principles of political and governmental systems, political thought and practices
definition: Das Studium der Prinzipien politischer und staatlicher Systeme, des politischen Denkens und Handelns @de
definition: En samhällsvetenskaplig disciplin inriktad på studiet av politik. @se
definition: Etude des principes des systèmes politiques et gouvernementaux, de la pensée et des pratiques politiques @fr
definition: El estudio de los principios de los sistemas políticos y gubernamentales, del pensamiento y de la acción política @es
definition: Estudo dos princípios dos sistemas políticos e governamentais, do pensamento e da ação política. @pt-pt
definition: En samfundsvidenskabelig disciplin fokuseret på studiet af politik. @dk
definition: 研究政治和政府制度的原则、政治思想和实践的学科 @zh-hans
in scheme: Media Topic
created: 2009-10-22T02:00:00+00:00
modified: 2021-02-18T12:00:00+00:00
broader: social sciences
broad match: http://cv.iptc.org/newscodes/subjectcode/13000000

psychology
type: Concept
preferred label: Psychologie @fr
preferred label: Psicología @es
preferred label: علم نفس @ar
preferred label: Psykologi @se
preferred label: psicologia @pt-pt
preferred label: psykologi @dk
preferred label: 心理学 @zh-hans
definition: The study of the human mind, mental characteristics and emotional processes
definition: Vetenskapen om själslivet (människors upplevelser, känslor, beteenden och tankar i allmänhet). @se
definition: Das Studium des menschlichen Geistes, der geistigen Eigenschaften und der emotionalen Prozesse @de
definition: Etude de l'esprit humain, des caractéristiques mentales et des processus émotionnels @fr
definition: El estudio de la mente humana, las características mentales y los procesos emocionales @es
definition: Estudo da mente humana, das características mentais e dos processos emocionais. @pt-pt
definition: Videnskaben om sjæleliv (folks oplevelser, følelser, adfærd og tanker generelt). @dk
definition: 研究人的思想、心理特征和情感过程的学科 @zh-hans
in scheme: Media Topic
created: 2009-10-22T02:00:00+00:00
modified: 2021-02-18T12:00:00+00:00
broader: social sciences

sociology
type: Concept
preferred label: Sociologie @fr
preferred label: Sociología @es
preferred label: Soziologie @de
preferred label: علم اجتماع @ar
preferred label: Sociologi @se
preferred label: sociologia @pt-pt
preferred label: sociologi @dk
preferred label: 社会学 @zh-hans
preferred label: sosiologi @no-nb
definition: Die Untersuchung menschlicher sozialer Organisation, sozialer Beziehungen und gesellschaftlicher Veränderungen @de
definition: Vetenskapen om sociala beteenden, grupper och relationer. @se
definition: The study of human social organisation, social relationships and societal changes
definition: Etude de l'organisation sociale humaine, des relations sociales et des changements sociétaux @fr
definition: El estudio de la organización social humana, las relaciones sociales y los cambios sociales @es
definition: Estudo da organização social humana e das relações e mudanças sociais. @pt-pt
definition: Videnskaben om social opførsel, grupper og forhold. @dk
definition: 研究人类社会组织、社会关系和社会变迁的学科 @zh-hans
definition: The study of human social organization, social relationships and societal changes
in scheme: Media Topic
created: 2009-10-22T02:00:00+00:00
modified: 2021-02-18T12:00:00+00:00
broader: social sciences

aerospace engineering
type: Concept
preferred label: Ingénierie aérospatiale @fr
preferred label: Flyg- och rymdteknik @se
preferred label: هندسة فضاء @ar
preferred label: Ingeniería aeroespacial @es
preferred label: Luft- und Raumfahrttechnik @de
preferred label: engenharia aeroespacial @pt-pt
preferred label: luftfartsteknologi @dk
preferred label: 航空航天工程 @zh-hans
preferred label: fly- og romfartsvitenskap @no-nb
preferred label: fly- og romfartsvitskap @no-nn
definition: Studie, Design, Entwicklung und Bau von Flugzeugen, Raumfahrzeugen und Flugkörpersystemen @de
definition: Vetenskap, design, utveckling och konstruktion av flygplan, rymdfarkoster och missilsystem. @se
definition: The study, design, development and construction of aircraft, spacecraft and missile systems
definition: Etude, conception, développement et construction d'avions, d'engins spatiaux et de systèmes de missiles @fr
definition: El estudio, diseño, desarrollo y construcción de aeronaves, naves espaciales y sistemas de misiles @es
definition: Estudo, projeto, desenvolvimento e construção de aeronaves, naves espaciais e sistemas de mísseis. @pt-pt
definition: Estudo, projeto, desenvolvimento e construção de aeronaves, espaçonaves e sistemas de mísseis. @pt-br
definition: Videnskab, design, udvikling og konstruktion af fly, rumfartøjer og missilsystemer. @dk
definition: 飞机、航天器和导弹系统的研究、设计、开发和建造 @zh-hans
in scheme: Media Topic
created: 2009-10-22T02:00:00+00:00
modified: 2021-02-18T12:00:00+00:00
broader: technology and engineering
narrower: rocketry
broad match: http://cv.iptc.org/newscodes/subjectcode/04011001

agricultural technology
type: Concept
preferred label: Jordbruksteknik @se
preferred label: Agrarwissenschaft @de
preferred label: تكنولوجيا زراعية @ar
preferred label: Agronomía @es
preferred label: Agronomie @fr
preferred label: tecnologia agrícola @pt-pt
preferred label: landbrugsteknologi @dk
preferred label: 农业技术 @zh-hans
preferred label: landbruksteknologi @no-nb
definition: The study and development of techniques and machinery to improve agricultural management and productivity
definition: Vetenskapen om och utvecklingen av tekniker och maskiner som förbättrar jordbrukets hantering och produktivitet. @se
definition: Untersuchung und Entwicklung von Techniken und Maschinen zur Verbesserung der landwirtschaftlichen Bewirtschaftung und Produktivität @de
definition: Etude et développement de techniques et de mécanismes visant à améliorer la gestion et la productivité agricoles @fr
definition: El estudio y desarrollo de técnicas y maquinaria para mejorar la gestión y la productividad agrícola @es
definition: Estudo e desenvolvimento de técnicas e maquinaria para melhorar a gestão e a produtividade agrícola. @pt-pt
definition: Estudo e desenvolvimento de técnicas e maquinário para melhorar a gestão e a produtividade agrícola. @pt-br
definition: Videnskab og udvikling af teknikker og maskiner, der forbedrer landbrugsstyring og produktivitet. @dk
definition: 研究和开发提高农业管理水平和生产力的技术和机械 @zh-hans
in scheme: Media Topic
created: 2009-10-22T02:00:00+00:00
modified: 2021-05-05T12:00:00+00:00
broader: technology and engineering
broad match: http://cv.iptc.org/newscodes/subjectcode/13020000

civil engineering
type: Concept
preferred label: Ingeniería civil @es
preferred label: Ingenieurwesen @de
preferred label: هندسة مدنية @ar
preferred label: Väg- och vattenbyggnadsteknik @se
preferred label: Ingénierie civile @fr
preferred label: engenharia civil @pt-pt
preferred label: ingeniørvidenskab @dk
preferred label: 土木工程 @zh-hans
preferred label: byggeteknikk @no-nb
preferred label: byggjeteknikk @no-nn
definition: The study, design, development and construction of structures such as buildings, bridges, tunnels, irrigation and sewage systems, streets or railroads
definition: Untersuchung, Planung, Entwicklung und Bau von Bauwerken wie Gebäuden, Brücken, Tunneln, Bewässerungs- und Abwassersystemen, Straßen oder Eisenbahnen @de
definition: Vetenskap, design, utveckling och konstruktion av strukturer såsom byggnader, broar, tunnlar, bevattnings- och avloppssystem, vägar och järnvägar. @se
definition: Etude, conception, développement et construction de structures telles que des bâtiments, des ponts, des tunnels, des systèmes d'irrigation et d'égouts, des rues ou des voies ferrées @fr
definition: El estudio, diseño, desarrollo y construcción de estructuras tales como edificios, puentes, túneles, sistemas de irrigación y alcantarillado, calles o ferrocarriles @es
definition: Estudo, projeto, desenvolvimento e construção de estruturas como edifícios, pontes, túneis, sistemas de irrigação, sistemas de esgoto, ruas ou vias férreas. @pt-pt
definition: Estudo, projeto, desenvolvimento e construção de estruturas como edifícios, pontes, túneis, sistemas de irrigação, sistemas de esgoto, ruas ou ferrovias. @pt-br
definition: Videnskab, design, udvikling og konstruktion af strukturer såsom bygninger, broer, tunneler, kunstvandings- og kloaksystemer, veje og jernbaner. @dk
definition: 研究、设计、开发和建造建筑物、桥梁、隧道、灌溉和污水系统、街道或铁路等结构 @zh-hans
in scheme: Media Topic
created: 2009-10-22T02:00:00+00:00
modified: 2021-02-18T12:00:00+00:00
broader: technology and engineering
broad match: http://cv.iptc.org/newscodes/subjectcode/13002000

electronic engineering
type: Concept
preferred label: Elektronik @se
preferred label: الكترونيات @ar
preferred label: Eletrotechnik @de
preferred label: Ingénierie électronique @fr
preferred label: Ingeniería electrónica @es
preferred label: engenharia eletrónica @pt-pt
preferred label: engenharia eletrônica @pt-br
preferred label: elektronikteknik @dk
preferred label: 电子工程 @zh-hans
preferred label: elektroteknikk @no-nb
definition: Studie, Entwurf, Entwicklung und Anwendung von Systemen, die auf dem Austausch von elektrischen Ladungen basieren, wie z.B. Verbrauchergeräte, Kommunikationssysteme oder Industriecomputer @de
definition: Vetenskap och teknik rörande ledning av elektricitet i vakuum, gaser och halvledare. @se
definition: The study, design, development and application of systems built on the exchange of electrical charges, such as consumer devices, communications systems or industrial computers
definition: Etude, conception, développement et application de systèmes basés sur l'échange de charges électriques, tels que les appareils grand public, les systèmes de communication ou les ordinateurs industriels @fr
definition: El estudio, diseño, desarrollo y aplicación de sistemas basados en el intercambio de cargas eléctricas, como dispositivos de consumo, sistemas de comunicaciones o computadoras industriales @es
definition: Estudo, conceção, desenvolvimento e aplicação de sistemas construídos sobre a troca de cargas elétricas, como dispositivos de consumo, sistemas de comunicação ou computadores industriais. @pt-pt
definition: Estudo, concepção, desenvolvimento e aplicação de sistemas construídos sobre a troca de cargas elétricas, como dispositivos de consumo, sistemas de comunicação ou computadores industriais. @pt-br
definition: Videnskab og teknologi vedrørende ledning af elektricitet i vakuum, gasser og halvledere. @dk
definition: 研究、设计、开发和应用建立在电荷交换基础上的系统，如消费设备、通信系统或工业计算机 @zh-hans
in scheme: Media Topic
created: 2009-10-22T02:00:00+00:00
modified: 2021-02-18T12:00:00+00:00
broader: technology and engineering

identification technology
type: Concept
preferred label: Tecnología de identificación @es
preferred label: تقنيات التعرف على الهوية @ar
preferred label: Technologie zur Identitätsprüfung @de
preferred label: Technologie de l'identification @fr
preferred label: Identifieringsteknik @se
preferred label: tecnologia de identificação @pt-pt
preferred label: identifikationsteknologi @dk
preferred label: 识别技术 @zh-hans
preferred label: identifiseringsteknologi @no-nb
definition: The study, development, application and ethical considerations of technological methods for identifying products, animals or people; including radio frequency, biometrics or face recognition
definition: Untersuchung, Entwicklung, Anwendung und ethische Überlegungen zu technologischen Methoden zur Identifizierung von Produkten, Tieren oder Menschen, einschließlich Radiofrequenz, Biometrie oder Gesichtserkennung @de
definition: Vetenskapen, utvecklingen, tillämpningen och de etiska frågorna rörande tekniska metoder för att känna igen produkter, djur eller människor, till exempel ansiktsigenkänning och biometrisk teknik. @se
definition: Etude, développement, application et considérations éthiques des méthodes technologiques d'identification de produits, d'animaux ou de personnes; y compris la radiofréquence, la biométrie ou la reconnaissance faciale @fr
definition: El estudio, desarrollo, aplicación y consideraciones éticas de los métodos tecnológicos para identificar productos, animales o personas; incluyendo radiofrecuencia, biometría o reconocimiento facial @es
definition: Estudo, desenvolvimento, aplicação e considerações éticas dos métodos tecnológicos para identificação de produtos, animais ou pessoas; inclui radiofrequência, biometria ou reconhecimento facial. @pt-pt
definition: Videnskab, udvikling, anvendelse og etiske spørgsmål vedrørende tekniske metoder til genkendelse af produkter, dyr eller mennesker, såsom ansigtsgenkendelse og biometrisk teknologi. @dk
definition: 研究、发展、应用和伦理上考虑鉴别产品、动物或人的技术方法； 包括射频、生物特征识别或人脸识别 @zh-hans
in scheme: Media Topic
created: 2009-10-22T02:00:00+00:00
modified: 2021-02-18T12:00:00+00:00
broader: technology and engineering

information technology and computer science
type: Concept
preferred label: علوم الكمبيوتر/معلوماتية @ar
preferred label: Technologie de l'information et Informatique @fr
preferred label: Tecnología de la información e Informática @es
preferred label: IT/datavetenskap @se
preferred label: Informatik @de
preferred label: tecnologias de informação @pt-pt
preferred label: informationsteknologi og datalogi @dk
preferred label: 信息技术与计算机科学 @zh-hans
preferred label: informatikk @no-nb
preferred label: informasjons- og kommunikasjonsteknologi @no-nn
definition: Vetenskap och design rörande datasystem, mjukvara och nätverk. @se
definition: Untersuchung und Entwurf von Computersystemen, Software und Netzwerken @de
definition: The study and design of computer systems, software and networks
definition: Etude et conception de systèmes informatiques, logiciels et réseaux @fr
definition: El estudio y diseño de sistemas informáticos, software y redes @es
definition: Estudo e desenvolvimento de sistemas computacionais, software e redes. @pt-pt
definition: Videnskab og design relateret til computersystemer, software og netværk. @dk
definition: 计算机系统、软件和网络的研究和设计 @zh-hans
in scheme: Media Topic
created: 2009-10-22T02:00:00+00:00
modified: 2021-02-18T12:00:00+00:00
broader: technology and engineering
narrower: artificial intelligence

materials science
type: Concept
preferred label: Materialwissenschaft @de
preferred label: Materialvetenskap @se
preferred label: علوم مادية @ar
preferred label: Ciencia de los materiales @es
preferred label: Science des matériaux @fr
preferred label: ciência dos materiais @pt-pt
preferred label: materialevidenskab @dk
preferred label: 材料科学 @zh-hans
preferred label: materialvitenskap @no-nb
preferred label: materialvitskap @no-nn
definition: The study of the composition, structure and properties of materials for their use in industry and manufacturing
definition: Vetenskapen om grundläggande principer om materialens uppbyggnad. @se
definition: Untersuchung der Zusammensetzung, Struktur und Eigenschaften von Werkstoffen für den Einsatz in Industrie und Fertigung @de
definition: Etude de la composition, de la structure et des propriétés des matériaux pour leur utilisation dans l'industrie et la construction @fr
definition: El estudio de la composición, estructura y propiedades de los materiales para su uso en la industria y la fabricación @es
definition: Estudo da composição, estrutura e propriedades dos materiais para o seu uso na indústria e na manufatura. @pt-pt
definition: Estudo da composição, estrutura e propriedades dos materiais para seu uso na indústria e na manufatura. @pt-br
definition: Videnskaben om grundlæggende principper for konstruktion af materialer. @dk
definition: 研究用于工业和制造业的材料的组成、结构和性能的学科 @zh-hans
in scheme: Media Topic
created: 2009-10-22T02:00:00+00:00
modified: 2021-02-18T12:00:00+00:00
broader: technology and engineering

micro science
type: Concept
preferred label: Mikrovetenskap @se
preferred label: Mikroelektronik @de
preferred label: علم الاحياء الدقيقة @ar
preferred label: Science de l'infiniment petit @fr
preferred label: Microciencias @es
preferred label: nanociência @pt-pt
preferred label: mikrovidenskab @dk
preferred label: 微观科学 @zh-hans
preferred label: mikrovitenskap @no-nb
preferred label: mikrovitskap @no-nn
definition: The study of and technologies built at a microscopic scale, such as microbiology or microcomputing
definition: Vetenskap och teknik rörande saker byggda i mikroskopisk skala. @se
definition: Das Studium und die Entwicklung von Technologien im mikroskopischen Maßstab, wie z.B. Mikrobiologie oder Mikrocomputing @de
definition: Etude et technologies construites à l'échelle microscopique, telles que la microbiologie ou la micro-informatique @fr
definition: El estudio y las tecnologías construidas a escala microscópica, como la microbiología o la microcomputación @es
definition: Estudo e tecnologias construídas em escala microscópica, como a microbiologia ou a microcomputação. @pt-pt
definition: Videnskab af og teknologier bygget på mikroskopisk skala, såsom mikrobiologi eller mikrocomputing. @dk
definition: 在微观尺度上建立的研究和技术，如微生物学或微计算 @zh-hans
in scheme: Media Topic
created: 2009-10-22T02:00:00+00:00
modified: 2021-02-18T12:00:00+00:00
broader: technology and engineering
narrower: nanotechnology

rocketry
type: Concept
preferred label: Fuséologie @fr
preferred label: Raketentechnik @de
preferred label: Raketteknik @se
preferred label: علم صواريخ @ar
preferred label: Cohetería @es
preferred label: ciência de foguetes @pt-pt
preferred label: raket @dk
preferred label: 火箭 @zh-hans
preferred label: raketteknologi @no-nb
definition: The study, design, development and construction of rockets
definition: Studie, Entwurf, Entwicklung und Bau von Raketen @de
definition: Vetenskap, design, utveckling och konstruktion rörande raketer. @se
definition: Etude, conception, développement et construction de fusées @fr
definition: El estudio, diseño, desarrollo y construcción de cohetes @es
definition: Estudo, conceção, desenvolvimento e construção de foguetes. @pt-pt
definition: Estudo, concepção, desenvolvimento e construção de foguetes. @pt-br
definition: Videnskab, design, udvikling og konstruktion af raketter. @dk
definition: 火箭的研究、设计、开发和建造 @zh-hans
in scheme: Media Topic
created: 2009-10-22T02:00:00+00:00
modified: 2021-02-18T12:00:00+00:00
broader: aerospace engineering

artificial intelligence
type: Concept
preferred label: Artificiell intelligens @se
preferred label: kunstig intelligens @no-nb
preferred label: inteligência artificial @pt-pt
preferred label: 人工智能 @zh-hans
preferred label: Künstliche Intelligenz @de
preferred label: Intelligence artificielle @fr
preferred label: Inteligencia artificial @es
preferred label: ذكاء اصطناعي @ar
definition: An attempt to let computers simulate how the human brain works by applying statistical, heuristic or machine learning methods and algorithms to large datasets. Enables a long range of automatic functions like image recognition and categorisation.
definition: Förkortas ofta AI. Beskriver dataprogram och robotar som efterliknar människors naturliga intelligens genom att utveckla sig baserat på tidigare försök. @se
definition: Uso de computadores para simular o funcionamento do cérebro humano aplicando algoritmos e métodos estatísticos, heurísticos ou de aprendizagem automática a grandes conjuntos de dados. Permite uma grande variedade de funções automáticas, como reconhecimento e categorização de imagens. @pt-pt
definition: Uso de computadores para simular o funcionamento do cérebro humano aplicando algoritmos e métodos estatísticos, heurísticos ou de aprendizado automático a grandes conjuntos de dados. Permite uma grande variedade de funções automáticas, como reconhecimento e categorização de imagens. @pt-br
definition: Et videnskabeligt forsøg på at bruge computerteknologi til at simulere den menneskelige hjerne ved brug af statistiske, heuristiske metoder eller algoritmer på store datasæt. @dk
definition: 通过将统计学、启发式或机器学习和算法应用于大数据集，让计算机模拟人类大脑运作。实现一系列自动功能诸如，图像识别、分类 @zh-hans
definition: Ein Versuch, Computer simulieren zu lassen, wie das menschliche Gehirn arbeitet, indem statistische, heuristische oder maschinelle Lernmethoden und Algorithmen auf große Datensätze angewendet werden. Ermöglicht eine Vielzahl von automatischen Funktionen wie Bilderkennung und Kategorisierung. @de
definition: An attempt to let computers simulate how the human brain works by applying statistical, heuristic or machine learning methods and algorithms to large datasets. Enables a long range of automatic functions like image recognition and categorization.
in scheme: Media Topic
created: 2020-08-05T12:00:00+00:00
modified: 2021-07-12T12:00:00+00:00
broader: information technology and computer science

nanotechnology
type: Concept
preferred label: تكنولوجيا الاجهزة الدقيقة @ar
preferred label: Nanotecnología @es
preferred label: Nanotechnologie @de
preferred label: Nanoteknologi @se
preferred label: nanotecnologia @pt-pt
preferred label: nanoteknologi @dk
preferred label: 纳米技术 @zh-hans
definition: Teknik för att tillverka, påverka och hantera material och objekt med minst en dimension i storleksordningen 1–100 nanometer. @se
definition: Manipulating objects at the molecular scale
definition: Die Erforschung von Technologien, die Materialien oder Vorrichtungen auf atomarer oder molekularer Ebene beinhalten @de
definition: Etude de technologies impliquant des matériaux ou des dispositifs construits à l'échelle atomique ou moléculaire @fr
definition: El estudio de tecnologías que involucran materiales o dispositivos construidos a escala atómica o molecular @es
definition: Manipulação de objetos à escala molecular. @pt-pt
definition: Teknologi til fremstilling, påvirkning og håndtering af materialer og genstande med mindst en dimension i størrelsesordenen 1–100 nanometer. @dk
definition: 在分子尺度上处理对象 @zh-hans
in scheme: Media Topic
created: 2009-10-22T02:00:00+00:00
modified: 2021-02-18T12:00:00+00:00
broader: micro science

social networking
type: Concept
preferred label: Réseaux sociaux @fr
preferred label: شبكات تواصل اجتماعي @ar
preferred label: Redes sociales @es
preferred label: Socialt nätverkande @se
preferred label: Soziales Netzwerk @de
preferred label: redes sociais @pt-pt
preferred label: socialt netværk @dk
preferred label: 社交网络 @zh-hans
preferred label: sosiale nettverk @no-nb
preferred label: sosialt nettverk @no-nn
definition: Bygget av gemenskaper, bland annat med hjälp av sociala medier. @se
definition: Bildung von Gemeinschaften auch durch die Nutzung von Online-Medien @de
definition: Social interactions, either in person or online, intended to share information and build relationships around common interests
definition: Construção de comunidades de pessoas, incluindo o uso de meios de comunicação online. @pt-pt
definition: Construção de comunidades de pessoas, incluindo o uso de meios de mídia online. @pt-br
definition: Opbygning af fællesskaber af mennesker, herunder brug af onlinemedier. @dk
definition: 包括使用在线媒体建立人们的社区 @zh-hans
in scheme: Media Topic
created: 2009-10-22T02:00:00+00:00
modified: 2021-02-18T12:00:00+00:00
broader: communities
broad match: http://cv.iptc.org/newscodes/subjectcode/14000000

fraternal and community group
type: Concept
preferred label: frimurarordenar og ordensselskap @no-nn
preferred label: frimurerordner og ordensselskaper @no-nb
preferred label: gemeinschaftliche Gruppen @de
definition: Social organisations whose members freely associate for a mutually beneficial purpose such as for social, professional or honorary principles. Groups include Rotary clubs, Lions clubs or Freemasons.
definition: Social organizations whose members freely associate for a mutually beneficial purpose such as for social, professional or honorary principles. Groups include Rotary clubs, Lions clubs or Freemasons.
definition: Gesellschaftliche Organisationen, deren Mitglieder sich freiwillig zu einem für beide Seiten vorteilhaften Zweck zusammenschließen, z. B. aus sozialen, beruflichen oder ehrenamtlichen Gründen. Zu diesen Gruppen gehören Rotary Clubs, Lions Clubs oder Freimaurer. @de
in scheme: Media Topic
created: 2022-09-23T12:00:00+00:00
modified: 2022-09-23T12:00:00+00:00
broader: communities

population and census
type: Concept
preferred label: Folk och folkräkning @se
preferred label: سكان واحصاء @ar
preferred label: Población y censo @es
preferred label: Recensement @fr
preferred label: Bevölkerungszahl @de
preferred label: população e censos @pt-pt
preferred label: befolkning og folketælling @dk
preferred label: 人口普查 @zh-hans
preferred label: befolkning og folketelling @no-nb
preferred label: befolkning og folketeljing @no-nn
definition: Antalet människor i en geografisk region och räkningen av dem. @se
definition: Die Anzahl von Menschen einer geografischen Region und der Prozess diese zu zählen. @de
definition: The official count of people living in a given geopolitical area, usually carried out by a governmental body
definition: População é o número de pessoas numa região geográfica e censo é o processo da sua contagem. @pt-pt
definition: População é o número de pessoas em uma região geográfica e censo é o processo de sua contagem. @pt-br
definition: Antallet af mennesker i en geografisk region og deres antal. @dk
definition: 人口是一个地理区域的人口数量，人口普查是对人口数量进行统计的过程 @zh-hans
in scheme: Media Topic
created: 2009-10-22T02:00:00+00:00
modified: 2021-05-05T12:00:00+00:00
broader: demographics

illegal immigration
type: Concept
preferred label: Inmigrantes ilegales @es
preferred label: Illegala immigranter @se
preferred label: Immigration clandestine @fr
preferred label: Illegale Einwanderung @de
preferred label: متسللون @ar
preferred label: imigrantes ilegais @pt-pt
preferred label: illegal indvandrer @dk
preferred label: 非法移民 @zh-hans
preferred label: ulovlig innvandring @no-nb
preferred label: ulovleg innvandrar @no-nn
definition: Bewegung von Individuen von einem Land in ein anderes auf illegalem Weg @de
definition: The movement of individuals or groups of people from one country to another without legal authorisation from the destination country
definition: Personers rörelse från ett land till ett annat med olagliga medel. @se
definition: Movimentação de indivíduos de um país a outro por meios ilícitos. @pt-pt
definition: Bevægelse af enkeltpersoner fra det ene land til det andet med ulovlige midler. @dk
definition: 通过非法手段将个人从一个国家转移到另一个国家 @zh-hans
definition: The movement of individuals or groups of people from one country to another without legal authorization from the destination country
in scheme: Media Topic
created: 2009-10-22T02:00:00+00:00
modified: 2021-02-18T12:00:00+00:00
broader: immigration

ageism
type: Concept
preferred label: Discriminación por edad @es
preferred label: Agisme @fr
preferred label: Åldersdiskriminering @se
preferred label: Altersdiskriminierung @de
preferred label: تمييز عمري @ar
preferred label: idadismo @pt-pt
preferred label: aldersdiskrimination @dk
preferred label: 年龄歧视 @zh-hans
preferred label: aldersdiskriminering @no-nb
definition: Särbehandling av individer eller grupper på grund av åldern på personerna. @se
definition: Discrimination against individuals or groups of people on the basis of age
definition: Schädigendes Verhalten gegenüber einer anderen Gruppe auf der Grundlage des Alters @de
definition: Atitudes hostis ou discriminatórias em relação a outro grupo com base em critérios de idade. @pt-pt
definition: Skadelige holdninger til en anden gruppe baseret på forskellige aldre. @dk
definition: 基于不同年龄，一个群体对另一个或多个群体的有害态度 @zh-hans
in scheme: Media Topic
created: 2009-10-22T02:00:00+00:00
modified: 2021-02-18T12:00:00+00:00
broader: discrimination
broad match: http://cv.iptc.org/newscodes/subjectcode/14025003

racism
type: Concept
preferred label: عنصرية @ar
preferred label: Rasism @se
preferred label: Rassismus @de
preferred label: Racisme @fr
preferred label: Racismo @es
preferred label: racismo @pt-pt
preferred label: racisme @dk
preferred label: 种族歧视 @zh-hans
preferred label: rasisme @no-nb
definition: Särbehandling av individer eller grupper på grund av personernas etnicitet. @se
definition: Schädigendes Verhalten gegenüber einer anderen Gruppe auf der Grundlage von Unterschieden der Abstammung. @de
definition: Discrimination against individuals or groups of people on the basis of race
definition: Atitudes ou comportamento nocivos contra um grupo, em função de diferenças raciais. @pt-pt
definition: Skadelige holdninger til en anden gruppe baseret på racemæssige forskelle. @dk
definition: 基于种族差异，一个群体对另一个或多个群体的有害态度 @zh-hans
in scheme: Media Topic
created: 2009-10-22T02:00:00+00:00
modified: 2021-02-18T12:00:00+00:00
broader: discrimination

religious discrimination
type: Concept
preferred label: Discriminación religiosa @es
preferred label: Religiöse Diskriminierung @de
preferred label: Religiös diskriminering @se
preferred label: تمييز ديني @ar
preferred label: Discrimination religieuse @fr
preferred label: discriminação religiosa @pt-pt
preferred label: religiøs diskrimination @dk
preferred label: 宗教歧视 @zh-hans
preferred label: trosdiskriminering @no-nb
preferred label: trusdiskriminering @no-nn
definition: Unfair treatment of individuals or groups of people on the basis of their religious belief
definition: Schädigendes Verhalten gegenüber einer anderen Gruppe auf der Grundlage der Religion oder des unterschiedlichen Glaubens @de
definition: Särbehandling av individer eller grupper på grund av personernas religion. @se
definition: Atitudes hostis ou discriminatórias em relação a outro grupo com base em diferenças de crença ou fé. @pt-pt
definition: Skadelige holdninger til en anden gruppe baseret på religiøs overbevisning. @dk
definition: 基于信仰或信仰的不同，一个群体对另一个或多个群体的有害态度 @zh-hans
in scheme: Media Topic
created: 2009-10-22T02:00:00+00:00
modified: 2021-02-18T12:00:00+00:00
broader: discrimination
broad match: http://cv.iptc.org/newscodes/subjectcode/14025003

sexism
type: Concept
preferred label: Sexismus @de
preferred label: انحياز جنسي @ar
preferred label: Könsdiskriminering @se
preferred label: Sexisme @fr
preferred label: Sexismo @es
preferred label: sexismo @pt-pt
preferred label: sexisme @dk
preferred label: 性别歧视 @zh-hans
preferred label: kjønnsdiskriminering @no-nb
definition: Särbehandling av individer eller grupper på grund av personernas kön. @se
definition: Schädigendes Verhalten gegenüber einer anderen Gruppe auf der Grundlage des Geschlechts @de
definition: Discrimination against individuals or groups of people, usually women, on the basis of gender
definition: Atitudes hostis ou discriminatórias em relação a outro grupo com base em critérios de género. @pt-pt
definition: Atitudes hostis ou discriminatórias em relação a outro grupo com base em critérios de gênero. @pt-br
definition: Skadelige holdninger til en anden gruppe baseret på kønsforskelle. @dk
definition: 基于性别差异，一个群体对另一群体的有害态度 @zh-hans
in scheme: Media Topic
created: 2009-10-22T02:00:00+00:00
modified: 2021-09-30T12:00:00+00:00
broader: discrimination
broad match: http://cv.iptc.org/newscodes/subjectcode/14025003

adoption
type: Concept
preferred label: تبن @ar
preferred label: Adopción @es
preferred label: Adoption @de
preferred label: adoção @pt-pt
preferred label: 收养 @zh-hans
preferred label: adopsjon @no-nb
definition: Ein legaler Vorgang ein elternloses Kind in eine Beziehung zu integrieren @de
definition: The legal process of transferring parental rights to someone other than a person's birth parents, that person usually being a child
definition: Att formellt uppta en person som sitt eget barn. @se
definition: Processo legal que integra uma criança sem apoio de pais numa família ou união de apoio. @pt-pt
definition: At formelt adoptere en person som deres eget barn. @dk
definition: 将没有父母抚养的孩子领养为自己孩子的法律程序 @zh-hans
in scheme: Media Topic
created: 2009-10-22T02:00:00+00:00
modified: 2021-02-18T12:00:00+00:00
broader: family

Dating and Relationships
type: Concept
preferred label: Uppvaktning @se
preferred label: Relation amoureuse @fr
preferred label: غزل @ar
preferred label: Noviazgo @es
preferred label: Partnerwahl @de
preferred label: namoro @pt-pt
preferred label: frieri @dk
preferred label: 求婚 @zh-hans
preferred label: dating og kjæresteforhold @no-nb
preferred label: deiting og kjærasteforhold @no-nn
definition: Vorbereitungen um einen Partner zu werben und für sich zu gewinnen @de
definition: Försök att vinna en partner. @se
definition: The development of an intimate connection between individuals, through various forms of activities enjoyed together, often leading to a legal or permanent union such as marriage
definition: Procedimento para cortejar e conquistar um parceiro. @pt-pt
definition: At kurtisere og vinde en partner. @dk
definition: 请求对方与自己结婚的行为或过程 @zh-hans
in scheme: Media Topic
created: 2009-10-22T02:00:00+00:00
modified: 2021-07-12T12:00:00+00:00
broader: family

divorce
type: Concept
preferred label: طلاق @ar
preferred label: Divorce @fr
preferred label: Skilsmässor @se
preferred label: Scheidung @de
preferred label: Divorcio @es
preferred label: divórcio @pt-pt
preferred label: skilsmisse @dk
preferred label: 离婚 @zh-hans
definition: Upplösning av ett äktenskap. @se
definition: The process by which a marriage is legally dissolved
definition: Der Vorgang, durch den eine Ehe aufgehoben wird @de
definition: Processo através do qual um casamento é dissolvido. @pt-pt
definition: Den proces, hvorpå et ægteskab opløses. @dk
definition: 解除婚姻关系的过程 @zh-hans
in scheme: Media Topic
created: 2009-10-22T02:00:00+00:00
modified: 2022-06-14T12:00:00+00:00
broader: family

family planning
type: Concept
preferred label: Familienplanung @de
preferred label: Familjeplanering @se
preferred label: Planificación familiar @es
preferred label: Contrôle des naissances @fr
preferred label: تنظيم الاسرة @ar
preferred label: planeamento familiar @pt-pt
preferred label: planejamento familiar @pt-br
preferred label: familieplanlægning @dk
preferred label: 计划生育 @zh-hans
preferred label: familieplanlegging @no-nb
definition: Ett medvetet försök att påverka familjens storlek. @se
definition: Bewusste Entscheidungen und Bemühungen in Bezug auf die Fortpflanzung/Reproduktion @de
definition: Services and education aimed at informing individual decisions about reproduction, such as fertility, in vitro fertilisation, contraception or abortion
definition: Decisões conscientes e esforços relativos à reprodução. @pt-pt
definition: Et bevidst forsøg på at påvirke familiens størrelse. @dk
definition: 有意识的涉及生殖的决定和努力 @zh-hans
in scheme: Media Topic
created: 2009-10-22T02:00:00+00:00
modified: 2022-06-14T12:00:00+00:00
broader: family
narrower: abortion
narrower: contraception

marriage
type: Concept
preferred label: Matrimonio @es
preferred label: زواج @ar
preferred label: Gifta @se
preferred label: Heirat @de
preferred label: Mariage @fr
preferred label: casamento @pt-pt
preferred label: ægteskab @dk
preferred label: 婚姻 @zh-hans
preferred label: ekteskap @no-nb
definition: En lagstadgad relation mellan två personer. Kan ske genom bröllop, borgerlig vigsel eller motsvarande procedur. @se
definition: The legal or socially recognised union of individuals, which establishes rights and obligations between them
definition: Die Gemeinschaft von zwei Individuen, die sich Treue, Respekt und gegenseitige Unterstützung versprechen @de
definition: União de duas pessoas que juram fidelidade, respeito e apoio mútuos. @pt-pt
definition: De ceremonier og festligheder, der finder sted, når to mennesker gifter sig. @dk
definition: 相互忠诚、尊重和支持的两个人的结合 @zh-hans
definition: The legal or socially recognized union of individuals, which establishes rights and obligations between them
definition: Sosial institusjon som stadfestar og juridisk regulerer samlivet mellom to personar. @no-nn
definition: Sosial institusjon som befester og juridisk regulerer samlivet mellom to personer. @no-nb
in scheme: Media Topic
created: 2009-10-22T02:00:00+00:00
modified: 2021-03-15T12:00:00+00:00
broader: family

parenting
type: Concept
preferred label: Eltern und Kind @de
preferred label: اباء وابناء @ar
preferred label: Padres e hijos @es
preferred label: Föräldrar @se
preferred label: Relation parent-enfant @fr
preferred label: pais e filhos @pt-pt
preferred label: forælder og barn @dk
preferred label: 父母和子女 @zh-hans
preferred label: foreldreskap @no-nb
definition: Zwei oder mehrere Personen in einer hierarchischen familiären Beziehung @de
definition: The caring for and support of a child's physical, emotional, developmental and social needs from birth to adulthood
definition: Personer som är far eller mor till ett visst barn och som har rätt att utöva den rättsliga vårdnaden om detta barn. @se
definition: Dois ou mais indivíduos com uma relação familiar hierárquica. @pt-pt
definition: To eller flere individer med et hierarkisk familieforhold. @dk
definition: 两个或两个以上有亲子家庭关系的人 @zh-hans
in scheme: Media Topic
created: 2009-10-22T02:00:00+00:00
modified: 2021-02-18T12:00:00+00:00
broader: family

pregnancy and childbirth
type: Concept
preferred label: Embarazo y parto @es
preferred label: Grossesse et accouchement @fr
preferred label: حمل وولادة @ar
preferred label: graviditet og fødsel @no-nn
preferred label: Schwangerschaft und Geburt @de
preferred label: Graviditet och förlossning @se
definition: Social and medical issues around pregnancy and giving birth including, doulas and midwives, obstetrics and medical concerns
definition: Sociala och medicinska frågor kopplade till graviditet och förlossningen. @se
definition: Soziale und medizinische Fragen rund um Schwangerschaft und Geburt, einschließlich Doulas und Hebammen, Geburtshilfe und medizinische Fragen @de
in scheme: Media Topic
created: 2022-06-14T12:00:00+00:00
modified: 2022-06-14T12:00:00+00:00
broader: family

abortion
type: Concept
preferred label: Schwangerschaftsabbruch @de
preferred label: Abort @se
preferred label: Aborto @es
preferred label: Avortement @fr
preferred label: اجهاض @ar
preferred label: aborto @pt-pt
preferred label: abort @dk
preferred label: 堕胎 @zh-hans
definition: In der Regel der geplante Abbruch des Prozesses zur Reproduktion menschlichen Lebens @de
definition: Förhållandet att en graviditet upphör eller avbryts före den 22:a graviditetsveckans slut och att fostret är dött vid framfödandet. @se
definition: The intentional termination of a pregnancy for elective or medical reasons
definition: Interrupção, planeada ou não, do processo de reprodução de vida humana. @pt-pt
definition: Geralmente, interrupção planejada do processo de reprodução de vida humana. @pt-br
definition: Det faktum, at en graviditet afbrydes inden slutningen af den 22. uge af graviditeten, og at fosteret er død ved fødslen. @dk
definition: 通常是有计划地破坏人类生命的繁殖过程 @zh-hans
in scheme: Media Topic
created: 2009-10-22T02:00:00+00:00
modified: 2021-02-18T12:00:00+00:00
broader: family planning

contraception
type: Concept
preferred label: prævention @dk
preferred label: prevensjon @no-nb
preferred label: contracepção @pt-br
preferred label: contraceção @pt-pt
preferred label: Preventivmedel @se
preferred label: 避孕 @zh-hans
preferred label: Verhütung @de
preferred label: Contraception @fr
preferred label: Contracepción @es
preferred label: وسائل منع الحمل @ar
definition: En metode eller en genstand, som bruges for at forhindre graviditet. @dk
definition: A method or device used to prevent pregnancy
definition: Conjunto de métodos ou dispositivos usados para impedir a gravidez. @pt-br
definition: En metod för att förhindra befruktning. @se
definition: 使用某种方法或工具防止怀孕 @zh-hans
definition: Ein Verfahren oder eine Vorrichtung zur Verhinderung einer Schwangerschaft @de
definition: Metodar og hjelpemiddel for å unngå graviditet. @no-nn
definition: Metoder og hjelpemidler for å unngå graviditet @no-nb
in scheme: Media Topic
created: 2019-09-05T12:00:00+00:00
modified: 2021-07-12T12:00:00+00:00
broader: family planning

adults
type: Concept
preferred label: Adultes @fr
preferred label: Adultos @es
preferred label: Vuxna @se
preferred label: Erwachsener @de
preferred label: راشدون @ar
preferred label: adultos @pt-pt
preferred label: voksen @dk
preferred label: 成年人 @zh-hans
preferred label: voksne @no-nb
preferred label: vaksne @no-nn
definition: Personer som har uppnått myndighetsåldern, 18 år. @se
definition: People above an age set by law that entitles them to full liability and certain privileges such as the legal right to drink alcoholic beverages and to vote
definition: Menschen, die das Alter der juristischen Volljährigkeit erreicht haben @de
definition: Pessoas acima da idade definida por lei para adquirir responsabilidade total. @pt-pt
definition: Personer, der har opnået en myndighedsalder på 18 år. @dk
definition: 达到法定成年年龄的承担全部责任的人 @zh-hans
definition: Personar som har oppnådd myndigalder; i Noreg 18 år. @no-nn
definition: Personer som har oppnådd myndighetsalder; i Norge 18 år. @no-nb
in scheme: Media Topic
created: 2009-10-22T02:00:00+00:00
modified: 2021-02-18T12:00:00+00:00
broader: demographic group

children
type: Concept
preferred label: Barn @se
preferred label: Niños @es
preferred label: Enfants @fr
preferred label: اطفال @ar
preferred label: Kind @de
preferred label: crianças @pt-pt
preferred label: barn @dk
preferred label: 儿童 @zh-hans
definition: Noch nicht entwickelte Menschen, gewöhnlich bis zum Alter der Pubertät @de
definition: Young people, usually pre-pubescent, who are legally considered minors and are in a guardianship relationship with adults
definition: Personer under skedet mellan födelsen och vuxen ålder. @se
definition: Pessoas imaturas, geralmente até a idade da puberdade. @pt-pt
definition: Personer i fasen mellem fødsel og voksen alder. @dk
definition: 通常指未到青春期的未成年人 @zh-hans
definition: Unge menneske, som regel i puberteten eller tidlegare, som er under myndigalder. @no-nn
definition: Unge mennesker, som regel i puberteten eller tidligere, som er under myndighetsalder. @no-nb
in scheme: Media Topic
created: 2009-10-22T02:00:00+00:00
modified: 2021-02-18T12:00:00+00:00
broader: demographic group

disabilities
type: Concept
preferred label: Discapacitados @es
preferred label: funktionsvariation @se
preferred label: معوقون @ar
preferred label: Handicapés @fr
preferred label: Behinderung @de
preferred label: deficiências @pt-pt
preferred label: handicap @dk
preferred label: 身心障碍者 @zh-hans
preferred label: funksjonshemming @no-nb
definition: Sowohl körperlich, als auch psychisch oder geistig eingeschränkt sein @de
definition: Physical or mental conditions that limit a person's movements, senses, or activities
definition: Fysisk eller psykisk begränsning av en persons förmåga att fungera i en viss situation eller i en viss miljö. @se
definition: Condições físicas ou mentais que limitam os movimentos, sentidos ou atividades de uma pessoa. @pt-pt
definition: Fysiske eller mentale forhold, der begrænser en persons bevægelser, sanser eller aktiviteter. @dk
definition: 行动、感觉或活动等身体或精神状况受到限制的人 @zh-hans
in scheme: Media Topic
created: 2009-10-22T02:00:00+00:00
modified: 2024-03-28T12:00:00+00:00
broader: demographic group

LGBTQ
type: Concept
preferred label: Homosexualité @fr
preferred label: مثليون وسحاقيات @ar
preferred label: HBTQ @se
preferred label: Homosexuales @es
preferred label: Homosexuelle @de
preferred label: LGBT @pt-pt
preferred label: LGBT+ @dk
preferred label: 非异性恋者 @zh-hans
preferred label: LHBT+ @no-nb
definition: Menschen, die sich auf sinnliche, erotische oder vergleichbare Weise zu dem eigenen Geschlecht hingezogen fühlen @de
definition: De som identifierar sig som homosexuella, bisexuella, transpersoner eller queerpersoner. @se
definition: People who identify as lesbian, gay, bisexual, transgender or queer
definition: Pessoas que se identificam como lésbicas, gays, bissexuais ou transexuais. @pt-pt
definition: Mennesker, der identificerer sig som homoseksuelle, biseksuelle eller transseksuelle. @dk
definition: 女同性恋者，男同性恋者，双性恋者或变性者 @zh-hans
definition: Personar som identifiserer seg som lesbiske, homofile, bifile, transseksuelle eller skeive. @no-nn
definition: Personer som identifiserer seg som lesbiske, homofile, bifile, transseksuelle eller skeive. @no-nb
in scheme: Media Topic
created: 2009-10-22T02:00:00+00:00
modified: 2021-05-05T12:00:00+00:00
broader: demographic group

gender
type: Concept
preferred label: الجنس @ar
preferred label: Geschlecht @de
preferred label: Identité sexuelle @fr
preferred label: Identidad sexual @es
preferred label: Kön @se
preferred label: género @pt-pt
preferred label: gênero @pt-br
preferred label: køn @dk
preferred label: 性别 @zh-hans
preferred label: kjønn @no-nb
definition: The classification of individuals as male, female, or a non-binary designation
definition: Die Einteilung von Individuen in weiblich und männlich @de
definition: Den sociala klassificeringen av vad som ansetts manligt och kvinnligt. @se
definition: Classificação de indivíduos como masculino ou feminino. @pt-pt
definition: Classificação de indivíduos como masculinos ou femininos. @pt-br
definition: Den sociale klassificering af, hvad der betragtes som mand og kvinde. @dk
definition: 男性或女性个体的分类 @zh-hans
definition: Klassifisering av individ som hokjønn, hankjønn eller ikkje-binær. @no-nn
definition: Klassifisering av individer som hunkjønn, hankjønn eller ikke-binær. @no-nb
in scheme: Media Topic
created: 2009-10-22T02:00:00+00:00
modified: 2021-02-18T12:00:00+00:00
broader: demographic group
broad match: http://cv.iptc.org/newscodes/subjectcode/14024000

infants
type: Concept
preferred label: Bébé @fr
preferred label: Spädbarn @se
preferred label: Kleinkind @de
preferred label: Bebés @es
preferred label: رضع @ar
preferred label: bebés @pt-pt
preferred label: bebês @pt-br
preferred label: spædbarn @dk
preferred label: 婴儿 @zh-hans
preferred label: spedbarn @no-nb
definition: Personer upp till cirka ett års ålder, då de börjar gå. @se
definition: Very young people, usually defined as being just born up to the age of two
definition: Menschen von Geburt bis zum 1. oder 2. Lebensjahr, gewöhnlich wenn sie beginnen zu laufen @de
definition: Indivíduos na fase que vai do nascimento até à idade de 1-2 anos, geralmente quando começam a caminhar. @pt-pt
definition: Børn op til omkring et års alder, når de begynder at gå. @dk
definition: 小于1周岁或2周岁的孩子，通常是刚开始学走路的年龄 @zh-hans
in scheme: Media Topic
created: 2009-10-22T02:00:00+00:00
modified: 2021-02-18T12:00:00+00:00
broader: demographic group

national or ethnic minority
type: Concept
preferred label: Minoría étnica o nacional @es
preferred label: Minorité ethnique ou nationale @fr
preferred label: Nationale oder ethische Minderheit @de
preferred label: اقلية وطنية او اتنية @ar
preferred label: Minoriteter @se
preferred label: minoria étnica ou nacional @pt-pt
preferred label: national eller etnisk minoritet @dk
preferred label: 少数族裔 @zh-hans
preferred label: etnisk minoritet @no-nb
definition: Gruppe von Menschen, die eine Minderheit bilden auf ethnischer oder nationaler Grundlage, ihres Status, ihrer Probleme und Beziehungen zur Mehrheit @de
definition: Groups of people that form a minority on an ethnic or national basis, and their status or issues relating to the majority
definition: Människor som utgör en mindre grupp än andra konkurrerande grupper utifrån etnicitet eller nationalitet, deras status, problem och relation till majoriteten. @se
definition: Grupos de pessoas que formam uma minoria étnica ou nacional, o seu estatuto, os seus problemas e as relações com a maioria. @pt-pt
definition: Grupos de pessoas que formam uma minoria étnica ou nacional, seu estatuto, seus problemas e suas relações com a maioria. @pt-br
definition: Grupper af mennesker, der udgør et mindretal på etnisk eller nationalt grundlag, deres status, problemer og forhold til flertallet. @dk
definition: 在民族或民族基础上形成少数民族的群体，他们的地位、问题和与多数民族的关系 @zh-hans
in scheme: Media Topic
created: 2009-10-22T02:00:00+00:00
modified: 2021-02-18T12:00:00+00:00
broader: demographic group

nuclear radiation victims
type: Concept
preferred label: Víctimas de radiación nuclear @es
preferred label: ضحايا اشعة نووية @ar
preferred label: Victimes irradiées @fr
preferred label: Kärnkraftsmotståndare @se
preferred label: Strahlenopfer @de
preferred label: vítimas de radiação nuclear @pt-pt
preferred label: offer for nuklear stråling @dk
preferred label: 核辐射受害者 @zh-hans
preferred label: stråleskadde @no-nb
definition: Includes antinuclear movements and compensation for atomic blast victims.
definition: Grupper som vill avveckla kärnkraften, men också personer som har utsatts för radioaktiv strålning och kompensation till dessa. @se
definition: Schließt die Anti-Atomkraftbewegungen mit ein und Entschädigung für Strahlenopfer @de
definition: Inclui movimentos antinucleares e indemnizações às vítimas de explosões nucleares. @pt-pt
definition: Inclui movimentos antinucleares e indenizações às vítimas de explosões nucleares. @pt-br
definition: Inkluderer antinuklear bevægelser og kompensation for ofre for nuklear stråling. @dk
definition: 包括反核运动和对原子弹爆炸受害者的赔偿。 @zh-hans
change note: 2019-10-07: Retired. Use nuclear accident and incident (20000142) instead.
in scheme: Media Topic
created: 2009-10-22T02:00:00+00:00
retired: 2019-10-07T12:00:00+00:00
modified: 2021-02-18T12:00:00+00:00
broader: demographic group

senior citizens
type: Concept
preferred label: Personnes âgées @fr
preferred label: Tercera edad @es
preferred label: Pensionärer @se
preferred label: Senior @de
preferred label: مسنون @ar
preferred label: cidadãos idosos @pt-pt
preferred label: terceira idade @pt-br
preferred label: ældre @dk
preferred label: 老年人 @zh-hans
preferred label: eldre @no-nb
definition: Personer som har passerat pensionsåldern. @se
definition: People having passed the age of retirement
definition: Menschen in dem Alter 60 bis 65 und älter @de
definition: Pessoas que já chegaram à idade da reforma. @pt-pt
definition: Pessoas que já chegaram à idade da aposentadoria. @pt-br
definition: Personer, der har passeret pensionsalderen. @dk
definition: 超过退休年龄的人 @zh-hans
in scheme: Media Topic
created: 2009-10-22T02:00:00+00:00
modified: 2021-02-18T12:00:00+00:00
broader: demographic group

teenagers
type: Concept
preferred label: Tonåringar @se
preferred label: مراهقون @ar
preferred label: Jugendlicher @de
preferred label: Adolescentes @es
preferred label: Adolescents @fr
preferred label: adolescentes @pt-pt
preferred label: teenager @dk
preferred label: 青少年 @zh-hans
preferred label: tenåringer @no-nb
preferred label: tenåring @no-nn
definition: Menschen in dem Alter von 13 bis 19 @de
definition: Young people between the ages that describe childhood and adulthood
definition: Personer i en ålder mellan barn och mogen ålder. @se
definition: Pessoas que estão numa idade entre a infância e a idade adulta. @pt-pt
definition: Personer i en alder mellem barndom og voksen alder. @dk
definition: 处于儿童和成年之间的人 @zh-hans
definition: Personar som i alder er mellom barn og vaksen (f.o.m. 13 t.o.m. 19 år). @no-nn
definition: Personer som aldersmessig befinner seg mellom barn og voksne (fom. 13 tom. 19 år). @no-nb
in scheme: Media Topic
created: 2009-10-22T02:00:00+00:00
modified: 2021-02-18T12:00:00+00:00
broader: demographic group

indigenous people
type: Concept
preferred label: oprindeligt folk @dk
preferred label: urfolk @no-nb
preferred label: Ursprungsbefolkning @se
preferred label: 原住民 @zh-hans
preferred label: povo indígena @pt-pt
preferred label: indigene Völker @de
preferred label: Autochtones @fr
preferred label: Pueblo indígena @es
preferred label: سكان أصليون @ar
definition: Den befolkningsgruppe, der oprindeligt beboede et geografisk område i modsætning til bosættere eller kolonister. @dk
definition: People who are the original owners and caretakers of a given region, also known as native peoples, first peoples or aboriginal peoples, in contrast to groups that have settled, occupied or colonised the area more recently
definition: Människogrupp som är ättlingar till den ursprungliga befolkningen i ett område. Numera ofta i minoritet i det området. @se
definition: 又译当地人或土著人，与后期在该地区定居、占领或殖民的群体相对比，是指定区域的原始所有者和看护者 @zh-hans
definition: Pessoas que são os proprietários e conservadores originais de determinada região, também conhecidos como povos nativos, primeiros povos ou povos indígenas, em contraste com grupos que se fixaram, ocuparam ou colonizaram a área mais recentemente. @pt-pt
definition: Menschen, die die ursprünglichen Eigentümer und Verwalter einer bestimmten Region sind, die auch als Ureinwohner, Erstvölker oder Ureinwohner bezeichnet werden, im Gegensatz zu Gruppen, die das Gebiet in jüngerer Zeit besiedelt, besetzt oder kolonisiert haben @de
definition: People who are the original owners and caretakers of a given region, also known as native peoples, first peoples or aboriginal peoples, in contrast to groups that have settled, occupied or colonized the area more recently
in scheme: Media Topic
created: 2019-11-25T12:00:00+00:00
modified: 2021-07-12T12:00:00+00:00
broader: demographic group

women
type: Concept
preferred label: kvinner @no-nb
preferred label: Kvinnor @se
preferred label: Mujeres @es
preferred label: Femmes @fr
preferred label: نساء @ar
preferred label: Frauen @de
definition: People who identify as female, focusing on the group as a demographic, and accomplishments, such as the first woman to achieve a milestone or serve in a role
definition: Frågor som gäller personer som identifierar sig som kvinnor ur en demografisk synvinkel samt kvinnliga bedrifter. @se
definition: Menschen, die sich als weiblich identifizieren, wobei der Schwerpunkt auf der Gruppe als demografischer Gruppe und auf Errungenschaften liegt, wie z. B. die erste Frau, die einen Meilenstein erreicht oder ein Amt bekleidet @de
in scheme: Media Topic
created: 2021-05-05T12:00:00+00:00
modified: 2021-12-21T12:00:00+00:00
broader: demographic group

men
type: Concept
preferred label: menn @no-nb
preferred label: Män @se
preferred label: Hombres @es
preferred label: Hommes @fr
preferred label: رجال @ar
preferred label: Männer @de
definition: People who identify as male, focusing on the group as a demographic, and masculinity
definition: Frågor som gäller personer som identifierar sig som män, maskulinitet mm. @se
definition: Personen, die sich als männlich identifizieren, mit Schwerpunkt auf der Gruppe als Demografie und der Männlichkeit @de
in scheme: Media Topic
created: 2021-05-05T12:00:00+00:00
modified: 2021-12-21T12:00:00+00:00
broader: demographic group

homelessness
type: Concept
preferred label: Hemlöshet @se
preferred label: Obdachlosigkeit @de
preferred label: Sans abris @fr
preferred label: تشرد @ar
preferred label: Sin techo @es
preferred label: sem-abrigo @pt-pt
preferred label: sem-teto @pt-br
preferred label: hjemløshed @dk
preferred label: 无家可归 @zh-hans
preferred label: hjemløshet @no-nb
preferred label: heimløyse @no-nn
definition: Der Mangel an festem Wohnsitz @de
definition: The social condition defined by lack of permanent residence, living in shelters or on streets, and the issues and problems associated with it
definition: Avsaknad av ett hem. @se
definition: Ausência de local de morada fixa. @pt-pt
definition: Ausência de local de moradia fixa. @pt-br
definition: Mangel på fast bopæl. @dk
definition: 没有固定的居住地点 @zh-hans
in scheme: Media Topic
created: 2009-10-22T02:00:00+00:00
modified: 2021-02-18T12:00:00+00:00
broader: social condition

poverty
type: Concept
preferred label: Pobreza @es
preferred label: فقر @ar
preferred label: Fattigdom @se
preferred label: Armut @de
preferred label: Pauvreté @fr
preferred label: pobreza @pt-pt
preferred label: fattigdom @dk
preferred label: 贫困 @zh-hans
definition: Unzureichende Möglichkeiten sich selbst oder die eigene Familie zu versorgen @de
definition: The lack of sufficient resources and means to provide basic needs such as food, clothing or shelter for oneself and one's family
definition: Levnadsstandard som är oacceptabelt låg. @se
definition: Insuficiência de recursos para garantir os serviços básicos e a subsistência de alguém ou da sua família. @pt-pt
definition: Insuficiência de recursos para garantir os serviços básicos e a subsistência de alguém ou de sua família. @pt-br
definition: Levestandard, der er uacceptabelt lav. @dk
definition: 没有足够的资源为自己或家庭提供基本服务 @zh-hans
in scheme: Media Topic
created: 2009-10-22T02:00:00+00:00
modified: 2021-02-18T12:00:00+00:00
broader: social condition

abusive behaviour
type: Concept
preferred label: سلوك غير لائق @ar
preferred label: Harcèlement @fr
preferred label: Conducta abusiva @es
preferred label: Kränkande beteende @se
preferred label: Misshandlung @de
preferred label: maus-tratos @pt-pt
preferred label: stødende eller krænkende opførsel @dk
preferred label: 虐待行为 @zh-hans
preferred label: overgrep @no-nb
preferred label: abusive behavior
definition: Att behandla en eller flera personer nedsättande genom att angripa den personliga hedern i ord eller genom handling. @se
definition: Actions that intentionally harm another person or people, often on an ongoing basis, such as psychological or mental abuse, negligence, physical or sexual abuse and torture
definition: Die Misshandlung einer oder mehrerer Individuen durch andere, durch unmenschliche Behandlung, sexuelle und mentale Beleidigungen, Entzug von Sinneswahrnehmungen und körperlichen Bedürfnissen, körperliche Misshandlung wie Schläge mit eingeschlossen, oder andere Formen der Folter @de
definition: Comportamento violento ou cruel contra um ou mais indivíduos, através de tratamento desumano, incluindo abuso sexual ou mental, privação de sentidos, de necessidades físicas, abusos físicos, incluindo espancamentos e outras formas de tortura. @pt-pt
definition: At behandle en eller flere personer nedsættende ved at angribe dem i ord eller gennem handling. @dk
definition: 一人或多人受到他人的虐待，包括性虐待或精神虐待、剥夺感官能力，剥夺生理需要、包括殴打在内的身体虐待和其他形式的酷刑 @zh-hans
in scheme: Media Topic
created: 2009-10-22T02:00:00+00:00
modified: 2021-02-18T12:00:00+00:00
broader: social problem

addiction
type: Concept
preferred label: Toxicomanie @fr
preferred label: ادمان @ar
preferred label: Sucht @de
preferred label: Adicciones @es
preferred label: Beroenden @se
preferred label: dependência @pt-pt
preferred label: adição @pt-br
preferred label: afhængighed og misbrug @dk
preferred label: 上瘾 @zh-hans
preferred label: avhengighet @no-nb
preferred label: avhengnad @no-nn
definition: Vanemässigt och oftast okontrollerbart användande av skadliga substanser såsom alkohol, tobak och droger. @se
definition: Gewohnheitsmäßiges und meist unkontrolliertes Konsumieren von gefährlichen Stoffen, wie Alkohol, Tabak, Medikamente oder Drogen @de
definition: The habitual and compulsive use of substances such as alcohol or drugs, or behaviour such as gambling, gaming or sex, often causing detrimental effects on the body, brain, and relationships with others
definition: Consumo habitual e normalmente incontrolável de substâncias nocivas, como álcool, tabaco, medicamentos ou drogas. @pt-pt
definition: Den sædvanlige og ofte ukontrollerbare anvendelse af skadelige stoffer som alkohol, tobak og farmaceutiske stoffer eller stoffer. @dk
definition: 习惯性的、经常无法控制的滥用酒精、烟草、药品或毒品等有害物质 @zh-hans
definition: The habitual and compulsive use of substances such as alcohol or drugs, or behavior such as gambling, gaming or sex, often causing detrimental effects on the body, brain, and relationships with others
in scheme: Media Topic
created: 2009-10-22T02:00:00+00:00
modified: 2021-02-18T12:00:00+00:00
broader: social problem

juvenile delinquency
type: Concept
preferred label: Ungdomsbrottslighet @se
preferred label: Jugendkriminalität @de
preferred label: جنوح الاحداث @ar
preferred label: Délinquance juvénile @fr
preferred label: Delincuencia juvenil @es
preferred label: delinquência juvenil @pt-pt
preferred label: ungdomskriminalitet @dk
preferred label: 青少年犯罪 @zh-hans
definition: Unlawful conduct perpetrated by minors, often on a repeated basis
definition: Den brottslighet som främst personer i åldern 15–20 år står för. @se
definition: Vorfälle in die minderjährige Täter verwickelt sind @de
definition: Atos de delinquência realizados por menores de idade. @pt-pt
definition: Hændelser, der involverer mindreårige gerningsmænd. @dk
definition: 涉及未成年人犯罪者的事件。 @zh-hans
definition: Ulovlege, ofte gjentakande, handlingar gjorde av mindreårige. @no-nn
definition: Ulovlige, ofte gjentakende, handlinger begått av mindreårige. @no-nb
in scheme: Media Topic
created: 2009-10-22T02:00:00+00:00
modified: 2021-02-18T12:00:00+00:00
broader: social problem

prostitution
type: Concept
preferred label: بغاء @ar
preferred label: Prostitution @fr
preferred label: Prostitución @es
preferred label: prostituição @pt-pt
preferred label: 卖淫 @zh-hans
preferred label: prostitusjon @no-nb
definition: Utbjudande av sexuella tjänster mot betalning och de som tjänar på det. @se
definition: Männliche oder weibliche Sexualität als Ware, und diejenigen, die davon profitieren @de
definition: The business of engaging in sexual activity in exchange for payment
definition: Venda de sexo, masculino ou feminino, e aqueles que beneficiam dessa venda. @pt-pt
definition: Dem, der sælger sex og dem, der udnytter dem. @dk
definition: 性交易，无论是男性还是女性，以及那些从中获利的人 @zh-hans
in scheme: Media Topic
created: 2009-10-22T02:00:00+00:00
modified: 2021-02-18T12:00:00+00:00
broader: social problem

slavery
type: Concept
preferred label: Esclavitud @es
preferred label: عبودية @ar
preferred label: Sklaverei @de
preferred label: Slaveri @se
preferred label: Esclavage @fr
preferred label: escravatura @pt-pt
preferred label: slaveri @dk
preferred label: 奴役 @zh-hans
definition: Die unfreiwillige Knechtschaft, außerhalb legaler Inhaftierung wegen krimineller Straftaten, von Männern, Frauen und Kindern, schließt unfreiwillige unbezahlte Arbeit, erzwungenes Verhalten und Kinderarbeit mit ein @de
definition: The ownership of people as property, and the involuntary servitude of those people to their owners, which includes unpaid labour and coerced actions
definition: System med personlig ofrihet och rättslöshet inklusive ofrivilligt obetalt arbete och barnarbete. @se
definition: Submissão involuntária, fora do encarceramento legal por crimes passíveis de punição, de homens, mulheres e crianças, incluindo trabalho involuntário não remunerado, atos de coerção, trabalho infantil. @pt-pt
definition: Systemer med personlig ufrihed og lovløshed, herunder ufrivilligt ulønnet arbejde og børnearbejde. @dk
definition: 男子、妇女和儿童在法定刑事犯监禁之外的非自愿劳役，包括非自愿无偿劳动、胁迫行为、童工 @zh-hans
definition: The ownership of people as property, and the involuntary servitude of those people to their owners, which includes unpaid labor and coerced actions
in scheme: Media Topic
created: 2009-10-22T02:00:00+00:00
modified: 2021-02-18T12:00:00+00:00
broader: social problem

sexual misconduct
type: Concept
preferred label: sexchikane @dk
preferred label: seksuell trakassering @no-nb
preferred label: má conduta sexual @pt-br
preferred label: Sexuellt ofredande @se
preferred label: 性行为不端 @zh-hans
preferred label: sexuelles Fehlverhalten @de
preferred label: Harcèlement sexuel @fr
preferred label: Acoso sexual @es
preferred label: تحرش جنسي @ar
definition: Uønsket adfærd af seksuel karakter, der er af mindre fornærmelse end seksualforbrydelse, især når adfærd forekommer i en normalt ikke-seksuel situation, eller hvor der er et aspekt af personlig magt eller autoritet involveret. @dk
definition: Unwanted behaviour of a sexual nature that is of lesser offense than felony sexual assault, particularly when behaviour occurs in a normally non-sexual situation, or where there is some aspect of personal power or authority involved
definition: Comportamento indesejado de natureza sexual que constitui uma ofensa menor do que a agressão sexual dolosa, particularmente quando o comportamento ocorre em contexto normalmente não sexual, ou quando há algum aspecto de poder ou autoridade pessoal envolvido. @pt-br
definition: Comportamento indesejado de natureza sexual que constitui uma ofensa menor do que a agressão sexual dolosa, particularmente quando o comportamento ocorre em contexto normalmente não sexual, ou quando há algum aspeto de poder ou autoridade pessoal envolvido. @pt-pt
definition: Oönskade sexuella inviter, meddelanden, beröring, blottande osv. @se
definition: 一种不受欢迎的性行为，其罪行较重罪性侵犯轻，特别是当行为发生在正常的非性行为的情况下，或者涉及到个人权力或权威的某一方面时 @zh-hans
definition: Unerwünschtes Verhalten sexueller Natur, das weniger strafbar ist als schwere sexuelle Übergriffe, insbesondere wenn das Verhalten in einer normalerweise nicht-sexuellen Situation auftritt oder wenn ein Aspekt persönlicher Macht oder Autorität involviert ist @de
definition: Unwanted behavior of a sexual nature that is of lesser offense than felony sexual assault, particularly when behavior occurs in a normally non-sexual situation, or where there is some aspect of personal power or authority involved
in scheme: Media Topic
created: 2019-04-06T12:00:00+00:00
modified: 2024-07-01T12:00:00+00:00
broader: social problem

bullying
type: Concept
preferred label: mobning @dk
preferred label: mobbing @no-nb
preferred label: Mobbning @se
preferred label: 霸凌 @zh-hans
preferred label: Mobbing @de
preferred label: Harcèlement @fr
preferred label: Acoso @es
preferred label: تنمر @ar
definition: Opførsel, der har til hensigt at skade, nedgøre eller skræmme en anden person, der opfattes som sårbar. @dk
definition: Taking actions meant to harm, coerce and intimidate another person perceived as vulnerable. These actions can be taken in person or online.
definition: Systematiska trakasserier mot en eller flera personer inom en grupp. @se
definition: 有意伤害、胁迫、恐吓弱者的行为，包括当面和网络上的行为 @zh-hans
definition: Realizar ações destinadas a prejudicar, coagir e intimidar outra pessoa considerada vulnerável. Essas ações podem ser realizadas pessoalmente ou online. @pt-pt
definition: Das Ergreifen von Maßnahmen, die darauf abzielen, eine als verletzlich empfundene Person zu verletzen, zu zwingen und einzuschüchtern. Diese Maßnahmen können persönlich oder online ergriffen werden. @de
in scheme: Media Topic
created: 2019-11-20T12:00:00+00:00
modified: 2021-07-12T12:00:00+00:00
broader: social problem

corrupt practices
type: Concept
preferred label: Korrupta metoder @se
preferred label: Korruptes Verhalten @de
preferred label: Corrupción @es
preferred label: Corruption @fr
preferred label: ممارسات فساد @ar
preferred label: práticas corruptas @pt-pt
preferred label: korrupt praksis @dk
preferred label: 贪污舞弊 @zh-hans
preferred label: korrupsjon @no-nb
definition: Jedes Verhalten, was anderen schadet @de
definition: Any action which is harmful to others
definition: Olagliga metoder för att nå egen vinning, till exempel att muta eller att utge sig för att vara någon annan. @se
definition: Qualquer ação que seja nociva para os outros. @pt-pt
definition: Toda ação que seja nociva para os outros. @pt-br
definition: Enhver handling, der er skadelig for andre. @dk
definition: 任何对他人有害的行为 @zh-hans
change note: 2019-10-07: Retired. Use corruption (20000093) instead.
in scheme: Media Topic
created: 2009-10-22T02:00:00+00:00
retired: 2019-10-07T12:00:00+00:00
modified: 2021-02-18T12:00:00+00:00
broader: values

death and dying
type: Concept
preferred label: Livets slutskede @se
preferred label: Muerte y fin de vida @es
preferred label: موت ووفاة @ar
preferred label: Tod und Sterben @de
preferred label: Fin de vie et mort @fr
preferred label: morte @pt-pt
preferred label: død og døende @dk
preferred label: 死亡 @zh-hans
preferred label: terminalfase og død @no-nb
definition: Social, medical and mental health issues relating to people at the end of their lives
definition: Soziale Aspekte von Tod und Sterben @de
definition: Saker relaterade till döden och döende. @se
definition: Questões sociais relacionadas com a morte. @pt-pt
definition: Sociale spørgsmål vedrørende død og døende. @dk
definition: 与死亡和临终有关的社会问题。 @zh-hans
definition: Sosiale og helsemessige spørsmål som gjeld personar i sluttfasen av livet. @no-nn
definition: Sosiale og helsemessige spørsmål som angår personer i livets sluttfase. @no-nb
in scheme: Media Topic
created: 2009-10-22T02:00:00+00:00
modified: 2021-02-18T12:00:00+00:00
broader: values
narrower: euthanasia
narrower: suicide

ethics
type: Concept
preferred label: Éthique @fr
preferred label: Etik @se
preferred label: اخلاق @ar
preferred label: Ethik @de
preferred label: Ética @es
preferred label: ética @pt-pt
preferred label: etik @dk
preferred label: 道德 @zh-hans
preferred label: etikk @no-nb
definition: Glaubenssystem aus akzeptablem Verhalten @de
definition: The moral values and standards that define right and wrong actions or decisions
definition: Läran om (god) moral. @se
definition: Sistema de crenças acerca de uma conduta aceitável. @pt-pt
definition: Læren om (god) moral. @dk
definition: 一套关于社会认可行为的信仰体系 @zh-hans
in scheme: Media Topic
created: 2009-10-22T02:00:00+00:00
modified: 2021-07-12T12:00:00+00:00
broader: values

pornography
type: Concept
preferred label: Pornografi @se
preferred label: اباحة @ar
preferred label: Pornografía @es
preferred label: Pornographie @fr
preferred label: Pornografie @de
preferred label: pornografia @pt-pt
preferred label: pornografi @dk
preferred label: 色情 @zh-hans
definition: Texter eller bilder som beskriver sex på ett sådant sätt att den som läser eller tittar på bilderna ska bli sexuellt upphetsad. @se
definition: The depiction of sexually explicit acts in various media renditions, such as video or photos, often considered obscene or immoral
definition: Akustische oder bildliche Darstellungen von verschiedenartigen im Zusammenhang mit Sexualität stehenden Taten, außerhalb der gesellschaftlich akzeptierten Normen @de
definition: Representações visuais, audiovisuais ou textuais de vários atos relacionados com sexo e considerados fora dos padrões aceites pela comunidade. @pt-pt
definition: Representações visuais, audiovisuais ou textuais de vários atos relacionados ao sexo e considerados fora dos padrões aceitos pela comunidade. @pt-br
definition: Tekster eller billeder, der beskriver sex på en sådan måde, at enhver, der læser eller ser på billederne, skal være seksuelt ophidset. @dk
definition: 在公认的社会标准之外，对各种与性有关的行为进行音频、视频或文本描述。 @zh-hans
in scheme: Media Topic
created: 2009-10-22T02:00:00+00:00
modified: 2021-02-18T12:00:00+00:00
broader: values

sexual behaviour
type: Concept
preferred label: SexuellesVerhalten @de
preferred label: Sexuellt beteende @se
preferred label: Comportement sexuel @fr
preferred label: سلوك جنسي @ar
preferred label: Comportamiento sexual @es
preferred label: comportamento sexual @pt-pt
preferred label: seksuel adfærd @dk
preferred label: 性行为 @zh-hans
preferred label: seksualliv @no-nb
preferred label: sexual behavior
definition: The manner in which people express their sexuality in physical acts
definition: Individers eller grupper sexuella beteende. @se
definition: Sexualverhalten von Einzelnen oder Gruppen @de
definition: Comportamento sexual de indivíduos ou grupos. @pt-pt
definition: Individer eller gruppers seksuelle adfærd. @dk
definition: 个体或群体的性行为 @zh-hans
definition: Seksuell åtferd hos menneske. @no-nn
definition: Menneskers seksuelle adferd. @no-nb
in scheme: Media Topic
created: 2009-10-22T02:00:00+00:00
modified: 2021-02-18T12:00:00+00:00
broader: values
broad match: http://cv.iptc.org/newscodes/subjectcode/12006000

euthanasia
type: Concept
preferred label: قتل رحيم @ar
preferred label: Sterbehilfe @de
preferred label: Euthanasie @fr
preferred label: Eutanasia @es
preferred label: Dödshjälp @se
preferred label: eutanásia @pt-pt
preferred label: aktiv dødshjælp @dk
preferred label: 安乐死 @zh-hans
preferred label: eutanasi @no-nb
definition: Medvetet påskyndande av annan persons död vid hopplös sjukdom. @se
definition: Unterstützung des Sterbens einer kranken Person @de
definition: The practice of humanely ending the life of a person suffering from a terminal illness
definition: Ajuda à morte de uma pessoa com uma doença terminal. @pt-pt
definition: Bevidst hjælp til en anden persons død i håbløs sygdom. @dk
definition: 协助绝症病人的死亡 @zh-hans
definition: Det å ta livet av ein nokon på oppmoding frå personen sjølv. @no-nn
definition: Det å ta livet av en person etter personens frivillige forespørsel. @no-nb
in scheme: Media Topic
created: 2009-10-22T02:00:00+00:00
modified: 2021-02-18T12:00:00+00:00
broader: death and dying
narrower: assisted suicide

suicide
type: Concept
preferred label: Suicide @fr
preferred label: Suicidio @es
preferred label: انتحار @ar
preferred label: Självmord @se
preferred label: Selbstmord @de
preferred label: suicídio @pt-pt
preferred label: selvmord @dk
preferred label: 自杀 @zh-hans
preferred label: sjølvmord @no-nn
definition: Avsiktlig självdestruktiv handling som leder till döden. @se
definition: The intentional taking of one's own life
definition: Tod durch die eigene Hand @de
definition: Morte de uma pessoa pelos seus próprios meios. @pt-pt
definition: Morte de uma pessoa por suas próprias mãos. @pt-br
definition: Forsætlig selvdestruktiv handling, der fører til død. @dk
definition: 自愿结束自己性命 @zh-hans
in scheme: Media Topic
created: 2009-10-22T02:00:00+00:00
modified: 2021-02-18T12:00:00+00:00
broader: death and dying

assisted suicide
type: Concept
preferred label: Assisterat självmord @se
preferred label: Suicidio asistido @es
preferred label: انتحار بمساعدة @ar
preferred label: Suicide assisté @fr
preferred label: Beihilfe zum Selbstmord @de
preferred label: suicídio assistido @pt-pt
preferred label: assisteret selvmord @dk
preferred label: 协助自杀 @zh-hans
preferred label: assistert selvmord @no-nb
preferred label: assistert sjølvmord @no-nn
definition: Avsiktlig självdestruktiv handling som leder till döden, som utförs med hjälp av en annan person. @se
definition: The practice of assisting a person suffering from a terminal illness in the process of suicide, often with a physician's oversight
definition: Freiwilliger Tod durch fremde Hilfe @de
definition: Morte pelas próprias mãos com a ajuda de outra pessoa. @pt-pt
definition: Forsætlig selvdestruktiv handling, der fører til død, udført med hjælp fra en anden person. @dk
definition: 通过别人的协助来自愿结束自己性命 @zh-hans
definition: Det å hjelpe ein person til å ta sitt eige liv. @no-nn
definition: Det å hjelpe en person til å ta sitt eget liv. @no-nb
in scheme: Media Topic
created: 2009-10-22T02:00:00+00:00
modified: 2021-02-18T12:00:00+00:00
broader: euthanasia
broad match: http://cv.iptc.org/newscodes/subjectcode/14005000

charity
type: Concept
preferred label: عمل خيري @ar
preferred label: Wohltätigkeit @de
preferred label: Activités caritatives @fr
preferred label: Välgörenhet @se
preferred label: Beneficencia @es
preferred label: caridade @pt-pt
preferred label: filantropia @pt-br
preferred label: velgørenhed @dk
preferred label: 慈善机构 @zh-hans
preferred label: veldedighet @no-nb
preferred label: velgjerd @no-nn
definition: The voluntary giving of money, food or other necessities to those in need
definition: Osjälvisk hjälp till människor som är i nöd eller att hjälpa sämre lottade. @se
definition: Menschenfreundliche Gabe @de
definition: Doação filantrópica. @pt-pt
definition: Uselvisk hjælp til mennesker i nød eller til at hjælpe de mindre heldige. @dk
definition: 慈善捐赠 @zh-hans
definition: Det å gi pengar, mat eller anna til fattige og nødlidande. @no-nn
definition: Det å gi penger, mat eller annet til trengende. @no-nb
in scheme: Media Topic
created: 2009-10-22T02:00:00+00:00
modified: 2021-05-05T12:00:00+00:00
broader: welfare

long-term care
type: Concept
preferred label: عناية طوبلة الامد @ar
preferred label: Långvård @se
preferred label: Cuidados de largo plazo @es
preferred label: Soins de longue durée @fr
preferred label: Langzeitpflege @de
preferred label: cuidados continuados @pt-pt
preferred label: langvarig pleje @dk
preferred label: 长期护理 @zh-hans
preferred label: langtidspleie @no-nb
definition: Umfassende Gesundheitspflege aufgrund ernsthafter Krankheit oder Invalidität @de
definition: Services provided on an extended and ongoing basis to patients suffering from chronic illness or disability
definition: Långvarig vård på sjukhus, vanligtvis av gamla eller obotligt sjuka. @se
definition: Serviços e cuidados de saúde prestados de forma prolongada e continuada a pacientes que sofrem de doenças crónicas ou deficiência. @pt-pt
definition: Serviços e cuidados de saúde prestados de forma prolongada e continuada a pacientes que sofrem de doenças crônicas ou deficiência. @pt-br
definition: Omfattende sundhedsydelser på grund af alvorlig sygdom eller handicap. @dk
definition: 因严重疾病或残疾而提供的广泛医疗保健 @zh-hans
in scheme: Media Topic
created: 2009-10-22T02:00:00+00:00
modified: 2021-05-05T12:00:00+00:00
broader: welfare

social services
type: Concept
preferred label: Socialtjänst @se
preferred label: خدمات اجتماعية @ar
preferred label: Servicios sociales @es
preferred label: Services sociaux @fr
preferred label: Sozialer Dienst @de
preferred label: serviços sociais @pt-pt
preferred label: social ydelse @dk
preferred label: 社会服务 @zh-hans
preferred label: sosiale tjenester @no-nb
preferred label: sosiale tenester @no-nn
definition: Social programmes, usually publicly sponsored, aimed at promoting people's welfare, such as housing, health care or education services
definition: Programme, die von der Regierung unterstützt werden zur Verbesserung des Wohlergehens von Individuen oder Gruppen von Individuen @de
definition: Social verksamhet i kommunal regi enligt socialtjänstlagen. @se
definition: Programas apoiados para melhorar o bem-estar de indivíduos ou grupos de indivíduos. @pt-pt
definition: Understøttede programmer til forbedring af enkeltpersoners eller grupper af individers trivsel. @dk
definition: 支持改善个人或个人群体福利的方案 @zh-hans
definition: Social programs, usually publicly sponsored, aimed at promoting people's welfare, such as housing, health care or education services
in scheme: Media Topic
created: 2009-10-22T02:00:00+00:00
modified: 2021-02-18T12:00:00+00:00
broader: welfare

elderly care
type: Concept
preferred label: Äldrevård @se
preferred label: assistência a idosos @pt-pt
preferred label: ældrepleje @dk
preferred label: 老年护理 @zh-hans
preferred label: eldreomsorg @no-nb
preferred label: Altenpflege @de
preferred label: Soins aux personnes âgées @fr
preferred label: Cuidado de ancianos @es
preferred label: رعاية الاشخاص المسنين @ar
definition: The long-term care of the elderly provided by residential institutions or by paid daily help in the home
definition: Vård av äldre som inte direkt har med sjukdomar att göra utan mer behov som uppstår när människor blir äldre @se
definition: Cuidados continuados prestados a idosos por instituições residenciais ou por apoio domiciliário. @pt-pt
definition: Pleje af ældre, hvad enten det foregår på plejehjem eller som hjemmehjælp. @dk
definition: 居家养老机构提供的长期养老服务或在家中提供的有偿日常帮助 @zh-hans
definition: Die Langzeitpflege älterer Menschen durch stationäre Einrichtungen oder durch bezahlte tägliche Hilfe zu Hause @de
in scheme: Media Topic
created: 2019-06-26T12:00:00+00:00
modified: 2021-07-12T12:00:00+00:00
broader: welfare

public housing
type: Concept
preferred label: Nödboende @se
preferred label: kommunale boliger @no-nb
preferred label: habitação social @pt-pt
preferred label: socialt byggeri @dk
preferred label: 公共房屋 @zh-hans
preferred label: Sozialer Wohnungsbau @de
preferred label: Logement social @fr
preferred label: Vivienda social @es
preferred label: kommunale bustader @no-nn
preferred label: مساكن اجتماعية @ar
definition: Housing that is owned or managed by a government or nonprofit organisation and rented to tenants with the aim of making housing affordable. Eligibility for such housing arrangements varies country to country.
definition: Hus som drivs av myndigheter eller organisationer för att erbjuda boende till hemlösa. @se
definition: Habitação que pertence ou é administrada por um governo ou por uma organização sem fins lucrativos e alugada a inquilinos com o objetivo de tornar a habitação acessível. A elegibilidade para esse tipo de alojamento varia de país para país. @pt-pt
definition: Byggeri der er ejet eller styret af en regering eller non-profit organisation med mål om at udleje til rimelige priser. Berettigelse til dette variere fra land til land. @dk
definition: 政府或非营利机构拥有或管理的房屋，用于租赁给低收入人群，不同国家对享有租赁该种房屋的人员资质要求各异 @zh-hans
definition: Wohnungen, die Eigentum einer Regierung oder einer gemeinnützigen Organisation sind oder von ihr verwaltet werden und an Mieter vermietet werden, mit dem Ziel, Wohnraum erschwinglich zu machen. Die Anspruchsberechtigung für solche Wohnvereinbarungen variiert von Land zu Land. @de
definition: Housing that is owned or managed by a government or nonprofit organization and rented to tenants with the aim of making housing affordable. Eligibility for such housing arrangements varies country to country.
in scheme: Media Topic
created: 2020-08-05T12:00:00+00:00
modified: 2021-07-12T12:00:00+00:00
broader: welfare

child care
type: Concept
preferred label: barnepass @no-nb
preferred label: Barnomsorg @se
preferred label: børneinstitution @dk
preferred label: assistência infantil @pt-pt
preferred label: 儿童保育 @zh-hans
preferred label: Kinderbetreuung @de
preferred label: Garde d'enfants @fr
preferred label: Cuidado infantil @es
preferred label: خدمات رعاية الاطفال @ar
definition: Services and facilities that look after children while their parents are working or away, including daycare centres and programmes
definition: Services and facilities that look after children while their parents are working or away, including daycare centers and programs
definition: Förskolor och liknande som tar hand om och utvecklar barnen när föräldrarna arbetar. @se
definition: Vuggestue, dagpleje eller børnehave, hvor børn bliver passet af andre voksne, mens deres forældre er på arbejde. @dk
definition: Serviços e instalações para acolher crianças enquanto os pais estão a trabalhar ou ausentes, como creches ou jardins-de-infância. @pt-pt
definition: Serviços e instalações para acolher crianças enquanto os pais estão trabalhando ou ausentes, como creches ou jardins de infância. @pt-br
definition: 在父母工作或外出期间照顾儿童的服务和设施，包括日托中心和活动安排 @zh-hans
definition: Dienste und Einrichtungen, die Kinder betreuen, während ihre Eltern arbeiten oder abwesend sind, einschließlich Kindertagesstätten und -programme @de
in scheme: Media Topic
created: 2021-02-18T12:00:00+00:00
modified: 2021-07-12T12:00:00+00:00
broader: welfare

American football
type: Concept
preferred label: Fútbol americano @es
preferred label: Football américain @fr
preferred label: كرة قدم اميركية @ar
preferred label: Amerikansk fotboll @se
preferred label: futebol americano @pt-pt
preferred label: amerikansk fodbold @dk
preferred label: 美式橄榄球 @zh-hans
preferred label: amerikansk fotball @no-nb
definition: Team ball game that opposes two teams of 11 that have offence and defence sections. Each offence attempts to move an oval ball down the 120 yards long field. Points are scored by advancing the ball into the opposing team s end zone.
definition: Mannschaftsballspiel, bei dem zwei Teams gegeneinander spielen, die Gebiete angreifen und verteidigen müssen. Jeder Angriff folgt auf die Verteidigung der anderen, mit dem Versuch einen Ball in das Feld und in die Zone zu bringen, einen Touchdown zu erzielen und damit Punkte zu machen @de
definition: Matcher mellan elvamannalag på en 120 yards lång bana, där lagen får poäng genom att förflytta den ovala bollen in i motståndarnas målzon. @se
definition: Jogo de bola que opõe duas equipas, compostas por uma secção de ataque e outra de defesa. Cada ataque avança em direção à defesa contrária, movendo uma bola ovalada pelo campo até à *end zone* para marcar *touchdown* e ganhar pontos. @pt-pt
definition: Jogo de bola que opõe duas equipes, compostas por uma secção de ataque e outra de defesa. Cada ataque avança em direção à defesa contrária, movendo uma bola ovalada pelo campo até à *end zone* para marcar *touchdown* e ganhar pontos. @pt-br
definition: Kampe mellem to hold af elleve mænd på en 120 yards bane, hvor holdet får point ved at flytte den ovale bold ind i modstanderens målzone. @dk
definition: 一种对抗性的集体球类运动，对抗两队各有11人，每回合一方进攻一方防守。 每次进攻方都试图把一个椭圆形的球从本方端沿120码长的场地向对方端推进。 通过将球推进到对方球队的底线来得分 @zh-hans
definition: Team ball game that opposes two teams of 11 that have offense and defense sections. Each offense attempts to move an oval ball down the 120 yards long field. Points are scored by advancing the ball into the opposing team*s end zone.
change note: 2016-04-06: definition rephrased.
in scheme: Media Topic
created: 2009-10-22T02:00:00+00:00
modified: 2021-02-18T12:00:00+00:00
broader: competition discipline

archery
type: Concept
preferred label: Bogenschießen @de
preferred label: نبالة @ar
preferred label: Bågskytte @se
preferred label: Tiro con arco @es
preferred label: Tir à l'arc @fr
preferred label: tiro com arco @pt-pt
preferred label: bueskydning @dk
preferred label: 射箭 @zh-hans
preferred label: bueskyting @no-nb
preferred label: bogeskyting @no-nn
definition: De tävlande använder pil och båge och försöker träffa måltavlan från olika avstånd. @se
definition: Archers use bows and arrows to aim at targets 1.22 metres in diameter which are on average 70 metres distant.
definition: Bogenschütze benutzt Bogen und Pfeile, um eine Zielscheibe zu treffen mit 1.22 Meter Durchmesser, im Durchschnitt in 70 Meter Entfernung @de
definition: Os arqueiros usam arcos e flechas para acertar em alvos de 1.22 metros de diâmetro, colocados a cerca de 710 metros de distância. @pt-pt
definition: Deltagerne bruger pil og bue og prøver at ramme målet fra forskellige afstande. @dk
definition: 选手使用弓和箭来瞄准平均70米远的直径1.22米的靶子 @zh-hans
definition: Archers use bows and arrows to aim at targets 1.22 meters in diameter which are on average 70 meters distant.
in scheme: Media Topic
created: 2009-10-22T02:00:00+00:00
modified: 2021-02-18T12:00:00+00:00
broader: competition discipline
narrower: crossbow shooting
narrower: longbow

athletics
type: Concept
preferred label: Leichtathletik @de
preferred label: Athlétisme @fr
preferred label: العاب القوى @ar
preferred label: Atletismo en pista y campo @es
preferred label: Friidrott @se
preferred label: atletismo @pt-pt
preferred label: atletik @dk
preferred label: 田径 @zh-hans
preferred label: friidrett @no-nb
preferred label: track and field
definition: Wettbewerbe im Laufen, Springen und Werfen, die auf einer Bahn im Stadion oder auf der Straße ausgeübt werden können @de
definition: Samlingsbegrepp för olika tävlingar som inkluderar löpning, hopp och kast. @se
definition: Competitions involving foot races, jumping and throwing which can be on a track inside a stadium or on outside roads
definition: Competições que envolvem corridas a pé, saltos e lançamentos, em pista de estádio ou ao ar livre. @pt-pt
definition: Forskellige konkurrencer, der inkluderer løb, spring og kast. @dk
definition: 包括竞走、赛跑、跳跃和投掷的比赛，这些比赛可以在体育场内的跑道上进行，也可以在室外道路上进行 @zh-hans
in scheme: Media Topic
created: 2009-10-22T02:00:00+00:00
modified: 2021-05-05T12:00:00+00:00
broader: competition discipline
narrower: cross-country run
narrower: decathlon
narrower: discus throw
narrower: hammer throw
narrower: heptathlon
narrower: high jump
narrower: hurdles
narrower: javelin throw
narrower: long distance run
narrower: long jump
narrower: middle distance run
narrower: pentathlon
narrower: pole vault
narrower: race walking
narrower: relay run
narrower: shot put
narrower: sprint run
narrower: triple jump
narrower: steeplechase (athletics)

Australian rules football
type: Concept
preferred label: Football australien @fr
preferred label: Australisk fotboll @se
preferred label: كرة القدم الاسترالية @ar
preferred label: Fútbol australiano @es
preferred label: futebol australiano @pt-pt
preferred label: australsk fodbold @dk
preferred label: 澳式橄榄球 @zh-hans
preferred label: australsk fotball @no-nb
definition: Football der mit australischen Regeln gespielt wird @de
definition: A form of football played by two teams of 18 competing on a pitch by running with and passing an oval ball. Points are scored by moving the ball between goal posts. Governed by the Australian Football League.
definition: En bollsport med oval boll som kan sägas vara en blandning mellan vanlig fotboll och rugby. @se
definition: Tipo de futebol disputado por duas equipas de 18 jogadores em campo, que correm e passam uma bola oval. São atribuídos pontos quando a bola passa por entre os postes da baliza. É regulamentado pela Liga de Futebol Australiano. @pt-pt
definition: Tipo de futebol disputado por duas equipes de 18 jogadores em campo, que correm e passam uma bola oval. São atribuídos pontos quando a bola passa por entre os postes do gol. É regulamentado pela Liga de Futebol Australiano. @pt-br
definition: En boldsport med en oval bold, der kan siges at være en blanding mellem almindelig fodbold og rugby. @dk
definition: 澳洲橄榄球运动。两个队。每队18人。在球场内带橄榄球跑动或传递。球带到对方球门柱内得分。由澳洲橄榄球联盟进行管理 @zh-hans
change note: 2016-04-06: definition rephrased.
in scheme: Media Topic
created: 2009-10-22T02:00:00+00:00
modified: 2021-02-18T12:00:00+00:00
broader: competition discipline

badminton
type: Concept
preferred label: بادمنتون @ar
preferred label: Badminton @fr
preferred label: Bádminton @es
preferred label: 羽毛球 @zh-hans
definition: Two players or two teams of two compete by hitting a shuttlecock weighing approximately five grams over a high net. The aim for each player/team is to prevent the shuttlecock landing on their side of the court.
definition: Zwei Spieler oder Teams mit zwei Spielern, die einen Federball mit dem ungefähren Gewicht von 5 Gramm über ein hohes Netz schlagen. Das Ziel für jeden Spieler/Team ist es, die Landung des Federballs auf ihrer Seite des Feldes zu verhindern @de
definition: En idrott som spelas mellan två eller fyra spelare på en avgränsad bana med ett högt nät mellan. Spelarna slår på en fjäderboll och försöker få den att landa på marken i motståndarnas planhalva. @se
definition: Dois jogadores ou duas duplas competem batendo um volante com uma raquete, sobre uma rede alta. O objetivo de cada jogador/dupla é impedir o volante de tocar o chão no seu lado do campo. @pt-pt
definition: Dois jogadores ou duas duplas competem batendo uma peteca com uma raquete, sobre uma rede alta. O objetivo de cada jogador/dupla é impedir a peteca de tocar o chão em seu lado da quadra. @pt-br
definition: To spillere eller to hold af to, konkurrerer ved at slå en fjerbold, der vejer cirka fem gram over et højt net. Målet for hver spiller/hold er at forhindre, at fjerbolden lander på deres side af den afgrænsede bane. @dk
definition: 两名运动员或两个双人组的队伍通过击打一个重约5克的羽毛球越过一个高网进行比赛。 每个运动员/球队的目标是防止羽毛球落在他们这边的球场上 @zh-hans
in scheme: Media Topic
created: 2009-10-22T02:00:00+00:00
modified: 2021-02-18T12:00:00+00:00
broader: competition discipline

bandy
type: Concept
preferred label: باندي @ar
preferred label: Bandy @de
preferred label: 室外冰球 @zh-hans
definition: Spelas på en isbana av ungefär samma storlek som en fotbollsplan. Spelarna har skridskor och en klubba med kortare rundat blad. Spelas med liten hård boll. Lagen består av elva spelare, varav en är målvakt. @se
definition: Played outdoors on ice. The size of the ice rink is about the size of a soccer field. Skates like ice hockey. A small hard ball is used for playing. Players play with sticks, much like in ice hockey, but the sticks are shorter and more rounded than in ice
definition: Wird im Freien auf Eis gespielt. Die Größe des Spielfeldes entspricht einem Fußballfeld. Benutzt werden Schlittschuhe wie im Eishockey und ein kleiner Kunststoffball. Die Schläger der Spieler ähneln Eishockeyschlägern, sind aber kürzer und stärker gerundet @de
definition: Espécie de hóquei no gelo, jogado ao ar livre, sobre uma pista de gelo aproximadamente do tamanho de um campo de futebol. Os jogadores usam uma pequena bola dura e tacos, muito parecidos com os do hóquei no gelo, mas mais curtos e mais arredondados. @pt-pt
definition: Spilles på en skøjtebane af omtrent samme størrelse som en fodboldbane. Spillerne har skøjter på og en stav med korte afrundede klinger. Spilles med en lille hård bold. Holdet består af elleve spillere, hvoraf den ene er en målmand. @dk
definition: 户外冰上运动。冰球场大小和足球场相近。冰鞋和正常冰球使用的类似。使用一个小的硬球进行比赛。选手们的球杆类似于冰球所用，但比一般冰球用的短、圆 @zh-hans
in scheme: Media Topic
created: 2009-10-22T02:00:00+00:00
modified: 2021-02-18T12:00:00+00:00
broader: competition discipline

baseball
type: Concept
preferred label: Béisbol @es
preferred label: Baseball @de
preferred label: بيسبول @ar
preferred label: Baseboll @se
preferred label: beisebol @pt-pt
preferred label: 棒球 @zh-hans
definition: Match mellan niomannalag där det lag som samlar flest poäng vinner. Poäng får man genom att springa runt banan som är markerad med fyra rundningsmärken. Spelaren måste först träffa en boll som kastas av en spelare i motståndarlaget. @se
definition: Ein Spiel zwischen zwei Teams von neun auf einem geschlossenen Platz. Das Team mit den meisten Punkten gewinnt. Ein Punkt wird gemacht, wenn ein Spieler über den Platz läuft und dabei 4 Stationen passiert @de
definition: A game between two teams of nine played on an enclosed ground. The team which scores the most points wins. A point is scored when a player runs around the ground marked out by four bases. To do this he has to hit the ball thrown at him by a rival player.
definition: Jogo disputado entre 2 equipas de 9 jogadores em campo fechado. Ganha a equipa que marcar mais pontos durante a partida. Para marcar um ponto, o jogador, após bater a bola com um bastão, deve dar a volta ao campo marcado por 4 bases externas. @pt-pt
definition: Jogo disputado entre 2 equipes de 9 jogadores em campo fechado. Ganha a equipe que marcar mais pontos durante a partida. Para marcar um ponto, o jogador, após bater a bola com um bastão, deve dar a volta ao campo marcado por 4 bases externas. @pt-br
definition: Kamp mellem Nimands hold, hvor det hold, der samler flest point vinder. Point opnås ved at løbe rundt på banen, der er markeret med fire afrundingsmærker. Spilleren skal først ramme en bold, der er kastet af en spiller i modstanderholdet. @dk
definition: 在封闭的场地上进行的每队九人两只队伍的比赛。得分最高的球队获胜。当一个球员绕着由四个垒标注的场地跑完一圈时，就可以得分。要做到这一点，他必须击中对手向他投掷的球 @zh-hans
in scheme: Media Topic
created: 2009-10-22T02:00:00+00:00
modified: 2021-02-18T12:00:00+00:00
broader: competition discipline
narrower: rubberball baseball

basketball
type: Concept
preferred label: Basket-ball @fr
preferred label: سلة @ar
preferred label: Basketball @de
preferred label: Basket @se
preferred label: Básquetbol @es
preferred label: basquetebol @pt-pt
preferred label: basquete @pt-br
preferred label: 篮球 @zh-hans
definition: Spiel zwischen zwei Teams mit 5 Spielern - Punkte werden gemacht in dem man einen großen aufgepumpten Ball in einen Korb wirft, der 3.05 Meter über dem Boden hängt @de
definition: Match mellan två femmannalag där de passar en boll och försöker pricka en fast korg med nät som sitter 3,05 meter över marken. @se
definition: Game played between two teams of five - points are scored by placing the large inflated ball into a net fixed on a ring 3.05m above the ground.
definition: Jogo disputado entre duas equipas de 5 jogadores. Pontos são marcados quando uma bola é encestada num aro com rede, que se encontra a uma altura de 3.05m do solo. @pt-pt
definition: Jogo disputado entre duas equipes de 5 jogadores. Pontos são marcados quando uma bola é encestada num aro com rede, que se encontra a uma altura de 3.05m do solo. @pt-br
definition: Basketball spilles mellem to hold af fem. Point scores ved at placere den store bold i et net, der er fastgjort på en ring 3,05 m over jorden. @dk
definition: 集体球类运动。两队比赛，每队5人。运动员将球投入对方离地3.05米高的篮网内得分 @zh-hans
in scheme: Media Topic
created: 2009-10-22T02:00:00+00:00
modified: 2021-02-18T12:00:00+00:00
broader: competition discipline

biathlon
type: Concept
preferred label: Biatlón @es
preferred label: Skidskytte @se
preferred label: بياثلون @ar
preferred label: Biathlon @de
preferred label: biatlo @pt-pt
preferred label: skiskydning @dk
preferred label: 冬季两项 @zh-hans
preferred label: skiskyting @no-nb
definition: Eine Kombination aus Skilanglauf und Schießen auf Zielscheiben (auf einem 12,5 km langen Kurs, Verfolgungsstart) @de
definition: A combination of cross-country skiing and target shooting on a 12.5 K course in a pursuit format.
definition: En kombination av längdskidåkning och skytte. Antal skjutningar och regler för missar i skytte varierar mellan olika tävlingstyper. @se
definition: Prova que combina esqui de fundo com tiro ao alvo, numa corrida de perseguição de 12.5 km. @pt-pt
definition: Prova que combina esqui de fundo com tiro ao alvo, em uma corrida de perseguição de 12.5 km. @pt-br
definition: En kombination af langrend og skydning. Antallet af skud og regler for missede skud i skydning varierer mellem de forskellige konkurrencetyper. Kaldes også biatlon. @dk
definition: 结合了12.5公里的越野滑雪和目标射击的追逐形式比赛 @zh-hans
in scheme: Media Topic
created: 2009-10-22T02:00:00+00:00
modified: 2021-05-05T12:00:00+00:00
broader: competition discipline

billiards
type: Concept
preferred label: Biljard @se
preferred label: بلياردو @ar
preferred label: Billar @es
preferred label: Billard @de
preferred label: bilhar @pt-pt
preferred label: billard @dk
preferred label: 台球 @zh-hans
preferred label: biljard @no-nb
definition: De tävlande använder en kö för att pricka bollar på ett speciellt bord och få ner bollarna i hål i hörnen och på långsidorna. @se
definition: Ein Spiel, was auf einem flachen Tisch gespielt wird, der mit Stoff bezogen ist, auf dem die Spieler Kugeln mit einem Holzqueue anstoßen nach bestimmten Regeln @de
definition: A cue sport with balls on a table without a specific order to play them
definition: Desporto de taco e bolas disputado sobre uma mesa e sem ordem específica para as jogar. @pt-pt
definition: Esporte de taco e bolas disputado sobre uma mesa e sem ordem específica para as jogar. @pt-br
definition: Deltagerne bruger en kø til at støde kugler på et specielt bord og bringe kuglerne i huller i hjørnerne og på langsiderne. @dk
definition: 一种用球杆击打桌面上的球的运动，没有特定的击球顺序 @zh-hans
definition: Samlenemning på greiner der ein bruker ein kø til å støyte kuler på eit filtdekt bord med eller utan hol i kantane. @no-nn
definition: Samlebetegnelse på grener der man bruker en kø til å støte kuler på et filtbelagt bord med eller uten hull i kantene. @no-nb
in scheme: Media Topic
created: 2009-10-22T02:00:00+00:00
modified: 2021-02-18T12:00:00+00:00
broader: competition discipline
broad match: http://cv.iptc.org/newscodes/subjectcode/15010000
has facet: billiardtype

bobsleigh
type: Concept
preferred label: Bobsleigh @fr
preferred label: Bob @de
preferred label: بوبسلي @ar
preferred label: bobsled @pt-br
preferred label: bobslæde @dk
preferred label: 雪橇 @zh-hans
preferred label: bob @no-nb
definition: Im Bobsport fahren zwei oder vier Athleten in einem Rennschlitten sitzend, der aus einer Verkleidung, einem Rahmen, zwei Achsen und Kufen besteht, eine Bahn (Natureis- oder Kunsteisbahn) hinab. Die Gesamtlaufzeit wird aus den Einzelzeiten der Läufe zusammengezählt und daraus der Gewinner ermittelt @de
definition: Två eller fyra tävlande sitter i en specialkonstruerad släde och åker nerför en konstgjord isbana. @se
definition: One, two or four people racing down a course in a sled that consists of a main hull, a frame, two axles and sets of runners. The total time of all heats in a competition is added together to determine the winner.
definition: Desporto de inverno em que equipas de 2 ou 4 pessoas, sentadas num trenó com casco assente em 4 trilhos de aço, deslizam por uma estreita pista de gelo protegida lateralmente e com muitas curvas. @pt-pt
definition: Esporte de inverno em que equipes de 2 ou 4 pessoas, sentadas em um trenó com casco assente em 4 trilhos de aço, deslizam por uma estreita pista de gelo protegida lateralmente e com muitas curvas. @pt-br
definition: To eller fire konkurrenter sidder i en specielt designet slæde og kører ned ad en kunstig isbane. @dk
definition: 在有舵雪橇比赛中，两到四个人坐在雪橇上滑下一条赛道，雪橇由主船体、框架、两个车轴和一组运动员组成。比赛中所有预赛的总时间加在一起来决定获胜者 @zh-hans
in scheme: Media Topic
created: 2009-10-22T02:00:00+00:00
modified: 2022-02-03T12:00:00+00:00
broader: competition discipline

boules
type: Concept
preferred label: Boule @se
preferred label: Boules und Pètanque @de
preferred label: Boule anglaise et pétanque @fr
preferred label: Bolos y petanca @es
preferred label: بيتانك @ar
preferred label: petanca @pt-pt
preferred label: bowls og petanque @dk
preferred label: 地掷球 @zh-hans
preferred label: boules og petanque @no-nb
definition: Collective name of a number of games where the common goal is to move the competitor's balls as close to a small target ball as possible, played on a grass or sand surface. Balls are thrown (as in petanque and boules) or rolled (as in lawn bowls or bocce).
definition: Spiel bei dem die Spieler Kugeln auf eine Zielscheibe werfen. Der Gewinner ist derjenige, der am nächsten herankommt @de
definition: De tävlande turas om att kasta sina klot mot en målkula. Närmast vinner. @se
definition: Jogo que consiste no lançamento de bolas de aço com o objetivo de ficarem o mais próximo possível do alvo, uma pequena bola de madeira que é atirada no início do jogo. @pt-pt
definition: Et spil, hvor spillere kaster kugler mod et mål og hvor vinderen er den spiller, der lander tættest. @dk
definition: 对一系列球类运动的总称，这类运动在草地或沙地进行，以投手移动球并尽可能近地接近一个小目标为目的。移动方式可为投掷（如法式滚球）或滚动（如草地滚球） @zh-hans
in scheme: Media Topic
created: 2009-10-22T02:00:00+00:00
modified: 2021-05-05T12:00:00+00:00
broader: competition discipline

boxing
type: Concept
preferred label: Boxen @de
preferred label: Boxe @fr
preferred label: Boxeo @es
preferred label: Boxning @se
preferred label: ملاكمة @ar
preferred label: boxe @pt-pt
preferred label: boksning @dk
preferred label: 拳击 @zh-hans
preferred label: boksing @no-nb
definition: Combat sport in which two men/women fight using only their fists covered by padded gloves in a square ring measuring 6m a side. The fight is usually split into 12 rounds of three minutes each.
definition: Kampfsport bei dem zwei Männer/Frauen kämpfen mit Fäusten, die geschützt sind durch Handschuhe, in einem Ring von 6 m je Seite. Der Kampf ist in der Regel geteilt in 12 Runden von jeweils 3 Minuten @de
definition: Två tävlande med handskar på händerna försöker träffa varandra med knytnävarna. Tävlingen sker i en avgränsad fyrkant, normalt i ronder om tre minuter, och kan avgöras direkt vid knockout eller på poäng. @se
definition: Desporto de combate em que dois homens ou duas mulheres lutam usando apenas os punhos protegidos por luvas, num ringue quadrado de 6m de lado. A luta é geralmente dividida em 12 assaltos de 3 minutos cada. @pt-pt
definition: Esporte de combate em que dois homens ou duas mulheres lutam usando apenas os punhos protegidos por luvas, num ringue quadrado de 6m de lado. A luta é geralmente dividida em 12 assaltos de 3 minutos cada. @pt-br
definition: To deltagere med handsker på hænderne forsøger at ramme hinanden med næverne. @dk
definition: 技击运动。2名男或女选手在一个边长6米的正方形拳击圈内，使用戴着拳套的拳头击打对方。比赛一般分12轮。每轮3分钟 @zh-hans
in scheme: Media Topic
created: 2009-10-22T02:00:00+00:00
modified: 2021-02-18T12:00:00+00:00
broader: competition discipline
narrower: bantamweight (boxing)
narrower: cruiserweight (boxing)
narrower: featherweight (boxing)
narrower: flyweight (boxing)
narrower: heavyweight (boxing)
narrower: light flyweight (boxing)
narrower: light-heavyweight (boxing)
narrower: light-middleweight (boxing)
narrower: light-welterweight (boxing)
narrower: lightweight (boxing)
narrower: middleweight (boxing)
narrower: straw weight (boxing)
narrower: super-bantamweight (boxing)
narrower: super-featherweight (boxing)
narrower: super-flyweight (boxing)
narrower: super-heavyweight (boxing)
narrower: super-middleweight (boxing)
narrower: welterweight (boxing)
has facet: weightclasstype

bullfighting
type: Concept
preferred label: Stierkampf @de
preferred label: Toros @es
preferred label: Tauromachie @fr
preferred label: Tjurfäktning @se
preferred label: مصارعة الثيران @ar
preferred label: tourada @pt-pt
preferred label: tyrefægtning @dk
preferred label: 斗牛 @zh-hans
preferred label: tyrefekting @no-nb
definition: Tävlingar där människor utmanar tjurar i en arena. @se
definition: Classical contest pitting man against the bull
definition: Klassischer Wettkampf Mann gegen Stier @de
definition: Espetáculo tradicional de Portugal, Espanha e França, também popular em alguns países da América do Sul, que consiste na lide de touros bravos. @pt-pt
definition: Konkurrence, hvor folk udfordrer tyre på en arena. @dk
definition: 经典的使人和公牛对抗的比赛 @zh-hans
in scheme: Media Topic
created: 2009-10-22T02:00:00+00:00
modified: 2021-02-18T12:00:00+00:00
broader: competition discipline

Canadian football
type: Concept
preferred label: Kanadensisk fotboll @se
preferred label: Football canadien @fr
preferred label: Canadian Football @de
preferred label: Fútbol canadiense @es
preferred label: كرة القدم الكندية @ar
preferred label: futebol canadiano @pt-pt
preferred label: futebol canadense @pt-br
preferred label: canadisk fodbold @dk
preferred label: 加拿大橄榄球 @zh-hans
preferred label: kanadisk fotball @no-nb
definition: En sport som påminner om amerikansk fotboll men har andra mått och regler och ett annat antal spelare. @se
definition: Team ball game that opposes two teams of 12 that have offence and defence sections. Each offence attempts to move an oval ball down the 150 yards long field. Points are scored by advancing the ball into the opposing team s end zone.
definition: Football der mit Kanadischen Regeln gespielt wird @de
definition: Jogo de bola disputado entre duas equipas de 12 jogadores que têm secções de ataque e defesa. Cada ataque tenta mover uma bola oval pelo campo de 150 jardas de comprimento. Os pontos são marcados quando se avança a bola para a *end zone* do adversário. @pt-pt
definition: Jogo de bola disputado entre duas equipes de 12 jogadores que têm seções de ataque e defesa. Cada ataque tenta mover uma bola oval pelo campo de 150 jardas de comprimento. Os pontos são marcados quando se avança a bola para a *end zone* do adversário. @pt-br
definition: En sport, der minder om amerikansk fodbold, men har forskellige dimensioner og regler og et andet antal spillere. @dk
definition: 一种对抗性的集体球类运动，对抗两队各有12人，每回合一方进攻一方防守。 每次进攻方都试图把橄榄球从本方端沿150码长的场地向对方端推进。 通过将球推进到对方球队的底线来得分 @zh-hans
definition: Team ball game that opposes two teams of 12 that have offense and defense sections. Each offense attempts to move an oval ball down the 150 yards long field. Points are scored by advancing the ball into the opposing team*s end zone.
change note: 2016-04-06: definition rephrased.
in scheme: Media Topic
created: 2009-10-22T02:00:00+00:00
modified: 2021-02-18T12:00:00+00:00
broader: competition discipline

canoeing
type: Concept
preferred label: Canotaje @es
preferred label: كانو كاياك @ar
preferred label: Canoë @fr
preferred label: Kanot (kanadensare) @se
preferred label: Kanu @de
preferred label: canoagem @pt-pt
preferred label: kano @dk
preferred label: 划艇 @zh-hans
preferred label: kanopadling @no-nb
definition: Wettkampf mit Kanus, die meistens kniend mit einem Einzel-Stechpaddel fortbewegt werden @de
definition: Tävling i farkoster där de tävlande normalt står på knä och paddlar med en ensidig paddel. @se
definition: Competition involving canoes which are generally kneeled and paddled with a single-bladed paddle
definition: Competição que envolve canoas e em que os participantes remam com uma pagaia simples. @pt-pt
definition: Competição que envolve canoas e em que os participantes remam com um remo simples. @pt-br
definition: Konkurrence i kanoer, hvor konkurrenterne normalt sidder på knæene og padler med en ensidet padle. @dk
definition: 有关划艇的比赛，通常用单叶桨跪着划桨 @zh-hans
in scheme: Media Topic
created: 2009-10-22T02:00:00+00:00
modified: 2021-02-18T12:00:00+00:00
broader: competition discipline
narrower: C1 (canoeing)
narrower: C2 (canoeing)
narrower: C4 (canoeing)
narrower: canoe sailing
narrower: pontoniering
has facet: canoekayaktype
broad match: http://cv.iptc.org/newscodes/subjectcode/15015000

casting (fishing)
type: Concept
preferred label: Casting (pêche) @fr
preferred label: رمي @ar
preferred label: Lanzamiento (pesca) @es
preferred label: Casting @se
preferred label: Casting (Angeln) @de
preferred label: casting (pesca) @pt-pt
preferred label: fiskekonkurrence @dk
preferred label: 钓鱼 @zh-hans
preferred label: casting @no-nb
definition: De tävlande använder kastspön, samma som när man fiskar, men med en vikt i stället för drag. Det gäller att träffa olika markerade mål och samla poäng. @se
definition: Using fishing equipment to hit a target and score points
definition: Ziel- und Weitwerfen mit Angelgeräten @de
definition: Uso de equipamento de pesca para atingir um alvo e marcar pontos. @pt-pt
definition: Alle former for konkurrencer, som omhandler lystfiskeri. @dk
definition: 用捕鱼工具击中目标而得分 @zh-hans
in scheme: Media Topic
created: 2009-10-22T02:00:00+00:00
modified: 2021-07-12T12:00:00+00:00
broader: competition discipline

mountain climbing
type: Concept
preferred label: Klättring @se
preferred label: Alpinismo @es
preferred label: تسلق @ar
preferred label: Alpinisme et escalade @fr
preferred label: Bergsteigen @de
preferred label: alpinismo @pt-pt
preferred label: bjergklatring @dk
preferred label: 爬山 @zh-hans
preferred label: fjellklatring @no-nb
definition: Sich am Berg hochbewegen mit Hilfe von Händen und Füßen @de
definition: Klättting i naturen genom att använda händer och fötter. @se
definition: Moving up mountains using hands and feet
definition: Escalar montanhas usando mãos, pés e equipamento próprio. @pt-pt
definition: Bevæge sig op ad bjerge ved hjælp af hænder og fødder, samt diverse hjælpemidler til klatringen. @dk
definition: 使用手和脚爬山 @zh-hans
in scheme: Media Topic
created: 2009-10-22T02:00:00+00:00
modified: 2021-02-18T12:00:00+00:00
broader: competition discipline
narrower: ice climbing
narrower: mountaineering

sport climbing
type: Concept
preferred label: Sportklettern @de
preferred label: Sportklättring @se
preferred label: Escalade @fr
preferred label: Escalada libre @es
preferred label: رياضة التسلق @ar
preferred label: escalada @pt-pt
preferred label: sportsklatring @dk
preferred label: 运动攀登 @zh-hans
definition: Tävlingar i att klättra i konstgjorda miljöer med olika svårighetsgrader. @se
definition: Sport climbing as a special category: individual competition, on an artificial wall with time measurement
definition: Sportklettern als Spezialdisziplin: Einzelwettbewerb mit Zeitmessung an einer künstlichen Kletterwand @de
definition: Escalada desportiva como categoria especial: competição individual, em parede artificial com limite de tempo. @pt-pt
definition: Escalada esportiva como categoria especial: competição individual, em parede artificial com limite de tempo. @pt-br
definition: Konkurrencer i klatring i kunstige miljøer med forskellige vanskeligheder. @dk
definition: 又译攀石，是一个特殊的运动分类：只有个人赛，在人造岩壁上进行的计时比赛 @zh-hans
in scheme: Media Topic
created: 2009-10-22T02:00:00+00:00
modified: 2021-07-12T12:00:00+00:00
broader: competition discipline

cricket
type: Concept
preferred label: كريكيت @ar
preferred label: Cricket @es
preferred label: Kricket @de
preferred label: críquete @pt-pt
preferred label: 板球 @zh-hans
definition: Ball sport involving two teams of 11 players, balls, bats and wickets. The aim is to score as many runs as possible, and to get the opposing team 'out'. A 'run' involves a player running between two wickets. The opposing team try to get their rivals 'out'
definition: En bollsport som spelas på gräs med boll och slagträ. @se
definition: Ballsport mit zwei Teams je 11 Spielern, Bälle, Schlagholz und Pfostentoren. Das Ziel ist so viele Tore wie möglich zu durchschlagen und das andere Team rauszuschmeißen. Ein 'Run' beinhaltet das Rennen eines Spielers zwischen den Pfostentoren. Das gegnerische Team versucht die Konkurrenten rauszuschmeißen @de
definition: Jogo de bola e taco entre duas equipas de 11 jogadores. Joga-se em campo relvado, amplo e de formato oval. O objetivo é marcar o maior número de corridas, impedindo corridas e eliminando batedores da equipa adversária. @pt-pt
definition: Jogo de bola e taco entre duas equipes de 11 jogadores. Joga-se em campo de grama, amplo e de formato oval. O objetivo é marcar o maior número de corridas, impedindo corridas e eliminando batedores da equipe adversária. @pt-br
definition: En boldsport, der spilles på græs med bold og boldtræ. @dk
definition: 对抗性球类运动，包括两队各11名球员，球、球棒和三柱门。目标是尽可能多地通过“跑动”得分，让对手出局。“跑动”是指球员在两个三柱门之间跑动。每方球队都试图让对手“出局” @zh-hans
in scheme: Media Topic
created: 2009-10-22T02:00:00+00:00
modified: 2021-02-18T12:00:00+00:00
broader: competition discipline

croquet
type: Concept
preferred label: Croquet @fr
preferred label: Krocket @se
preferred label: كروكيت @ar
preferred label: Crocket @de
preferred label: kroket @dk
preferred label: 门球 @zh-hans
preferred label: krokket @no-nb
definition: Spelas på gräsmatta med bågar som spelarna ska slå sina klot igenom och bli först att ta sig igenom banan. @se
definition: Mit Schlägern werden Bälle durch kleine Pfostentore geschlagen @de
definition: Using mallets to hit a ball through hoops
definition: Jogo em que se bate uma bola com um taco de madeira para passar debaixo de pequenos arcos fixados na relva. @pt-pt
definition: Jogo em que se bate uma bola com um taco de madeira para passar debaixo de pequenos arcos fixados na grama. @pt-br
definition: Spilles på en græsplæne med buer, som spillerne skal slå deres bolde igennem og være de første til at komme igennem banen. @dk
definition: 使用球棍击球过圈 @zh-hans
in scheme: Media Topic
created: 2009-10-22T02:00:00+00:00
modified: 2021-02-18T12:00:00+00:00
broader: competition discipline

curling
type: Concept
preferred label: Curling @de
preferred label: كيرلينغ @ar
preferred label: 冰壶 @zh-hans
definition: Spelas mellan lag på is med runda stenar med handtag på ovansidan. En spelare (skipper) anger riktpunkt. En spelare skickar iväg stenen och en eller två till i laget följer stenens väg över isen och sopar för att ändra rikting och/eller fart. @se
definition: A game played on ice with large flat round stones. A player throws the stone, aiming at a target. Teammates of the player who has thrown the stone can sweep the ice in front of the stone to help smooth its path towards the target.
definition: Ein Spiel, das auf dem Eis gespielt wird mit flachen runden Steinen. Ein Spieler wirft einen Stein gezielt auf eine Zielscheibe. Ein Teamhelfer des Spielers, der geworfen hat, kann das Eis vor dem Stein kehren, damit der Stein besser Richtung Zielscheibe rutscht @de
definition: Jogo disputado sobre pista de gelo com pedras redondas planas na base e pega curva. O jogador lança a pedra pela pista, tentando que ela fique o mais próximo possível do alvo. Os companheiros podem varrer a pista para que a pedra deslize mais facilmente até ao alvo. @pt-pt
definition: Jogo disputado sobre pista de gelo com pedras redondas planas na base e pega curva. O jogador lança a pedra pela pista, tentando que ela fique o mais próximo possível do alvo. Os companheiros podem varrer a pista para que a pedra deslize mais facilmente até o alvo. @pt-br
definition: Spilles mellem to hold på is med hver deres runde sten med håndtag på toppen. Det gælder om at placere stenene så tæt på centrum som muligt. @dk
definition: 又称冰上溜石，用大而扁圆的石头在冰上比赛的项目。 球员瞄准目标投掷扁园型石头。 投掷石头队员的队友可以在石头前面清扫冰面，以帮助石头顺畅地向目标移动 @zh-hans
in scheme: Media Topic
created: 2009-10-22T02:00:00+00:00
modified: 2021-02-18T12:00:00+00:00
broader: competition discipline
narrower: icestock sport

cycling
type: Concept
preferred label: Radsport @de
preferred label: Cykel @se
preferred label: Cyclisme @fr
preferred label: Ciclismo @es
preferred label: دراجات @ar
preferred label: ciclismo @pt-pt
preferred label: cykelsport @dk
preferred label: 自行车赛 @zh-hans
preferred label: sykling @no-nb
definition: A race over a given distance on bicycles.
definition: Tävlande cyklar en bestämd distans så fort som möjligt, individuellt eller i lag. @se
definition: Ein Rennen auf Fahrrädern über eine vorgegeben Distanz @de
definition: Corrida de bicicleta. @pt-pt
definition: Konkurrenter cykler en bestemt afstand så hurtigt som muligt, individuelt eller i hold. @dk
definition: 固定距离的自行车赛 @zh-hans
in scheme: Media Topic
created: 2009-10-22T02:00:00+00:00
modified: 2021-02-18T12:00:00+00:00
broader: competition discipline
narrower: artistic cycling
narrower: bi-crossing
narrower: bmx racing
narrower: cycle ball
narrower: cycle sprint race
narrower: cyclo-cross
narrower: individual pursuit (cycling)
narrower: individual time trial (cycling)
narrower: كيرين
narrower: Madison race
narrower: mountain biking
narrower: points race (cycling)
narrower: road cycling
narrower: cycling staging race
narrower: team cycle sprint
narrower: road cycling team pursuit
narrower: team time trial (cycling)
narrower: track race (cycling)
narrower: bmx freestyle
has facet: cyclingtype

competitive dancing
type: Concept
preferred label: Danse sportive @fr
preferred label: Danza deportiva @es
preferred label: رقص رياضي @ar
preferred label: Danssport @se
preferred label: Tanzen @de
preferred label: dança rítmica @pt-pt
preferred label: sportsdans @dk
preferred label: 竞技舞蹈 @zh-hans
definition: Tanzwettbewerb, wo Paare in Technik und Interpretation bewertet werden @de
definition: Dansande par utför olika typer av dansstilar och bedöms av domare. @se
definition: Dancing competition where competitors are judged on technique and interpretation.
definition: Competição de dança em que os pares são avaliados pela técnica e pela interpretação. @pt-pt
definition: Dansende par udfører forskellige typer dansestilarter og bedømmes af dommere. @dk
definition: 舞蹈比赛，根据一对选手的技巧和诠释来评判 @zh-hans
in scheme: Media Topic
created: 2009-10-22T02:00:00+00:00
modified: 2024-05-10T12:00:00+00:00
broader: competition discipline
narrower: breaking (breakdance)

darts
type: Concept
preferred label: Dardos @es
preferred label: Fléchettes @fr
preferred label: Dart @se
preferred label: رمي النبلة @ar
preferred label: dardos @pt-pt
preferred label: dart @dk
preferred label: 飞镖 @zh-hans
definition: Zwei Spieler werfen mit kleinen Pfeilen auf eine runde Scheibe, die in Segmente mit verschiedenen Zahlenwerten aufgeteilt ist @de
definition: Individuell eller lagtävling där de tävlande kastar pilar på en piltavla med ett speciellt mönster. Man börjar på 501 eller 301 och måste komma ner till exakt 0 för att vinna. @se
definition: The sport in which small darts are thrown at a dartboard, a circular target divided into numbered sections.
definition: Os jogadores competem atirando dardos de metal a um alvo circular na parede, dividido em segmentos numerados. @pt-pt
definition: Individuel konkurrence eller holdkonkurrence, hvor deltagerne kaster pile på et pilebræt med et specielt mønster. @dk
definition: 向镖靶投掷小飞镖的运动，圆形镖靶分为得分值不同的区域 @zh-hans
in scheme: Media Topic
created: 2009-10-22T02:00:00+00:00
modified: 2021-02-18T12:00:00+00:00
broader: competition discipline

diving
type: Concept
preferred label: غطس @ar
preferred label: Simhopp @se
preferred label: Plongeon @fr
preferred label: Turm- und Brettspringen @de
preferred label: Clavado @es
preferred label: saltos para a água @pt-pt
preferred label: saltos ornamentais @pt-br
preferred label: udspring @dk
preferred label: 跳水 @zh-hans
preferred label: stup @no-nb
definition: Wettkämpfer springen von einem festen oder Sprungbrett und werden von sieben Richtern in einer Skala von 10 Punkten für akrobatische Figuren bewertet @de
definition: De tävlande hoppar från trampolin eller fast ställning på olika höjder och utför olika konster på vägen ner. Deras hopp bedöms av domare. @se
definition: Competitors dive off a fixed or spring board and are assessed by seven judges giving marks up to ten for their acrobatic moves.
definition: Os atletas mergulham de uma plataforma fixa ou de um trampolim e são avaliados por sete juízes, que atribuem notas de 0 a 10 a cada salto. @pt-pt
definition: Dykkere springer fra en fast platform eller vippe og vurderes af syv dommere, der giver karakterer op til ti for deres akrobatiske træk. @dk
definition: 选手从跳台或跳板跳入水中。7名裁判根据运动员的技术动作打分，最高10分 @zh-hans
in scheme: Media Topic
created: 2009-10-22T02:00:00+00:00
modified: 2021-02-18T12:00:00+00:00
broader: competition discipline
narrower: platform diving
narrower: springboard diving
narrower: synchronised diving

underwater sports
type: Concept
preferred label: Undervattenssport @se
preferred label: Unterwassersport @de
preferred label: Subaquatique @fr
preferred label: غوص الامدادات السطحية @ar
preferred label: Subacuáticos @es
preferred label: desportos subaquáticos @pt-pt
preferred label: esportes subaquáticos @pt-br
preferred label: sportsdykning @dk
preferred label: 水下运动 @zh-hans
preferred label: undervannssport @no-nb
preferred label: undervass-sport @no-nn
definition: Olika sportgrenar utförda under vatten. @se
definition: Competitive sports played under water
definition: Sport wie Hockey, der unter Wasser ausgeübt wird @de
definition: Desportos de competição que se realizam debaixo de água. @pt-pt
definition: Esportes de competição que se realizam debaixo de água. @pt-br
definition: Forskellige sportsgrene udført under vand. @dk
definition: 水下进行的运动 @zh-hans
in scheme: Media Topic
created: 2009-10-22T02:00:00+00:00
modified: 2021-02-18T12:00:00+00:00
broader: competition discipline

dog racing
type: Concept
preferred label: Course de chiens @fr
preferred label: Hunderennen @de
preferred label: Hundsport @se
preferred label: سباق كلاب @ar
preferred label: Carreras de perros @es
preferred label: corrida de cães @pt-pt
preferred label: hundeløb @dk
preferred label: 赛狗 @zh-hans
preferred label: hundeløp @no-nb
definition: Dogs racing around a track
definition: Samlingsbegrepp för tävlingar där hundar springer ikapp runt en bana. @se
definition: Hunderennen über eine vorgeschriebene Distanz @de
definition: Corrida de cães à volta de uma pista. @pt-pt
definition: Samlingskoncept til konkurrencer, hvor hunde løber rundt på en bane. @dk
definition: 狗沿赛道进行的赛跑 @zh-hans
in scheme: Media Topic
created: 2009-10-22T02:00:00+00:00
modified: 2021-02-18T12:00:00+00:00
broader: competition discipline
narrower: oval track dog racing
narrower: dog sled racing
has facet: dogracingtype

duathlon
type: Concept
preferred label: Duathlon @fr
preferred label: Duatlón @es
preferred label: دواثلون @ar
preferred label: duatlo @pt-pt
preferred label: 铁人两项 @zh-hans
preferred label: duatlon @no-nb
definition: Sportliches Ereignis, beinhaltet Laufen und Radfahren @de
definition: Tävlingsgren innehållande löpning och cykling. @se
definition: An athletic event involving running and cycling
definition: Evento desportivo que envolve corrida a pé e ciclismo. @pt-pt
definition: Evento esportivo que envolve corrida a pé e ciclismo. @pt-br
definition: Konkurrencegren, som indeholder løb og cykling. @dk
definition: 包括跑步和自行车的运动项目 @zh-hans
definition: Uthaldsgrein som består av ein løpsetappe, ein sykkeletappe og ein ny løpsetappe. @no-nn
definition: Utholdenhetsgren som består av en løpsetappe, en sykkeletappe og en ny løpsetappe. @no-nb
in scheme: Media Topic
created: 2009-10-22T02:00:00+00:00
modified: 2021-02-18T12:00:00+00:00
broader: competition discipline

equestrian
type: Concept
preferred label: Pferdesport @de
preferred label: Ridsport @se
preferred label: Équitation @fr
preferred label: Equitación @es
preferred label: فروسية @ar
preferred label: hipismo @pt-pt
preferred label: ridesport @dk
preferred label: 马术 @zh-hans
preferred label: hestesport @no-nb
definition: Sport, der ein Pferd und einen Reiter umfasst @de
definition: Horse-based sport disciplines governed by the International Federation for Equestrian Sports, such as dressage, eventing, show jumping and vaulting
definition: Samlingsbegrepp för tävlingar med häst och ryttare. @se
definition: Disciplinas desportivas com cavalos regulamentadas pela Federação Equestre Internacional, como dressage, concurso completo de equitação, salto de obstáculos e volteio. @pt-pt
definition: Disciplinas esportivas com cavalos regulamentadas pela Federação Equestre Internacional, como adestramento, concurso completo de equitação, salto de obstáculos e volteio. @pt-br
definition: Samlingskoncept til konkurrencer med hest og rytter. @dk
definition: 国际马术联合会组织的马术比赛。包括盛装舞步马术，三日赛（综合全能马术比赛），表演跳跃和跨障 @zh-hans
in scheme: Media Topic
created: 2009-10-22T02:00:00+00:00
modified: 2021-07-12T12:00:00+00:00
broader: competition discipline
narrower: cross-country horse riding
narrower: dressage
narrower: horse jumping
narrower: three day eventing
narrower: horse driving
has facet: equestriantype

fencing
type: Concept
preferred label: Escrime @fr
preferred label: Fechten @de
preferred label: Fäktning @se
preferred label: مبارزة @ar
preferred label: Esgrima @es
preferred label: esgrima @pt-pt
preferred label: fægtning @dk
preferred label: 击剑 @zh-hans
preferred label: fekting @no-nb
definition: Kampfsport mit Schwert oder Florett @de
definition: Match mellan två tävlande som är utrustade med sabel, florett eller värja. Träffar på motståndaren registreras elektriskt. @se
definition: Combat sport using a sword or foil.
definition: Desporto de combate que usa espada, florete ou sabre. @pt-pt
definition: Esporte de combate que usa espada, florete ou sabre. @pt-br
definition: Kamp mellem to konkurrenter, der er udstyret med sabel, fleuret eller kårde. Træf på modstanderen registreres elektrisk. @dk
definition: 使用剑或花剑的一种格斗比赛 @zh-hans
in scheme: Media Topic
created: 2009-10-22T02:00:00+00:00
modified: 2021-02-18T12:00:00+00:00
broader: competition discipline
narrower: epee
narrower: foil
narrower: sabre
has facet: fencingtype

field hockey
type: Concept
preferred label: Landhockey @se
preferred label: Hockey sobre césped @es
preferred label: Feldhockey @de
preferred label: هوكي @ar
preferred label: Hockey sur gazon @fr
preferred label: hóquei em campo @pt-pt
preferred label: hockey @dk
preferred label: 曲棍球 @zh-hans
preferred label: landhockey @no-nb
definition: A ball sport involving two teams of 11 players using curved sticks. The aim is to score as many goals as possible.
definition: Eine Ballsportart mit zwei Teams je 11 Spielern und einem gebogenen Stock. Das Ziel ist so viele Tore zu machen wie möglich @de
definition: Lagsport mellan elvamannalag. Spelas på gräs med boll och böjda klubbor. @se
definition: Jogo de bola envolvendo duas equipas de 11 jogadores que usam tacos curvos na ponta inferior para bater uma bola pequena e dura. O objetivo é marcar o maior número de golos. @pt-pt
definition: Jogo de bola envolvendo duas equipes de 11 jogadores que usam tacos curvos na ponta inferior para bater uma bola pequena e dura. O objetivo é marcar o maior número de gols. @pt-br
definition: Holdsport mellem to ellevemandshold. Spilles på græs med bold og bøjede klubber. @dk
definition: 集体球类运动。两个球队每队11人，使用曲面球棍，进球越多越好 @zh-hans
in scheme: Media Topic
created: 2009-10-22T02:00:00+00:00
modified: 2021-02-18T12:00:00+00:00
broader: competition discipline

figure skating
type: Concept
preferred label: تزلج فني على الجليد @ar
preferred label: Konståkning @se
preferred label: Patinaje artístico @es
preferred label: Eiskunstlauf @de
preferred label: Patinage artistique @fr
preferred label: patinagem artística @pt-pt
preferred label: patinação artística @pt-br
preferred label: kunstskøjteløb @dk
preferred label: 花样滑冰 @zh-hans
preferred label: kunstløp @no-nb
definition: Tävlas individuellt eller i par där de tävlande utför konster på is med skridskor på fötterna. Programmet utförs till musik och bedöms av domare. @se
definition: Um von neun Punktrichtern die beste Punktzahl zu bekommen in zwei vorbereiteten Bereichen - beide zu Musik gelaufen - müssen die Wettkämpfer die höchst mögliche Harmonie zwischen artistischem Ausdruck und technischer Präzision erreichen @de
definition: To obtain the best marks possible from nine judges who award scores after two prepared sections - both skated to music - during which competitors must attempt to achieve the greatest possible harmony between artistic flair and technical precision.
definition: Desporto, individual ou em pares, em que os patinadores são avaliados por 9 juízes após cada programa apresentado. Os patinadores devem executar figuras e movimentos ao som da música, conjugando beleza artística e precisão técnica. @pt-pt
definition: Esporte, individual ou em pares, em que os patinadores são avaliados por 9 juízes após cada programa apresentado. Os patinadores devem executar figuras e movimentos ao som da música, conjugando beleza artística e precisão técnica. @pt-br
definition: Konkurrencer individuelt eller i par, hvor deltagerne udfører kunst på is med skøjter på fødderne. Programmet udføres til musik og bedømmes af dommere. @dk
definition: 尽可能从九名评委中获得最佳分数，这九名裁判在两个准备好的短节目后打分数 - 两段都是伴音乐滑行- 在比赛中选手必须努力在滑行的艺术感和技术精确度之间实现最大可能的和谐 @zh-hans
in scheme: Media Topic
created: 2009-10-22T02:00:00+00:00
modified: 2021-02-18T12:00:00+00:00
broader: competition discipline
narrower: ice dance
has facet: figureskatingtype

fist ball
type: Concept
preferred label: Fistboll @se
preferred label: Faustball @de
preferred label: كرة اليد @ar
preferred label: Balon puño @es
preferred label: Fist ball @fr
preferred label: punhobol @pt-pt
preferred label: fistball @dk
preferred label: 拳球 @zh-hans
definition: Men's team sport similar to volleyball (with a much lower net) executed mainly in gymnastics clubs
definition: Mannschaftssport ähnlich dem Volleyball (mit einem niedriger gespannten Netz), wird hauptsächlich in Turnvereinen gespielt @de
definition: Fistboll påminner om volleyboll men har lägre nät och bollen slås med knuten näve. @se
definition: Desporto coletivo, semelhante ao voleibol, jogado em campo relvado, dividido ao meio por uma rede, e em que a bola é batida com os punhos ou braços. @pt-pt
definition: Esporte coletivo, semelhante ao vôlei, jogado em campo de grama, dividido ao meio por uma rede, e em que a bola é batida com os punhos ou braços. @pt-br
definition: Holdsport svarende til volleyball (med et meget lavere net) udført hovedsageligt i gymnastikklubber. @dk
definition: 又译拳击球、浮士德球。男子集体运动。类似排球。球网比排球低很多，多在体操俱乐部进行 @zh-hans
in scheme: Media Topic
created: 2009-10-22T02:00:00+00:00
modified: 2021-02-18T12:00:00+00:00
broader: competition discipline

floorball
type: Concept
preferred label: هوكي @ar
preferred label: Innebandy @se
preferred label: Unihockey @de
preferred label: Floorball @es
preferred label: 旱地冰球 @zh-hans
preferred label: innebandy @no-nb
definition: Spelas mellan sexmannalag, varav en är målvakt. Spelas inomhus på samma planstorlek som basket och handboll. Målvakten står på knä och använder händerna. Utespelarna har plastklubbor och spelar på en ihålig boll av plast. @se
definition: Wird in der Halle gespielt auf einem Spielfeld in der Größe eines Basketballfeldes. Ein Team besteht aus fünf Feldspielern und einem Torwart. Der Torwart spielt auf Knien, aber nicht mit einem Torwartschläger wie im Eishockey. Die Spieler benutzen Kunststöcke und leichte Plastikbälle um Pässe und Tore zu schießen @de
definition: Played indoors in a court the size of a basketball court. 6 players per team, of which one is a goalkeeper. He/she operates kneeling but there is no goal-stick like in ice hockey. The players use plastic clubs and a light plastic ball to pass and shot goal
definition: Jogo de futebol em recinto fechado do tamanho de um campo de basquetebol, disputado por duas equipas de 6 jogadores, que usam tacos plásticos para bater uma bola de plástico leve. @pt-pt
definition: Jogo de futebol em recinto fechado do tamanho de um campo de basquetebol, disputado por duas equipes de 6 jogadores, que usam bastões plásticos para bater uma bola de plástico leve. @pt-br
definition: Floorball er en holdsport i hockeyfamilien med 5 markspillere og en målmand på hvert hold. Man spiller med stave og plastikbold med huller på en indendørsbane med 50 cm høje bander. @dk
definition: 又译地板球。室内球赛。球场和篮球场大小相当。每队6人，其中一人守门。守门员可以下蹲挡球。但与冰球守门员不同的是，守门员没有专门的球棍。球员使用塑料球棍和轻质塑料球传球和射门 @zh-hans
in scheme: Media Topic
created: 2009-10-22T02:00:00+00:00
modified: 2021-02-18T12:00:00+00:00
broader: competition discipline

flying disc
type: Concept
preferred label: Disco volador @es
preferred label: الصحن الطائر @ar
preferred label: Frisbee @fr
preferred label: disco voador @pt-pt
preferred label: frisbee @pt-br
preferred label: 飞盘 @zh-hans
definition: Flera olika grenar som alla spelas med en rund plastskiva som kallas disc. Det finns två laggrenar och sju individuella grenar. Störst är laggrenen Ultimate där spelarna passar discen för att göra mål i målzonen och individuella grenen disc golf. @se
definition: Eine Reihe von Wettbewerben, die mit einer fliegenden Kunststoffwurfscheibe gespielt werden. Die genauen Regeln für die Wurfscheiben variieren je nach Wettbewerb, aber verwendet werden unzerbrechliche aus solidem Kunststoff gefertigte Scheiben, deren Aussehen nie verändert ist. Manchmal auch Frisbee genannt @de
definition: A group of events all played with a flying plastic disc. The exact regulation for the disc is different in different events but it has to be unbroken of solid plastic and a production model with no modification. Flying disc is sometimes called Frisbee.
definition: Grupo de provas disputadas com um disco voador de plástico. @pt-pt
definition: Et gruppe begivenheder, hvor spillet spilles med en frisbee, som kastes med hånden. @dk
definition: 都使用塑料飞盘的一类运动项目。各项运动所使用飞盘的规则不尽相同，但必须是实心的完整的塑料材质且没有改装的产品。飞盘也叫飞碟 @zh-hans
in scheme: Media Topic
created: 2009-10-22T02:00:00+00:00
modified: 2021-02-18T12:00:00+00:00
broader: competition discipline
has facet: flyingdisctype

Gaelic football
type: Concept
preferred label: كرة قدم ايرلندية @ar
preferred label: Football gaélique @fr
preferred label: Fútbol gaélico @es
preferred label: Gaelisk fotboll @se
preferred label: futebol gaélico @pt-pt
preferred label: gælisk fodbold @dk
preferred label: 爱尔兰式橄榄球 @zh-hans
preferred label: gælisk fotball @no-nb
definition: Ein Spiel mit Ursprung in Irland, wo zwei Teams von fünfzehn ein Tor schießen, entweder durch den Ball oder Schlag mit der Hand. Das Team mit den meisten Punkten gewinnt. @de
definition: A form of football played by two teams of 15 competing on a pitch by running with, kicking and passing a spherical ball. Points are scored by moving the ball between goal posts. Governed by the Gaelic Athletic Association.
definition: Bollsport med 15-mannalag. Mindre och hårdare boll än i fotboll. Bollen får passas både med fot och hand. Stor sport på Irland. @se
definition: Tipo de futebol disputado por duas equipas de 15 jogadores que competem num campo, correndo, chutando e passando com as mãos uma bola esférica. Os pontos são marcados quando a bola passa entre os postes da baliza. É regulamentado pela Associação Atlética Gaélica. @pt-pt
definition: Tipo de futebol disputado por duas equipes de 15 jogadores que competem em um gramado, correndo, chutando e passando com as mãos uma bola esférica. Os pontos são marcados quando a bola passa entre os postes do gol. É regulamentado pela Associação Atlética Gaélica. @pt-br
definition: Boldsport med 15-mand hold. Mindre og hårdere bold end i fodbold. Bolden kan afleveres både med fod og hånd. Stor sport i Irland. @dk
definition: 这是一支两队各15人组成的橄榄球队，他们在球场上通过跑动，踢球，传球进行对抗。 通过把球穿过球门柱之间来得分。 由盖尔运动协会管理 @zh-hans
change note: 2016-04-06: definition rephrased.
in scheme: Media Topic
created: 2009-10-22T02:00:00+00:00
modified: 2021-02-18T12:00:00+00:00
broader: competition discipline
broad match: http://cv.iptc.org/newscodes/subjectcode/15000000

golf
type: Concept
preferred label: Golf @se
preferred label: غولف @ar
preferred label: golfe @pt-pt
preferred label: 高尔夫 @zh-hans
definition: Spelarna slår på en liten hård boll med olika klubbor runt en bana med normalt 18 hål av varierande längd och svårighet. Minst antal slag vinner. Banorna kan ha hinder i form av tjockt gräs, vatten och sand. @se
definition: A game to hit a small hard ball with different clubs around a course of typically 18 holes varying in distance and during a round. The object, depending on the scoring formulae, is to make the fewest strokes possible
definition: Wettkämpfer versuchen einen kleinen weißen Ball mit verschiedenen Schlägern in einem Gelände mit 18 Löchern auf verschiedenen Distanzen einzulochen. Das Ziel ist die wenigsten Schläge zu benötigen @de
definition: Jogo em que os participantes batem uma pequena bola branca com diferentes tacos ao longo de um campo de 18 buracos, que variam em distância. O objetivo é fazer a bola entrar nos buracos com o menor número possível de tacadas. @pt-pt
definition: Spillerne rammer en lille hård bold med forskellige køller rundt om en bane med normalt 18 huller af forskellig længde og vanskelighed. Minimum antal slag vinder. Banerne kan have forhindringer i form af græs, vand og sand. @dk
definition: 这是一项用不同球杆击打小型硬球进洞的比赛，比赛一轮通常有18个球洞，距离不等。 胜负取决于评分公式，目标是用最少的杆数完成进洞 @zh-hans
in scheme: Media Topic
created: 2009-10-22T02:00:00+00:00
modified: 2021-02-18T12:00:00+00:00
broader: competition discipline
narrower: mini golf

gymnastics
type: Concept
preferred label: Gimnasia @es
preferred label: Turnen @de
preferred label: Gymnastik @se
preferred label: Gymnastique @fr
preferred label: جمباز @ar
preferred label: ginástica @pt-pt
preferred label: gymnastik @dk
preferred label: 体操 @zh-hans
preferred label: gymnastikk @no-nb
definition: A sport consisting of a variety of disciplines in which gymnasts perform artistic and acrobatic moves using different apparatus.
definition: De tävlande utför olika rörelser på olika redskap och bedöms av domare. @se
definition: Sport der aus verschiedenen Disziplinen besteht in denen Turner artistische und akrobatische Figuren zeigen an unterschiedlichen Geräten. Es gibt 6 Disziplinen bei den Männern und 4 bei den Frauen @de
definition: Desporto que consiste numa variedade de disciplinas em que os ginastas realizam movimentos artísticos e acrobáticos em diferentes aparelhos. Há 6 disciplinas para os homens e 4 para as mulheres. @pt-pt
definition: Esporte que consiste numa variedade de disciplinas em que os ginastas realizam movimentos artísticos e acrobáticos em diferentes aparelhos. Há 6 disciplinas para os homens e 4 para as mulheres. @pt-br
definition: Deltagerne udfører forskellige bevægelser på forskellige redskaber og bedømmes af dommere. @dk
definition: 有很多分项的体育项目。运动员使用不同的器材展示具有艺术性和技巧性的动作 @zh-hans
in scheme: Media Topic
created: 2009-10-22T02:00:00+00:00
modified: 2021-02-18T12:00:00+00:00
broader: competition discipline
narrower: rhythmic gymnastics
narrower: trampoline
narrower: artistic gymnastics

handball (team)
type: Concept
preferred label: Handboll @se
preferred label: Balonmano @es
preferred label: Handball (Team) @de
preferred label: Handball @fr
preferred label: كرة اليد (فريق) @ar
preferred label: andebol @pt-pt
preferred label: handebol @pt-br
preferred label: håndbold @dk
preferred label: 手球 @zh-hans
preferred label: håndball @no-nb
preferred label: handball @no-nn
definition: Ein Ballspiel mit den Händen, bestehend aus zwei Teams mit jeweils sieben Spielern, die versuchen den Ball in das gegnerische Tor zu werfen @de
definition: Två lag med sju spelare i varje passar en boll och försöker göra mål. Planen är cirka 40 meter lång och har ett rundat område framför målet där endast målvakten får vara. Normal matchtid är 2x30 minuter. @se
definition: A ball game using the hands contested by two teams of seven trying to throw the ball into the opponents goal.
definition: Jogo de bola de duas equipas de 7 jogadores que tentam introduzir a bola na baliza do adversário através de passes apenas com as mãos. @pt-pt
definition: Jogo de bola de duas equipes de 7 jogadores que tentam introduzir a bola no gol do adversário através de passes apenas com as mãos. @pt-br
definition: Et boldspil ved brug af hænderne mellem to hold på syv spillere, der prøver at kaste bolden i modstanderens mål. @dk
definition: 两只每队七人的队伍比赛，仅能用手的球类比赛。尽力要将球投入对方球门 @zh-hans
in scheme: Media Topic
created: 2009-10-22T02:00:00+00:00
modified: 2021-02-18T12:00:00+00:00
broader: competition discipline

hornuss
type: Concept
preferred label: هورنوس @ar
preferred label: Hornussen @se
preferred label: Hornuss @es
preferred label: 嗡嗡球 @zh-hans
preferred label: hornussen @no-nb
definition: Schweizisk lagsport där en puck slås iväg i hög hastighet. Påminner lite om baseboll. @se
definition: Schweizer Mannschaftsportart mit 16 oder 18 Spielern pro Team. Eine gummierte Scheibe (Hornuss) muss ins Feld der gegnerischen Mannschaft geschlagen werden, die versucht den Hornuss in der Luft mit einem hölzernen Abwehrbrett (Schindel) abzufangen @de
definition: Swiss team sport with 16 or 18 men per team. A rubber puck is hit towards the field of the adversary team which tries to hit the puck in the air with a wooden board thrown in the air
definition: Desporto suíço de equipa, com 16 a 18 pessoas por equipa, que tentam lançar para o campo adversário um disco de borracha com um painel de madeira. @pt-pt
definition: Esporte de equipe suíço, com 16 a 18 pessoas por equipe, que tentam lançar para o campo adversário um disco de borracha com um painel de madeira. @pt-br
definition: Schweizisk holdsport, hvor en puck bliver slået i høj hastighed. Minder lidt om baseball. @dk
definition: 流行于瑞士的16人或18人集体项目。其中一队向对方球场地投一个橡胶小球，另一方抛起木板努力将小球在空中击落 @zh-hans
in scheme: Media Topic
created: 2009-10-22T02:00:00+00:00
modified: 2021-02-18T12:00:00+00:00
broader: competition discipline

horse racing
type: Concept
preferred label: سباق خيول @ar
preferred label: Pferderennen @de
preferred label: Hippisme @fr
preferred label: Galopp @se
preferred label: Hipismo @es
preferred label: corridas de cavalos @pt-pt
preferred label: hestevæddeløb @dk
preferred label: 赛马 @zh-hans
preferred label: hesteveddeløp @no-nb
definition: Pferderennen mit Reiter @de
definition: Hästtävlingar med ryttaren sittande på hästen. Hästen får galoppera. @se
definition: Mounted horse races.
definition: Corridas de cavalos montados. @pt-pt
definition: Hestevæddeløb er en sport, hvor to eller flere ryttere eller kuske rider eller fører en hest over en given distance for at komme først i mål. @dk
definition: 骑马比赛 @zh-hans
in scheme: Media Topic
created: 2009-10-22T02:00:00+00:00
modified: 2021-02-18T12:00:00+00:00
broader: competition discipline
narrower: flat racing
narrower: harness racing
narrower: steeple chase

hurling
type: Concept
preferred label: Hurling @es
preferred label: هرلينغ @ar
preferred label: 爱尔兰式曲棍球 @zh-hans
definition: A game played by two teams of fifteen each with a curved wooden stick called a hurley. The object is to score a goal by hitting the small ball between the opponents' goalposts either over the crossbar or under it into a net guarded by a goalkeeper.
definition: Ein Spiel von zwei Mannschaften aus fünfzehn jeweils mit einem gebogenen Holzstock genannt hurley. Die Aufgabe ist es, den kleinen Ball zwischen die gegnerischen Torpfosten, entweder über die Querlatte oder unter ihm in ein Netz zu bekommen, was von einem Torhüter bewacht ist @de
definition: Irländsk lagsport med 15-mannalag på en plan som har samma mått som gaelisk fotboll. Spelarna har en träklubba och försöker slå en liten hård boll i mål. Man får även passa bollen med hand eller fot. @se
definition: Jogo disputado por duas equipas de quinze jogadores, cada um com um taco de madeira achatado e curvo na ponta, chamado *hurley*. O objetivo é marcar um golo colocando a pequena bola entre os postes da baliza do adversário, seja por cima da barra, seja por baixo dela numa rede protegida por um guarda-redes. @pt-pt
definition: Jogo disputado por duas equipes de quinze jogadores, cada um com um taco de madeira achatado e curvado na ponta, chamado *hurley*. O objetivo é marcar um gol colocando a pequena bola entre os postes de gol do adversário, seja por cima da barra, seja por baixo dela em uma rede protegida por um goleiro. @pt-br
definition: Irsk holdsport med 15-mands hold efter en plan, der har de samme dimensioner som gælisk fodbold. Spillerne har en trækølle og prøver at slå en lille hård bold i mål. Man må også aflevere bolden med hånden eller fødderne. @dk
definition: 集体球类运动。15人一队，两队用一根弯曲的木棍进行比赛。 目标是通过击打小球越过对方带有横梁的门柱之间得分，击过横梁上或由一名守门员守卫的横梁下的网中均可得分。 @zh-hans
in scheme: Media Topic
created: 2009-10-22T02:00:00+00:00
modified: 2021-02-18T12:00:00+00:00
broader: competition discipline
broad match: http://cv.iptc.org/newscodes/subjectcode/15000000

ice hockey
type: Concept
preferred label: Ishockey @se
preferred label: Hockey sobre hielo @es
preferred label: Eishockey @de
preferred label: Hockey sur glace @fr
preferred label: هوكي الجليد @ar
preferred label: hóquei no gelo @pt-pt
preferred label: ishockey @dk
preferred label: 冰球 @zh-hans
definition: Zwei Mannschaften mit jeweils sechs stark gepolsterten Läufern versuchen sich gegenseitig auszutricksen, um den Puck in das gegnerische Tor zu schießen @de
definition: Two teams of six heavily padded skaters try and outscore each other by hitting a puck into the opponents goal.
definition: Spelas på is mellan sexmannalag där spelarna har skydd, skridskor på fötterna och klubba i handen. Runt isen finns en sarg. Spelarna försöker få in pucken i motståndarnas mål. Normal matchtid är 3x20 minuter. @se
definition: Duas equipas de 6 patinadores fortemente equipados e munidos de tacos com que tentam introduzir um disco na baliza do adversário. @pt-pt
definition: Duas equipes de 6 patinadores fortemente equipados e munidos de tacos com que tentam introduzir um disco no gol do adversário. @pt-br
definition: To hold på seks polstrede ishockeyspillere med stave, som forsøger at score mod hinanden ved at slå en puck ind i modstanderens mål. @dk
definition: 两队各由六名运动员组成，队员穿着厚重的溜冰服，试图通过将冰球射入对方球门来得分 @zh-hans
in scheme: Media Topic
created: 2009-10-22T02:00:00+00:00
modified: 2021-02-18T12:00:00+00:00
broader: competition discipline
narrower: sledge hockey

inline skating
type: Concept
preferred label: Inline Skating @de
preferred label: Roller @fr
preferred label: Inlines @se
preferred label: Patinaje en línea @es
preferred label: رولرسكيت @ar
preferred label: patinagem em linha @pt-pt
preferred label: patinação em linha @pt-br
preferred label: rulleskøjteløb @dk
preferred label: 直排轮滑 @zh-hans
preferred label: inline/rulleskøyter @no-nb
definition: Competitive sports using inline skates
definition: Sportlicher Wettbewerb auf Inlineskates @de
definition: Tävlingsport på rullskridskor, där hjulen sitter på rad. @se
definition: Desportos de competição que usam patins em linha. @pt-pt
definition: Esportes de competição que usam patins em linha. @pt-br
definition: Konkurrencesport på rulleskøjter. @dk
definition: 使用单排轮滑鞋的比赛（用本身解释本身） @zh-hans
change note: Retired. Use roller sports (medtop:20001155)
in scheme: Media Topic
created: 2009-10-22T02:00:00+00:00
retired: 2021-02-18T12:00:00+00:00
modified: 2021-02-18T12:00:00+00:00
broader: competition discipline

Jai Alai (Pelota)
type: Concept
preferred label: Pelota @se
preferred label: جاي ألاي @ar
preferred label: Pelote basque @fr
preferred label: Pelota vasca @es
preferred label: pelota basca @pt-pt
preferred label: jai alai (pelota) @dk
preferred label: 回力球 @zh-hans
definition: Snabb bollsport mot en vägg där spelarna antingen använder händerna eller en särskilt utformad handske. @se
definition: Die Komplexität des Spiels erfordert es zwei Subject Details zu kombinieren, um eine angemessene Identifizierung der speziellen Varianten zu ermöglichen @de
definition: A fast ball play using either the bare hand or a wicker scoop in an arena of walls of different outlay and size
definition: Desporto ancestral do País Basco em que dois ou quatro participantes batem alternadamente uma bola contra uma parede frontal com uma espécie de pá. @pt-pt
definition: Esporte ancestral do País Basco em que dois ou quatro participantes batem alternadamente uma bola contra uma parede frontal com uma espécie de pá. @pt-br
definition: Hurtig boldsport mod en væg, hvor spillerne enten bruger deres hænder eller en specielt designet handske. @dk
definition: 在有不同费用和尺寸的墙壁的场地中使用裸手或柳制长勺手套的快速球赛 @zh-hans
in scheme: Media Topic
created: 2009-10-22T02:00:00+00:00
modified: 2021-02-18T12:00:00+00:00
broader: competition discipline
has facet: jaialaitype

kabaddi
type: Concept
preferred label: كابادي @ar
preferred label: Kabaddi @se
preferred label: 卡巴迪 @zh-hans
definition: Die angreifende Seite punktet durch Berührung, die andere Seite durch Sicherung. Die wiederholten Angriffe nennt man 'kabaddi'. @de
definition: The attacking side scores by touching, and the side to guard scores by capturing. The attacker continues calling it 'kabaddi'.
definition: Lagsport med rötter i Indien. Det försvarande laget samarbetar medan bara en ur det anfallande laget får anfalla i taget. Anfallaren försöker röra så många försvarare som möjligt och försvararna försöker hindra anfallaren att återvända till sin planhalva. @se
definition: Desporto de origem indiana em que as duas equipas se perseguem, tocando ou capturando os jogadores adversários. @pt-pt
definition: Esporte de origem índia em que as duas equipes se perseguem, tocando ou capturando os jogadores adversários. @pt-br
definition: To hold stiller sig op over for hinanden, hvorefter en spiller fra det ene hold skal løbe frem og berøre eller tackle en modstander. Den berørte modstander har nu 30 sekunder til at stoppe den første spiller, før han når tilbage bag en linje på egen banehalvdel. @dk
definition: 进攻方靠触碰对手得分，防守方靠抓到对手得分。进攻方不停喊“卡巴迪” @zh-hans
in scheme: Media Topic
created: 2009-10-22T02:00:00+00:00
modified: 2021-02-18T12:00:00+00:00
broader: competition discipline

kayaking
type: Concept
preferred label: Kayak @es
preferred label: Kajak @de
preferred label: Kanot (kajak) @se
preferred label: كاياك @ar
preferred label: caiaque @pt-pt
preferred label: kajak @dk
preferred label: 皮艇 @zh-hans
preferred label: kajakkpadling @no-nb
preferred label: padling @no-nn
definition: Båtsport där den tävlande sitter med ben och fötter framåt och använder en paddel med blad i båda ändar. @se
definition: Competition involving kayaks where the paddler sits with their legs facing forward using a double-bladed paddle
definition: Wettkampf mit Kajaks, in dem der Paddler mit den Füßen nach vorne sitzt und ein Doppelpaddel benutzt @de
definition: Competição com caiaques em que o remador fica com as pernas voltadas para a frente e rema com uma pagaia dupla. @pt-pt
definition: Competição com caiaques em que o remador fica com as pernas voltadas para a frente e rema com um remo de duas pás. @pt-br
definition: Sejlads i kajak, hvor deltageren sidder med ben og fødder fremad og bruger en padle med blade i begge ender. @dk
definition: 皮艇比赛。运动员腿朝前坐，使用双叶浆 @zh-hans
in scheme: Media Topic
created: 2009-10-22T02:00:00+00:00
modified: 2021-02-18T12:00:00+00:00
broader: competition discipline
narrower: K1 (kayaking)
narrower: K2 (kayaking)
narrower: K4 (kayaking)
broad match: http://cv.iptc.org/newscodes/subjectcode/15015000
has facet: canoekayaktype

lacrosse
type: Concept
preferred label: Lacrosse @fr
preferred label: لاكروس @ar
preferred label: 长曲棍球 @zh-hans
definition: Two teams of helmeted and padded players try and outscore each other using a netted stick and hard ball.
definition: Zwei Teams mit gepolsterten Spielern mit Helmen versuchen sich gegenseitig zu besiegen mit einem Schläger und einem harten Ball @de
definition: Lacrosse är en lagsport med indianskt ursprung. Stor sport i USA och Kanada. Spelarna har en klubba med ett triangelformat nät längst fram. Där kan bollen fångas. Man får slå på motståndarnas klubba och hand och även tacklas. @se
definition: Jogo disputado por 2 equipas de jogadores devidamente protegidos que usam um taco longo e com rede na ponta para apanhar ou arremessar uma bola dura. @pt-pt
definition: Jogo disputado por 2 equipes de jogadores devidamente protegidos que usam um taco longo e com rede na ponta para apanhar ou arremessar uma bola dura. @pt-br
definition: Lacrosse er en holdsport af indiansk oprindelse. Stor sport i USA og Canada. Spillerne har en stav med et trekantet net foran. Der kan bolden fanges. Du kan ramme modstanderens stav og hånd og også tackles. @dk
definition: 又译袋棍球、棍网球或兜网球。两支球队的比赛，每名球员戴着头盔，穿防护服，试图用一根带兜网的球棍和一个硬球得分超过对方 @zh-hans
in scheme: Media Topic
created: 2009-10-22T02:00:00+00:00
modified: 2021-02-18T12:00:00+00:00
broader: competition discipline

luge
type: Concept
preferred label: Luge (trineo) @es
preferred label: Luge @fr
preferred label: الزحافات الثلجية @ar
preferred label: Rodeln @de
preferred label: Rodel @se
preferred label: kælk @dk
preferred label: 坐式雪橇 @zh-hans
preferred label: aking @no-nb
definition: Luge (French word for sled) is competed in singles or doubles. The competitor(s) lay on their back on an open sled and race down a course. The competitor(s) and the sled must be in contact when passing the finishing line. The competitor can steer the sled
definition: Wird als Einsitzer oder Doppelsitzer ausgetragen. Der Athlet liegt auf dem Rücken auf einem offenen Rennschlitten und gleitet in einer Kunst- oder Natureisbahn hinab. Der Athlet und der Rennschlitten müssen gemeinsam die Ziellinie passieren @de
definition: Den tävlande åker på rygg med fötterna först på en liten släde nedför en bana som kan vara naturlig men oftast är uppbyggd. Åkaren kan till viss del styra sin släde. @se
definition: O luge (palavra francesa para trenó) é uma competição individual ou em pares em que os atletas, deitados de costas em trenó aberto, percorrem a grande velocidade uma descida coberta de gelo. O(s) atleta(s) pode(m) manobrar o trenó e deve(m) estar em contacto com ele ao passar a linha de chegada. @pt-pt
definition: O luge (palavra francesa para trenó) é uma competição individual ou em pares em que os atletas, deitados de costas em trenó aberto, percorrem a grande velocidade uma descida coberta de gelo. O(s) atleta(s) pode(m) manobrar o trenó e deve(m) estar em contato com ele ao passar a linha de chegada. @pt-br
definition: Konkurrenten ligger sig på ryggen med fødderne først på en lille kælk, på en bane, som kan være naturlig, men oftest er opbygget. @dk
definition: 单人或双人雪橇比赛。运动员躺在雪橇上沿赛道下滑。运动员和雪橇在过终点时不能分离。运动员可以操控雪橇方向 @zh-hans
in scheme: Media Topic
created: 2009-10-22T02:00:00+00:00
modified: 2021-02-18T12:00:00+00:00
broader: competition discipline

marathon
type: Concept
preferred label: Marathon @fr
preferred label: Maraton @se
preferred label: Maratón @es
preferred label: ماراتون @ar
preferred label: maratona @pt-pt
preferred label: maratonløb @dk
preferred label: 马拉松 @zh-hans
preferred label: maraton @no-nb
definition: Straßenrennen, bei dem die Wettkämpfer 42,195 km laufen, meist durch die Stadt @de
definition: Långlopp med anor från en grekisk myt om en löpare som sprang från Marathon 42195 m. Moderna maratontävlingar går ofta på avstängda gator i stora städer. @se
definition: A road race where competitors run 42.195km, generally through city streets
definition: Corrida de estrada em que os atletas correm 42.195 km. @pt-pt
definition: Et langdistanceløb, hvor konkurrenterne løber 42,195 km. @dk
definition: 公路赛跑。全程42.195公里。通常在市区的公路上比赛 @zh-hans
in scheme: Media Topic
created: 2009-10-22T02:00:00+00:00
modified: 2021-02-18T12:00:00+00:00
broader: competition discipline

modern pentathlon
type: Concept
preferred label: بينتاثلون حديث @ar
preferred label: Moderner Fünfkampf @de
preferred label: Pentatlón moderno @es
preferred label: Modern femkamp @se
preferred label: Pentathlon moderne @fr
preferred label: pentatlo moderno @pt-pt
preferred label: moderne femkamp @dk
preferred label: 现代五项 @zh-hans
definition: Der moderne Fünfkampf umfasst 5 Ereignisse an einem Tag in der folgenden Reihenfolge: Schießen, Fechten, Schwimmen, Reiten und Laufen @de
definition: Modern femkamp infördes vid OS i Stockholm 1912 som en modern version av antikens femkamp. I modern femkamp tävlar man i skytte, fäktning, simning, ridning och löpning. @se
definition: The Modern Pentathlon comprises five events run over a single day in the following order: shooting, fencing, swimming, horse riding and running.
definition: O pentatlo moderno inclui 5 provas diferentes realizadas no mesmo dia pela seguinte ordem: tiro, esgrima, natação, hipismo e corrida. @pt-pt
definition: Moderne femkamp blev introduceret ved OL i Stockholm i 1912 som en moderne version af antik femkamp. I moderne pentathlon konkurrerer du i skydning, fægtning, svømning, ridning og løb. @dk
definition: 现代五项由一天内按以下顺序完成的五项运动组成，射击，击剑，游泳，马术和赛跑 @zh-hans
in scheme: Media Topic
created: 2009-10-22T02:00:00+00:00
modified: 2021-02-18T12:00:00+00:00
broader: competition discipline

motorboat racing
type: Concept
preferred label: Bateau à moteur @fr
preferred label: Motorboot @de
preferred label: Motor regata @es
preferred label: Båtsport @se
preferred label: زورق سريع @ar
preferred label: corrida de barcos a motor @pt-pt
preferred label: motorbådssport @dk
preferred label: 摩托艇比赛 @zh-hans
preferred label: båtsport @no-nb
definition: Samlingsbegrepp för tävlingar med motorbåtar på vatten. @se
definition: Rennen zwischen Motorbooten @de
definition: Racing with boats with engines
definition: Corrida de embarcações motorizadas. @pt-pt
definition: Fællesbetegnelse til løb med motorbåde på vandet. @dk
definition: 带发动机的赛艇比赛 @zh-hans
in scheme: Media Topic
created: 2009-10-22T02:00:00+00:00
modified: 2021-02-18T12:00:00+00:00
broader: competition discipline
broad match: http://cv.iptc.org/newscodes/subjectcode/15046000

motor car racing
type: Concept
preferred label: Motorsport @de
preferred label: Automovilismo @es
preferred label: سباق الزوارق السريعة @ar
preferred label: Automobile @fr
preferred label: corrida de automóveis @pt-pt
preferred label: motorløb @dk
preferred label: 赛车 @zh-hans
preferred label: bilsport @no-nb
definition: Rennen mit Autos @de
definition: Samlingsbegrepp för tävlingar med olika typer av bilar. @se
definition: Racing with cars
definition: Corridas de veículos motorizados de quatro rodas. @pt-pt
definition: Fællesbetegnelse for konkurrencer med forskellige typer af biler. @dk
definition: 汽车比赛 @zh-hans
in scheme: Media Topic
created: 2009-10-22T02:00:00+00:00
modified: 2021-02-18T12:00:00+00:00
broader: competition discipline
narrower: endurance race
narrower: فورمولا3000
narrower: Formula One
narrower: Indy Racing
narrower: motor car rallycross
narrower: motor car rallying
has facet: motorcarracingtype

motorcycling
type: Concept
preferred label: Motociclismo @es
preferred label: سباق دراجات نارية @ar
preferred label: Motorradrennen @de
preferred label: MC-sport @se
preferred label: Moto @fr
preferred label: motociclismo @pt-pt
preferred label: motorcykelsport @dk
preferred label: 摩托车赛 @zh-hans
preferred label: motorsykkelsport @no-nb
definition: Races with 2, 3 or 4 wheels vehicles with a saddle and handlebars
definition: Samlingsbegrepp för tävlingar med motorfordon där föraren sitter på en sadel och styr med styre. Normalt tvåhjuliga, men det finns trehjuliga och fyrhjuliga varianter också. @se
definition: Rennen mit 2,3 oder 4 rädrigen Fahrzeugen mit Sattel und Lenkstangen @de
definition: Corridas com veículos de 2, 3 ou 4 rodas com selim e guiador. @pt-pt
definition: Corridas com veículos de 2, 3 ou 4 rodas com selim e guidão. @pt-br
definition: Fællesbetegnelse til konkurrencer med motorkøretøjer. Normalt tohjulede, men der er også trehjulede og firehjulede varianter. @dk
definition: 带座椅和车把的2轮，3轮或4轮摩托车比赛。 @zh-hans
in scheme: Media Topic
created: 2009-10-22T02:00:00+00:00
modified: 2021-02-18T12:00:00+00:00
broader: competition discipline
narrower: motorcycle endurance
narrower: enduro
narrower: grass-track
narrower: moto-ball
narrower: moto-cross
narrower: motoGP
narrower: motorcycle rallying
narrower: side-cars
narrower: speedway
narrower: motorcycling trial
has facet: motorcyclingtype

netball
type: Concept
preferred label: Nätboll @se
preferred label: Netzball @de
preferred label: كرة الشبكة @ar
preferred label: Netball @fr
preferred label: Netbol @es
preferred label: netbold @dk
preferred label: 篮网球 @zh-hans
preferred label: nettball @no-nb
definition: Påminner mycket om basket, men korgarna har inga plattor bakom utan sitter på en stolpe. Spelas främst av kvinnor. @se
definition: A woman's sport similar to basketball though without a board behind the basket
definition: Sportart für Frauen, ähnlich dem Basketball, aber ohne Brett hinter dem Korb @de
definition: Desporto feminino, semelhante ao basquetebol, mas sem a tabela que segura o cesto. @pt-pt
definition: Esporte feminino, semelhante ao basquetebol, mas sem a tabela que segura o cesto. @pt-br
definition: Meget som basketball, men kurven har ingen plade bag på, men sidder på en stolpe. Hovedsageligt spillet af kvinder. @dk
definition: 一种类似篮球的女子体育运动，但篮筐后面没有篮板 @zh-hans
in scheme: Media Topic
created: 2009-10-22T02:00:00+00:00
modified: 2021-02-18T12:00:00+00:00
broader: competition discipline

orienteering
type: Concept
preferred label: Course d'orientation @fr
preferred label: سباق موجه @ar
preferred label: Orientering @se
preferred label: Orientierung @de
preferred label: Carrera de orientación @es
preferred label: orientação @pt-pt
preferred label: orienteringsløb @dk
preferred label: 定向越野赛 @zh-hans
preferred label: orientering @no-nb
definition: Utrustad med karta och kompass ska de tävlande på tid leta upp ett antal kontroller. Vägvalet är frivilligt. Olika lopp har olika längd och antal kontroller. Utförs även som stafett. @se
definition: An individual time-trial over a route marked out by beacons. The competitor has to search out and find in a specific order. The contestant makes his way with the help of a compass and map
definition: Einzelzeitrennen über eine mit Fackeln markierte Strecke, die der Wettkämpfer mithilfe von Kompass und Karte in einer bestimmten Reihenfolge finden muss @de
definition: Corrida individual contrarrelógio em percurso assinalado por marcas. O atleta, que prossegue com a ajuda de bússola e mapa, tem que procurar e encontrar as marcas segundo determinada ordem. @pt-pt
definition: Corrida individual contra o relógio em percurso assinalado por marcas. O atleta, que prossegue com a ajuda de bússola e mapa, tem que procurar e encontrar as marcas segundo determinada ordem. @pt-br
definition: Udstyret med et kort og kompas skal deltagerne lede efter et antal poster. @dk
definition: 单人计时比赛，路线用标志指示。参赛者根据特定顺序寻找标志。可使用罗盘和地图 @zh-hans
in scheme: Media Topic
created: 2009-10-22T02:00:00+00:00
modified: 2021-02-18T12:00:00+00:00
broader: competition discipline
narrower: ski orienteering

parachuting
type: Concept
preferred label: Fallskärmshoppning @se
preferred label: هبوط بالمظلات @ar
preferred label: Paracaidismo @es
preferred label: Fallschirmspringen @de
preferred label: Parachutisme @fr
preferred label: paraquedismo @pt-pt
preferred label: faldskærmsudspring @dk
preferred label: 跳伞 @zh-hans
preferred label: fallskjermhopping (presisjon) @no-nb
preferred label: fallskjermhopping @no-nn
definition: Fallschirmsprung Wettbewerbe: Punktlandungen, Spannweite, Einzel und im Team @de
definition: Jumping from an aeroplane using a parachute, competitions are precision landings, voltige, individual and team
definition: De tävlande hoppar ut från ett flygplan och har fallskärm och gör konster i luften eller precisionslandar. Individuellt eller i lag. @se
definition: Saltar de um avião usando um paraquedas. Competições de paraquedismo: precisão de aterragem, volteio, individual ou por equipas. @pt-pt
definition: Saltar de um avião usando um paraquedas. Competições de paraquedismo: precisão de aterragem, volteio, individual ou por equipes. @pt-br
definition: Faldskærmsudspringeren hopper ud af et fly med faldskærm og laver kunst i luften eller præcisionslandinger. Individuelt eller i hold. @dk
definition: 使用降落伞从飞机上跳下。比赛分定点和特技，个人和集体 @zh-hans
definition: Jumping from an airplane using a parachute, competitions are precision landings, voltige, individual and team
definition: Greiner av fallskjermsporten utan fritt fall der det blir konkurrert i presisjonslanding og andre disiplinar nær bakken. @no-nn
definition: Grener av fallskjermsporten uten fritt fall og der det konkurreres i presisjonslanding og andre øvelser nær bakken. @no-nb
in scheme: Media Topic
created: 2009-10-22T02:00:00+00:00
modified: 2021-02-18T12:00:00+00:00
broader: competition discipline

polo
type: Concept
preferred label: Polo @fr
preferred label: بولو @ar
preferred label: Hästpolo @se
preferred label: 马球 @zh-hans
definition: De tävlande rider och har en klubba med vilken de slår en boll med målsättningen att få den i motståndarnas mål. @se
definition: Mithilfe eines Schlägers versuchen zwei Teams mit je vier Reitern einen Bambusball in das gegnerische Tor zu schießen über ein Feld von 250 m Länge und 150 m Breite. Das Spiel ist unterteilt in 4,6 oder 8 Zeitperioden von 7 min 30 sec. 'chukkas' genannt @de
definition: With the aid of a mallet two teams of four horsemen try and knock a bamboo ball into the opponents goal over a pitch 250m long and 150m wide. The game is divided into 4, 6, or 8 time periods of 7min 30sec called chukkas.
definition: Com ajuda de um taco, duas equipas de 4 cavaleiros tentam introduzir uma bola de bambu na baliza adversária, num campo de 250m de comprimento e 150m de largura. O jogo é dividido em 4, 6 ou 8 períodos de 7min e 30s chamados *chukkas*. @pt-pt
definition: Com ajuda de um taco, duas equipes de 4 cavaleiros tentam introduzir uma bola de bambu no gol adversário, em campo de 250m de comprimento e 150m de largura. O jogo é dividido em 4, 6 ou 8 períodos de 7min e 30s chamados *chukkas*. @pt-br
definition: Ved hjælp af en kølle forsøger to hold på fire ryttere at banke en bambusbold ind i modstanderens mål over en bane, der er 250 meter lang og 150 meter bred. Spillet er opdelt i 4, 6 eller 8 tidsperioder på 7 min. 30 sek. kaldet chukkas. @dk
definition: 两个队每队4名骑马运动员，使用球棍努力击打一个竹子制成的球，使球进入对方的球门。场地250米长150米宽。每场比赛可分4，6， 8节，每节7分半钟 @zh-hans
in scheme: Media Topic
created: 2009-10-22T02:00:00+00:00
modified: 2021-02-18T12:00:00+00:00
broader: competition discipline

pool
type: Concept
preferred label: بلياردو @ar
preferred label: Pool @se
preferred label: Billar americano @es
preferred label: Billard américain @fr
preferred label: Billiard @de
preferred label: bilhar @pt-pt
preferred label: 台球 @zh-hans
definition: Ein Spiel, was auf einem flachen Tisch gespielt wird, mit verschieden nummerierten Kugeln @de
definition: A cue sport on a table with pockets, played with different numbers of balls
definition: Bollsport med kö som redskap med vilken man stöter bollar på ett speciellt bord. @se
definition: Jogo disputado com um taco e diferente número de bolas em mesa revestida com pano de feltro e dotada de buracos com bolsas. @pt-pt
definition: En sport på et bord med huller, hvor der anvendes en kø, og hvor der spilles med forskellige antal nummererede kugler. @dk
definition: 用球杆在一个带球兜的球台上击球的运动。可使用不同数量的球 @zh-hans
definition: Biljardgrein der det blir nytta ein kvit køball og nummererte ballar i ulike fargar på eit bord med seks hol. @no-nn
definition: Biljardgren hvor det benyttes en hvit køball og et antall nummererte baller i ulike farver på et bord med seks hull. @no-nb
in scheme: Media Topic
created: 2009-10-22T02:00:00+00:00
modified: 2021-02-18T12:00:00+00:00
broader: competition discipline
broad match: http://cv.iptc.org/newscodes/subjectcode/15010000
has facet: billiardtype

power boating
type: Concept
preferred label: سباق اليخوت @ar
preferred label: Båtracing @se
preferred label: Motorbootsport @de
preferred label: Motonáutica @es
preferred label: Motonautisme @fr
preferred label: motonáutica @pt-pt
preferred label: powerboating @dk
preferred label: 摩托艇赛 @zh-hans
definition: Tävlingar mellan motorbåtar på sjöar, havet eller floder. @se
definition: Rennen zwischen Motorbooten auf Flüssen oder Seen @de
definition: Races between motor boats on rivers or lakes
definition: Corridas de barcos a motor em rios ou lagos. @pt-pt
definition: Speedbådløb mellem motorbåde på floder eller søer. @dk
definition: 在湖面或河上进行的摩托艇比赛 @zh-hans
in scheme: Media Topic
created: 2009-10-22T02:00:00+00:00
modified: 2021-02-18T12:00:00+00:00
broader: competition discipline

rodeo
type: Concept
preferred label: Rodeo @se
preferred label: Rodéo @fr
preferred label: روديو @ar
preferred label: rodeio @pt-pt
preferred label: 牛仔竞技 @zh-hans
definition: Disziplin bei der wilde Pferde und Bullen beritten und gezähmt werden @de
definition: A discipline where wild horses or bulls must be mounted and mastered
definition: En sport där de tävlande ska hantera vilda hästar, tjurar, kalvar eller getter. @se
definition: Disciplina em que cavalos ou touros selvagens podem ser montados e domados. @pt-pt
definition: Disciplina em que cavalos ou bois selvagens podem ser montados e domados. @pt-br
definition: En sport, hvor deltagerne skal håndtere vilde heste, tyre, kalve eller geder. @dk
definition: 骑上并控制野马，野牛的比赛 @zh-hans
in scheme: Media Topic
created: 2009-10-22T02:00:00+00:00
modified: 2021-02-18T12:00:00+00:00
broader: competition discipline
narrower: bareback bronc
narrower: barrel racing
narrower: bull riding
narrower: bulldogging
narrower: calf roping
narrower: goat roping
narrower: saddle bronc

rowing
type: Concept
preferred label: Aviron @fr
preferred label: Remo @es
preferred label: Rudern @de
preferred label: تجديف @ar
preferred label: Rodd @se
preferred label: remo @pt-pt
preferred label: roning @dk
preferred label: 赛艇运动 @zh-hans
preferred label: roing @no-nb
definition: Boat racing usually on flat calm waters with boats for 1, 2, 4 or 8 rowers
definition: Tävling på uppmärkt bana i naturliga vatten där varje tävlande har två åror. Rodd finns individuellt eller i större båtar för exempelvis två, fyra eller åtta personer. Olika lopp har olika längd. @se
definition: Bootsrennen meist in flachen ruhigen Gewässern mit Booten für 1,2,4,oder 8 Ruderern @de
definition: Corrida de barcos em águas calmas com embarcações de 1, 2, 4 ou 8 remadores. @pt-pt
definition: Konkurrence på markeret bane i naturlige farvande, hvor hver konkurrent har to årer. Roning er tilgængelig hver for sig eller i større både, for eksempel to, fire eller otte personer. Forskellige løb har forskellige længder. @dk
definition: 在平静水域进行的赛艇比赛，可以有1，2，4或8名浆手 @zh-hans
in scheme: Media Topic
created: 2009-10-22T02:00:00+00:00
modified: 2021-02-18T12:00:00+00:00
broader: competition discipline
narrower: coxed four
narrower: coxed pair
narrower: coxless four
narrower: coxless pair
narrower: double sculls
narrower: coxed eight
narrower: quadruple sculls
narrower: single sculls
has facet: rowingtype

sailing
type: Concept
preferred label: Vela @es
preferred label: سباق القوارب الشرعية @ar
preferred label: Segeln @de
preferred label: Voile @fr
preferred label: Segling @se
preferred label: vela @pt-pt
preferred label: sejlsport @dk
preferred label: 帆船赛 @zh-hans
preferred label: seiling @no-nb
preferred label: segling @no-nn
definition: Sailing boat racing over a route
definition: Samlingsbegrepp för tävlingar med båtar kring en uppmärkt bana där båtarna drivs av vinden med hjälp av segel. Många olika båttyper och banlängder. @se
definition: Segelboot Rennen auf einer Rute die durch Bojen gekennzeichnet ist @de
definition: Corrida de barcos à vela em percurso assinalado com boias. @pt-pt
definition: Corrida de barcos a vela em percurso assinalado com boias. @pt-br
definition: Fællesbetegnelse for konkurrencer med både omkring en markeret bane, hvor bådene drives af vinden ved hjælp af sejl. Mange forskellige bådtyper og banelængder. @dk
definition: 赛道帆船比赛 @zh-hans
in scheme: Media Topic
created: 2009-10-22T02:00:00+00:00
modified: 2021-02-18T12:00:00+00:00
broader: competition discipline
narrower: multihull
narrower: dinghy
narrower: keelboat
narrower: sailing regatta
narrower: ocean sailing
narrower: round the world race
narrower: solo ocean sailing
narrower: non-stop solo race
has facet: sailingtype

sepak takraw
type: Concept
preferred label: سيباك تاكرو @ar
preferred label: Sepak Takraw @de
preferred label: Sepak takraw @es
preferred label: 藤球 @zh-hans
definition: Ein Spiel ähnlich dem Volleyball, bei dem man nicht unbedingt die Hände benutzen muss. Benutzt wird ein Rattanball @de
definition: A game like volleyball where hands must not be used, using a ball made of rattan
definition: En sydostasiatisk lagsport som liknar volleyboll där man använder fötterna, knäna, bröstet eller huvudet för att vidröra bollen. @se
definition: Jogo semelhante ao voleibol mas em que não se usam as mãos e a bola é feita de ratã ou de bambu. @pt-pt
definition: Jogo semelhante ao vôlei mas em que não se usam as mãos e a bola é feita de ratã ou de bambu. @pt-br
definition: En sydøstasiatiske holdsport svarende til volleyball, hvor man bruger fødderne, knæene, brystet eller hovedet til at røre bolden. @dk
definition: 类似排球的运动，但不能用手。球是藤条做的 @zh-hans
in scheme: Media Topic
created: 2009-10-22T02:00:00+00:00
modified: 2021-02-18T12:00:00+00:00
broader: competition discipline

shinty
type: Concept
preferred label: Shinty @fr
preferred label: صولجان @ar
preferred label: 简化曲棍球 @zh-hans
definition: En keltisk bollidrott, som utförs mellan två lag med speciella klubbor och där mål görs genom att skjuta en liten läderboll mellan målstolparna. @se
definition: Ein Ballspiel mit zwei Teams mit gebogenen Stöcken camans genannt. Das Ziel ist, Tore zu schießen durch Drücken des kleinen Lederballs durch die Tore. @de
definition: A ball game involving 2 teams with curved sticks called camans. The object is to score goals by hitting the small leather ball through the goals.
definition: Jogo de bola que envolve 2 equipas com tacos curvos chamados *camans*. O objetivo é marcar golos, introduzindo a pequena bola de couro na baliza. @pt-pt
definition: Jogo de bola que envolve 2 equipes com tacos curvos chamados *camans*. O objetivo é marcar gols, introduzindo a pequena bola de couro no gol. @pt-br
definition: En keltisk boldsport, der udføres mellem to hold med specielle køller, og hvor mål scores ved at skubbe en lille læderkugle mellem målstolperne. @dk
definition: 两个队进行的集体比赛。使用弯曲的球棍，击打小皮球进门得分 @zh-hans
in scheme: Media Topic
created: 2009-10-22T02:00:00+00:00
modified: 2021-02-18T12:00:00+00:00
broader: competition discipline
broad match: http://cv.iptc.org/newscodes/subjectcode/15000000

sport shooting
type: Concept
preferred label: Tir @fr
preferred label: Schießen @de
preferred label: رماية @ar
preferred label: Sportskytte @se
preferred label: Tiro @es
preferred label: tiro @pt-pt
preferred label: skydning @dk
preferred label: 射击 @zh-hans
preferred label: skytesport @no-nb
definition: Precision sport using a hand gun, rifle or shotgun
definition: Präzisionssport unter Benutzung einer Handfeuerwaffe, Gewehr oder Pistole @de
definition: Samlingsbegrepp för olika tävlingar med prickskytte med vapen som pistol, gevär och hagelgevär. @se
definition: Desporto de precisão que usa revólver, carabina ou espingarda. @pt-pt
definition: Esporte de precisão que usa revólver, carabina ou espingarda. @pt-br
definition: Præcisionsport ved hjælp af en håndpistol, rifle eller haglgevær. @dk
definition: 用手枪、步枪或者猎枪进行的比赛精准度的射击运动 @zh-hans
in scheme: Media Topic
created: 2009-10-22T02:00:00+00:00
modified: 2023-10-02T12:00:00+00:00
broader: competition discipline
narrower: pistol shooting
narrower: rifle shooting
narrower: running target shooting
narrower: shotgun shooting
narrower: clay pigeon shooting
has facet: shootingtype

skeleton
type: Concept
preferred label: Skeleton @fr
preferred label: سباق الزلاجات الصدرية @ar
preferred label: 钢架雪车 @zh-hans
definition: Liknar rodel men den tävlande ligger på magen och åker med huvudet först. @se
definition: Im Skeleton-Wettbewerb liegt der Athlet auf dem Bauch, während der Fahrt durch die Bahn (Kunsteis- oder Naturbahn). Der Athlet muss die Ziellinie auf dem Schlitten liegend überqueren. Die Gesamtzeit errechnet sich aus den Einzelzeiten der Läufe @de
definition: In skeleton the competitor lies on his/her stomach when racing down the course. The competitor must be on the sled when crossing the finishing line.
definition: No skeleton, o esquiador, deitado de barriga para baixo num trenó especial, tenta descer o mais rápido possível uma pista de gelo. @pt-pt
definition: Ligner slæde, men konkurrenten ligger på maven og går med hovedet først. @dk
definition: 身体俯卧滑下雪道。过终线时选手必须在雪橇上。所有比赛的时间叠加定最终成绩 @zh-hans
in scheme: Media Topic
created: 2009-10-22T02:00:00+00:00
modified: 2021-02-18T12:00:00+00:00
broader: competition discipline

skiing
type: Concept
preferred label: Ski @fr
preferred label: Esquí @es
preferred label: تزلج @ar
preferred label: Skidor @se
preferred label: esqui @pt-pt
preferred label: skiløb @dk
preferred label: 滑雪 @zh-hans
preferred label: skisport @no-nb
definition: Wintersport mit unterschiedlichen Typen von Skiern @de
definition: A winter sport using different types of skis
definition: Samlingsbegrepp för alla typer av tävlingar där de tävlande har skidor på fötterna. @se
definition: Desporto de inverno na neve que usa diferentes tipos de esquis. @pt-pt
definition: Esporte de inverno na neve que usa diferentes tipos de esquis. @pt-br
definition: Fællesbetegnelse for alle typer konkurrencer, hvor konkurrenterne har ski på. @dk
definition: 冬季运动。使用不同型号的滑雪板 @zh-hans
in scheme: Media Topic
created: 2009-10-22T02:00:00+00:00
modified: 2021-02-18T12:00:00+00:00
broader: competition discipline
narrower: alpine skiing
narrower: freestyle skiing
narrower: grass skiing
narrower: Nordic skiing
narrower: ski jumping
narrower: cross-country skiing
narrower: Nordic combined
narrower: Telemark skiing
narrower: ski mountaineering
broad match: http://cv.iptc.org/newscodes/subjectcode/15000000

sky diving
type: Concept
preferred label: Chute libre @fr
preferred label: Sky Diving @de
preferred label: القفز بالمظلة @ar
preferred label: Sky diving @se
preferred label: Salto en caída libre @es
preferred label: salto em queda livre @pt-pt
preferred label: faldskærmsudspring (frit fald) @dk
preferred label: 高空跳伞 @zh-hans
preferred label: fallskjermhopping (fritt fall) @no-nb
preferred label: fallskjermhopping @no-nn
definition: Parachuting competitions with long distance falls without using a parachute
definition: En individuell tävlingsgren inom fallskärmssporten där hopparen ställer sig med huvudet mot marken i fritt fall och faller så fort det är möjligt. @se
definition: Fallschirm Wettbewerbe mit freiem Fall auf langer Distanz @de
definition: Competições de paraquedismo envolvendo salto em queda livre. @pt-pt
definition: En individuel konkurrencegren i faldskærmsudspring, hvor springeren falder med hovedet mod jorden i frit fald og falder så hurtigt som muligt. @dk
definition: 跳伞运动。其中很长距离自由降落不打开伞 @zh-hans
definition: Greiner av fallskjermsporten som krev fritt fall, og der øvingane blir utførte før skjermen blir løyst ut, t.d. formasjonshopping. @no-nn
definition: Grener av fallskjermsporten som krever fritt fall og der øvelsene utføres før skjermen trekkes, f.eks. formasjonshopping. @no-nb
in scheme: Media Topic
created: 2009-10-22T02:00:00+00:00
modified: 2021-02-18T12:00:00+00:00
broader: competition discipline

snooker
type: Concept
preferred label: سنوكر @ar
preferred label: Snooker @fr
preferred label: sinuca @pt-br
preferred label: 斯诺克台球 @zh-hans
definition: A cue sport with balls on a table to be potted in a specific order
definition: Zwei Spieler benutzen einen Queue und eine weiße Kugel, um die anderen farbigen Kugeln in der richtigen Reihenfolge einzulochen @de
definition: En form av biljard, där målet är att vinna fler frames (upplägg av alla bollar på bordet) än motståndaren, vilket ger matchvinst. @se
definition: Desporto de taco e bolas disputado sobre uma mesa e com uma ordem específica para as jogar. @pt-pt
definition: Esporte de taco e bolas disputado sobre uma mesa e com uma ordem específica para as jogar. @pt-br
definition: En variant af billard med baller på et bord, der skal pottes i en bestemt rækkefølge. @dk
definition: 用杆按固定顺序击台面上的球进袋 @zh-hans
definition: Biljardspel der det blir nytta éi kvit kule, 15 raude og 6 ulikefarga kuler på eit stort bord med seks hol. @no-nn
definition: Biljardspill hvor det benyttes én hvit kule, 15 røde og seks ulikefargede kuler på et stort bord med seks hull. @no-nb
in scheme: Media Topic
created: 2009-10-22T02:00:00+00:00
modified: 2021-02-18T12:00:00+00:00
broader: competition discipline
has facet: billiardtype

snowboarding
type: Concept
preferred label: Snowboard @de
preferred label: تزلج على الثليج @ar
preferred label: snowboard @pt-pt
preferred label: 滑板滑雪 @zh-hans
preferred label: snøbrett @no-nn
definition: Ausgeübt auf einem Brett (anstatt zwei Ski) @de
definition: Practiced with a single board (rather than two skis)
definition: Samlingsbegrepp av tävlingar som utförs av åkaren stående med båda fötterna på samma bräda. Till skillnad mot skidåkning där man har fötterna på varsin skida. @se
definition: Desporto que consiste em manter o equilíbrio em cima de uma prancha que desliza por uma descida coberta de neve. @pt-pt
definition: Esporte que consiste em manter o equilíbrio em cima de uma prancha que desliza por uma descida coberta de neve. @pt-br
definition: Fællesbetegnelse af konkurrencer udført af rytteren med begge fødder på det samme bræt. I modsætning til skiløb, hvor du har fødderne på hver ski. @dk
definition: 使用单板而不是两个滑雪板 @zh-hans
in scheme: Media Topic
created: 2009-10-22T02:00:00+00:00
modified: 2021-02-18T12:00:00+00:00
broader: competition discipline
has facet: snowboardingtype

football
type: Concept
preferred label: قدم @ar
preferred label: Fußball @de
preferred label: Fotboll @se
preferred label: Football @fr
preferred label: Fútbol @es
preferred label: futebol @pt-pt
preferred label: fodbold @dk
preferred label: 足球 @zh-hans
preferred label: fotball @no-nb
preferred label: soccer
definition: Lagsport där elvamannalag passar, skjuter, nickar och dribblar en boll och försöker få in bollen i motståndarnas mål. Varje lag har en målvakt och tio utespelare. @se
definition: Zwei Teams mit jeweils 11 Spielern versuchen den Ball in das gegnerische Tor zu schießen oder zu köpfen über eine Spieldauer von 90 Minuten @de
definition: Also known as soccer. Played by two teams competing on a pitch by kicking a spherical ball. Points are scored by kicking or heading the ball into a goal. Governed by the Fédération Internationale de Football Association
definition: Jogo de bola disputado entre duas equipas de 11 jogadores que, durante 90 minutos, tentam chutar ou cabecear a bola para a baliza adversária. @pt-pt
definition: Jogo de bola disputado entre duas equipes de 11 jogadores que, durante 90 minutos, tentam chutar ou cabecear a bola para o gol adversário. @pt-br
definition: Holdsport, hvor to hold af elleve spillere, forsøger at få en bold ind i modstanderens mål. Hvert hold har en målmand og ti udenfor spillere. @dk
definition: 两只球队在球场内踢一个圆形球的一种运动形式，踢进球门或者用头顶入球门得分。由国际足球联合会管理 @zh-hans
definition: A form of football played by two teams competing on a pitch by kicking a spherical ball. Points are scored by kicking or heading the ball into a goal. Governed by the Fédération Internationale de Football Association
change note: 2016-04-06: definition rephrased.
in scheme: Media Topic
created: 2009-10-22T02:00:00+00:00
modified: 2024-09-26T12:00:00+00:00
broader: competition discipline
narrower: futsal
narrower: beach soccer

softball
type: Concept
preferred label: سوفتبول @ar
preferred label: Softboll @se
preferred label: Sóftbol @es
preferred label: Softball @de
preferred label: 软式垒球 @zh-hans
definition: Similar to baseball but with a larger and softer ball, a thinner bat, shorter gaps between bases and less innings
definition: Påminner om baseboll men spelas med en mjukare boll, lättare slagträ och kortare avstånd mellan rundningsmärkena. @se
definition: Ähnlich dem Baseball aber mit größeren und weicheren Bällen, dünneren Schlägern, kürzeren Lücken zwischen den Stationen und weniger Innenfelder @de
definition: Jogo semelhante ao beisebol mas com uma bola maior e mais leve, um bastão mais fino, espaços mais curtos entre as bases e menos entradas. @pt-pt
definition: Ligner baseball, men spilles med en større og blødere bold, et tyndere bat, kortere mellemrum mellem baserne og mindrere omgange. @dk
definition: 类似垒球。使用大一点软一点的球。球拍薄些，垒间距短些，局数少些 @zh-hans
in scheme: Media Topic
created: 2009-10-22T02:00:00+00:00
modified: 2021-02-18T12:00:00+00:00
broader: competition discipline

speed skating
type: Concept
preferred label: Eisschnelllauf @de
preferred label: Patinage de vitesse @fr
preferred label: تزلج سريع @ar
preferred label: Patinaje de velocidad @es
preferred label: Skridsko @se
preferred label: patinagem (velocidade) @pt-pt
preferred label: patinação (velocidade) @pt-br
preferred label: hurtigløb på skøjter @dk
preferred label: 速度滑冰 @zh-hans
preferred label: skøyter @no-nb
definition: Zeitrennen, ausgeübt von zwei Läufern zur gleichen Zeit auf einer ovalen Eisbahn @de
definition: Två tävlande i taget åker runt en oval isbana med speciella längdåkningsskridskor på fötterna. De tävlande växlar mellan innerbana och ytterbana. Lopp av olika längd. @se
definition: Timed races competed by two or more skaters at a time on an oval ice track
definition: Corridas disputadas por 2 patinadores em pista oval de gelo. @pt-pt
definition: Tidskørsel, hvor to skøjteløbere med specielle langdistance skøjter, løber på en oval isbane og skifter mellem inderbane og yderbane. @dk
definition: 两个或两个以上的滑冰运动员同时在椭圆形冰道上进行的计时比赛 @zh-hans
definition: Timed races competed by two skaters at a time on an oval ice track
in scheme: Media Topic
created: 2009-10-22T02:00:00+00:00
modified: 2021-03-31T12:00:00+00:00
broader: competition discipline

squash
type: Concept
preferred label: Squash @fr
preferred label: سكواش @ar
preferred label: 壁球 @zh-hans
definition: Ein Sport mit Strategie und Ausdauer, Einzeln oder im Doppel in einem Court mit Schläger und einem kleinen Ball @de
definition: A racquet sport of strategy and endurance played by singles or doubles teams in a walled court with a small rubber ball
definition: Racketsport med en liten gummiboll. Man tävlar individuellt eller i par i ett rum med väggar där de tävlande delar på utrymmet. @se
definition: Jogo de estratégia e resistência, disputado individualmente ou por equipas de 2 jogadores, com raquete e bola de borracha, em campo retangular fechado dos quatro lados. @pt-pt
definition: Jogo de estratégia e resistência, disputado individualmente ou por equipes de 2 jogadores, com raquete e bola de borracha, em quadra retangular fechada dos quatro lados. @pt-br
definition: Ketjersport med en lille gummikugle, hvor man konkurrerer i et rum med vægge. @dk
definition: 使用球拍的单人或双人比拼耐力和战术的运动。在墙壁围成的场地内击打橡胶小球 @zh-hans
in scheme: Media Topic
created: 2009-10-22T02:00:00+00:00
modified: 2021-02-18T12:00:00+00:00
broader: competition discipline

sumo wrestling
type: Concept
preferred label: Sumobrottning @se
preferred label: Sumo @de
preferred label: سومو @ar
preferred label: sumo @pt-pt
preferred label: sumô @pt-br
preferred label: sumobrydning @dk
preferred label: 相扑 @zh-hans
preferred label: sumobryting @no-nb
definition: En japansk kampsport, där tunga och starka utövare brottas upprätt för att antingen få ut motståndaren ur ringen eller få denne att vidröra marken med någon annan kroppsdel än fotsulorna. @se
definition: A combat sport of speed and rapidity with much ceremony where two contestants try to throw or slap a competitor out of a marked area. Generally practiced in Japan by large men.
definition: Ein schneller Kampfsport mit viel Zeremonie bei dem zwei Wettkämpfer versuchen den Gegner aus dem markierten Bereich herauszudrängen oder schmeißen. Meist praktiziert von kräftigen Männern in Japan @de
definition: Desporto de combate de origem japonesa, baseado na força e na rapidez, em que os lutadores tentam derrubar ou deixar o adversário fora da área de combate. Geralmente, é praticado no Japão, com muita cerimónia, e por homens de grande porte. @pt-pt
definition: Esporte de combate de origem japonesa, baseado na força e na rapidez, em que os lutadores tentam derrubar ou deixar o adversário fora da área de combate. Geralmente, é praticado no Japão, com muita cerimônia, e por homens de grande porte. @pt-br
definition: En japansk kampsport, hvor tunge og stærke udøvere kæmper stående for enten at få modstanderen ud af ringen eller få ham til at røre jorden med enhver anden kropsdel end fodsålerne. @dk
definition: 一种带仪式感的搏击运动，比拼速度和反应。比赛双方努力将对方摔到标识区域外。一般说来是在日本的块头大的男性之间的比赛 @zh-hans
in scheme: Media Topic
created: 2009-10-22T02:00:00+00:00
modified: 2021-02-18T12:00:00+00:00
broader: competition discipline

surfing
type: Concept
preferred label: Wellenreiten @de
preferred label: Surf @fr
preferred label: ركوب الامواج @ar
preferred label: Surfing @se
preferred label: surf @pt-pt
preferred label: surfe @pt-br
preferred label: 冲浪 @zh-hans
definition: Wassersport bei dem die Teilnehmer wellen kreuzen oder reiten auf einem Surfboard @de
definition: Water sport where contestants catch and ride waves upright on a surfboard
definition: En sport där en person med eller utan hjälp av en surfbräda glider på vattenytan på framsidan av en våg. @se
definition: Desporto aquático em que os praticantes, equilibrados em cima de uma prancha, deslizam pelas ondas. @pt-pt
definition: Esporte aquático em que os praticantes, equilibrados em cima de uma prancha, deslizam pelas ondas. @pt-br
definition: Vandsport, hvor deltagere forsøger at *fange* og *ride* på bølger stående på et bræt af glasfiber. @dk
definition: 水上运动。运动员站在冲浪板上冲到浪顶 @zh-hans
in scheme: Media Topic
created: 2009-10-22T02:00:00+00:00
modified: 2021-02-18T12:00:00+00:00
broader: competition discipline

swimming
type: Concept
preferred label: سباحة @ar
preferred label: Schwimmen @de
preferred label: Natación @es
preferred label: Simning @se
preferred label: Natation @fr
preferred label: natação @pt-pt
preferred label: svømning @dk
preferred label: 游泳 @zh-hans
preferred label: svømming @no-nb
preferred label: symjing @no-nn
definition: Wassersport bei dem die Wettkämpfer so schnell wie möglich in einem vorgegebenen Stil schwimmen. Sieger ist, wer zuerst ankommt @de
definition: A water sport where contestants swim as fast as possible in a given style and win races by being the first to touch home
definition: Tävlingarna sker i speciella bassänger med uppmärkta banor. Bassängerna kan vara långa eller korta. Man tävlar i olika distanser och olika simsätt som bröst, frisim, rygg och medley. Även som stafetter som i simning kallas lagkapp. @se
definition: Desporto aquático em que os atletas nadam o mais rápido possível em determinado estilo. @pt-pt
definition: Esporte aquático em que os atletas nadam o mais rápido possível em determinado estilo. @pt-br
definition: En vandsport, hvor deltagere svømmer så hurtigt som muligt i en given stil og på en bestemt distance og vinderen er den som er hurtigst. @dk
definition: 水上运动。运动员按要求的泳姿以最快的速度，第一个游到终点并触壁的获胜 @zh-hans
in scheme: Media Topic
created: 2009-10-22T02:00:00+00:00
modified: 2021-02-18T12:00:00+00:00
broader: competition discipline
narrower: backstroke
narrower: breaststroke
narrower: butterfly swimming
narrower: freestyle swimming
narrower: medley swimming
narrower: marathon swimming
narrower: relay freestyle swimming
narrower: relay medley swimming
narrower: short course swimming
has facet: swimmingtype

table tennis
type: Concept
preferred label: Tennis de table @fr
preferred label: Tenis de mesa @es
preferred label: كرة الطاولة @ar
preferred label: Bordtennis @se
preferred label: Tischtennis @de
preferred label: ténis de mesa @pt-pt
preferred label: tênis de mesa @pt-br
preferred label: bordtennis @dk
preferred label: 乒乓球 @zh-hans
definition: A racquet sport for two or four (in doubles), who compete at a table divided by a net using a small bat to play a lightweight ball
definition: Racketsport med små racketar med gummiduk och en liten lätt boll. Bollen måste träffa motståndarens sida av bordet. Bordet är avdelat med ett lågt nät. Man spelar individuellt eller i par i set. En match består av flera set. @se
definition: Ballsport für zwei oder vier (im Doppel), wird auf einem Tisch ausgeübt, der durch ein Netz geteilt ist mit einem kleinen Schläger und einem leichten Ball @de
definition: Desporto de raquete para 2 ou 4 jogadores, que rebatem uma bola leve para a área do adversário, praticado sobre mesa divida por uma rede. @pt-pt
definition: Esporte de raquete para 2 ou 4 jogadores, que rebatem uma bola leve para a área do adversário, praticado sobre mesa divida por uma rede. @pt-br
definition: En ketsjersport for to eller fire (i dobbelt), der konkurrerer ved et bord delt med et net i midten. Spillerne bruger et lille bat til at spille med og en lille let plastikbold. @dk
definition: 拍球类运动，2人单打或4人双打，台面有网分隔，使用小球拍击打很轻的小球 @zh-hans
in scheme: Media Topic
created: 2009-10-22T02:00:00+00:00
modified: 2021-03-15T12:00:00+00:00
broader: competition discipline

tennis
type: Concept
preferred label: Tenis @es
preferred label: Tennis @fr
preferred label: مضرب @ar
preferred label: ténis @pt-pt
preferred label: tênis @pt-br
preferred label: 网球 @zh-hans
definition: A sport where two players, four in doubles, equipped with a racket compete by hitting the ball over a net into the opponent's side of the court with the aim of putting it out of reach within the regulation lines, thus winning points.
definition: Sportart, bei der zwei Spieler oder vier im Doppel mit einem Schläger ausgestattet, einen Ball über ein Netz auf die gegnerische Seite des Feldes schlagen. Ziel ist es diesen so zu platzieren, dass er unerreicht innerhalb der Linie auf den Boden geht, damit werden Punkte erreicht @de
definition: De tävlande slår med en racket en boll och ska träffa motståndarens planhalva. Ett nät skiljer planhalvorna åt. Olika underlag i olika tävlingar. Matchen spelasindividuellt eller i par och i flera set, som består av flera game. @se
definition: Desporto em que 2 jogadores, ou 4 em pares, se defrontam em campo dividido por rede, batendo com raquete uma bola de borracha para a área adversária. @pt-pt
definition: Esporte em que 2 jogadores, ou 4 em pares, se defrontam em quadra dividida por rede, rebatendo com raquete uma bola de borracha para a área adversária. @pt-br
definition: Deltagerne slår en lille bold med en ketsjer og skal ramme modstanderens halvdel. Et net adskiller banehalvdelene. Forskellige underlag i forskellige konkurrencer. Spillet spilles individuelt eller i par og i flere sæt, der består af flere partier. @dk
definition: 一种体育运动，两名运动员进行单打或四名运动员进行双打，球员手持球拍，将球越过网打到对方场地的那一侧，目的是将球打到规则线以内而让对方球员接不到球，从而得分 @zh-hans
in scheme: Media Topic
created: 2009-10-22T02:00:00+00:00
modified: 2021-02-18T12:00:00+00:00
broader: competition discipline

ten pin bowling
type: Concept
preferred label: Bowling @fr
preferred label: بولينغ @ar
preferred label: Boliche @es
preferred label: bowling @pt-pt
preferred label: boliche @pt-br
preferred label: 十柱保龄球 @zh-hans
definition: De tävlande turas om att med ett speciellt klot försöka fälla tio käglor som står uppställda på en speciell bana. Varje tävlande har två försök per omgång. En match består av en eller flera rundor om tio omgångar. @se
definition: A game in which a player scores points by trying to knock down ten 'pins' using a ball - if unsuccessful the player has a second attempt. A game consists of ten frames.
definition: Spiel, wobei ein Spieler Punkte erzielt indem er versucht 10 Kegel mit einer Kugel umzuschmeißen. Wenn er erfolglos ist, hat er einen zweiten Versuch. Ein Spiel besteht aus 10 Aufstellungen @de
definition: Jogo que consiste em derrubar um conjunto de 10 pinos alinhados no final de uma pista através do lançamento de uma bola pesada. Se falhar, o jogador tem até 10 tentativas para derrubar todos os pinos. @pt-pt
definition: Et spil, hvor en spiller scorer point ved at forsøge at vælte ti kegler ned ved hjælp af en bowlingkugle - hvis det ikke lykkes, har spilleren et andet forsøg. Et spil består af ti runder. @dk
definition: 每人用球尽量击倒10个瓶。若第一次不能全部击倒，可以再击一次。一场比赛包含十轮 @zh-hans
in scheme: Media Topic
created: 2009-10-22T02:00:00+00:00
modified: 2021-02-18T12:00:00+00:00
broader: competition discipline

triathlon
type: Concept
preferred label: Triathlon @fr
preferred label: ترياثلون او سباق ثلاثي @ar
preferred label: Triatlón @es
preferred label: triatlo @pt-pt
preferred label: triatlon @dk
preferred label: 铁人三项 @zh-hans
definition: Ein Ausdauersport, bei dem die Wettkämpfer erst Schwimmen, dann Radfahren und dann auf der Straße laufen. Je nach Wettbewerb variieren die Distanzen, die olympische Version erfordert 1,5 km, 40 km und 10 km. @de
definition: An endurance multi-sport where competitors first swim, then cycle and then run a road race. Distances vary according to the competition.
definition: Kombinationstävling där de tävlande först simmar en sträcka, sedan cyklar en sträcka och slutligen springer. Totala längden kan variera mellan olika tävlingar. @se
definition: Prova de resistência que inclui três disciplinas diferentes - natação, ciclismo e corrida a pé - executadas em cadeia. As distâncias variam de acordo com a competição. @pt-pt
definition: En udholdenheds multisport, hvor konkurrenterne først svømmer, cykler og derefter løber. Afstande varierer afhængigt af konkurrencen. @dk
definition: 一项比拼耐力的多形式运动，选手首先比赛游泳，然后比骑自行车，最后进行公路赛跑。距离根据比赛有所不同 @zh-hans
in scheme: Media Topic
created: 2009-10-22T02:00:00+00:00
modified: 2021-02-18T12:00:00+00:00
broader: competition discipline

tug-of-war
type: Concept
preferred label: Tauziehen @de
preferred label: Tira y afloja con cuerda @es
preferred label: شد الحبل @ar
preferred label: Dragkamp @se
preferred label: Tir à la corde @fr
preferred label: jogo da corda @pt-pt
preferred label: cabo de guerra @pt-br
preferred label: tovtrækning @dk
preferred label: 拔河 @zh-hans
preferred label: tautrekking @no-nb
definition: Zwei Teams ziehen gegeneinander an einem Tau @de
definition: Två lag drar i ett rep. Det lag som lyckas dra motståndarna över till sin sida har vunnit. @se
definition: Two teams pulling against each other on a rope
definition: Uma equipa tenta derrubar a equipa adversária, puxando uma corda. @pt-pt
definition: Duas equipes puxam de cada lado de uma corda. @pt-br
definition: To hold trækker i et reb. Holdet, der formår at trække modstanderne til deres side, har vundet. @dk
definition: 两组人通过绳索互相向己方拉拽双方 @zh-hans
in scheme: Media Topic
created: 2009-10-22T02:00:00+00:00
modified: 2021-02-18T12:00:00+00:00
broader: competition discipline

volleyball
type: Concept
preferred label: Volleyball @de
preferred label: Voleibol @es
preferred label: كرة طائرة @ar
preferred label: Volley-ball @fr
preferred label: Volleyboll @se
preferred label: voleibol @pt-pt
preferred label: vôlei @pt-br
preferred label: 排球 @zh-hans
definition: Zwei Teams mit jeweils 6 machen Punkte indem sie den Ball über ein Netz in das gegnerische Spielfeld schlagen und versuchen ihn solange wie möglich in der Luft zu halten. Punkte werden gemacht wenn ein Fehler gemacht wird und der Ball an den Gegner zurück geht @de
definition: Lagsport där sexmannalag försvarar sin sida och försöker slå bollen över nätet till motståndarnas sida. Laget får poäng om motståndarna inte lyckas slå tillbaka bollen med max tre tillslag, slår i nät eller slår bollen utanför planen. Spelas i set. @se
definition: Two teams of six record points by hitting a ball over a net into the opponent's half of the court, keeping it in the air at all times. Points are won when opponents fail to return the ball.
definition: Jogo de bola que opõe duas equipas de 6 jogadores em campo dividido ao meio por rede. Os jogadores usam as mãos para fazer passar a bola por cima da rede para cair na área adversária, marcando assim pontos. @pt-pt
definition: Jogo de bola que opõe duas equipes de 6 jogadores em quadra dividida ao meio por rede. Os jogadores usam as mãos para fazer passar a bola por cima da rede para cair na área adversária, marcando assim pontos. @pt-br
definition: Holdsport, hvor seksmandshold forsvarer deres side og forsøger at slå bolden over nettet til modstandernes side. Holdet får point, hvis modstanderne ikke klarer at ramme bolden med højst tre hits, slår bolden i nettet eller slår bolden ud fra banen. Spilles i sæt. @dk
definition: 六人一队。把球击过球网落入对方那一半场地，一直要保持球不能落地。如果对方没能将球击回就得分 @zh-hans
in scheme: Media Topic
created: 2009-10-22T02:00:00+00:00
modified: 2021-02-18T12:00:00+00:00
broader: competition discipline
narrower: beach volleyball

water polo
type: Concept
preferred label: Wasserball @de
preferred label: كرة المياه @ar
preferred label: Polo acuático @es
preferred label: Vattenpolo @se
preferred label: Water polo @fr
preferred label: polo aquático @pt-pt
preferred label: vandpolo @dk
preferred label: 水球 @zh-hans
preferred label: vannpolo @no-nb
preferred label: vasspolo @no-nn
definition: Wird in einem Wasserbecken ausgetragen von zwei Teams mit jeweils 7 Spielern, die sich im Wasser befinden und nur eine Hand benutzen dürfen, um den Ball zu werfen oder mit diesem schwimmen müssen, bevor sie ihn in das gegnerische Netz werfen, um Punkte zu machen @de
definition: Lagsport som utspelas i en vattenbassäng mellan sjumannalag. Spelarna får simma och driva bollen framåt, eller passa till en medspelare med en hand. Målet är att få in bollen i motståndarnas mål. @se
definition: Played in a pool between two teams of 7, who must stay afloat and can only use one hand to pass the ball or swim with it before trying to throw it into the opponents net to score goals.
definition: Desporto náutico praticado em piscina e disputador por duas equipas de 7 nadadores, que só podem usar uma mão para passar a bola ou nadar com ela antes de arremessar à baliza adversária. @pt-pt
definition: Esporte náutico praticado em piscina e disputador por duas equipes de 7 nadadores, que só podem usar uma mão para passar a bola ou nadar com ela antes de arremessar ao gol adversário. @pt-br
definition: Holdsport som spilles i et vandbassin mellem to holds af syv personer. Spillere får lov til at svømme og skubbe bolden fremad, eller aflevere til en medspiller med den ene hånd. Målet er at få bolden ind i modstanderens mål. @dk
definition: 两支队伍每队七人在泳池中比赛。运动员必须浮在水面用一只手传球或带球游动。要将球尽力投进对方球网得分 @zh-hans
in scheme: Media Topic
created: 2009-10-22T02:00:00+00:00
modified: 2021-02-18T12:00:00+00:00
broader: competition discipline

water skiing
type: Concept
preferred label: Wasserski @de
preferred label: تزلج على المياه @ar
preferred label: Esquí náutico @es
preferred label: Ski nautique @fr
preferred label: Vattenskidor @se
preferred label: esqui náutico @pt-pt
preferred label: vandski @dk
preferred label: 滑水 @zh-hans
preferred label: vannski @no-nb
preferred label: vasski @no-nn
definition: On one or two skis contestants are pulled by a power boat along the water's surface
definition: Wettkämpfer wird auf einem oder zwei Skiern von einem Boot am Seil über die Wasseroberfläche gezogen @de
definition: De tävlande åker på vatten dragna av en dragbåt, eller på annat sätt. Man tävlar i hopp, slalom och trick. Man kan åka på två skidor eller på en skida. @se
definition: Com um ou dois esquis, os participantes são puxados por uma embarcação a motor ao longo da superfície da água. @pt-pt
definition: På en eller to ski bliver deltagere trukket af en motorbåd langs vandoverfladen. @dk
definition: 选手站在单板或双板水撬上被摩托艇拉着在水面竞速 @zh-hans
in scheme: Media Topic
created: 2009-10-22T02:00:00+00:00
modified: 2021-02-18T12:00:00+00:00
broader: competition discipline
has facet: waterskiingtype

weightlifting and powerlifting
type: Concept
preferred label: Halterofilia @es
preferred label: Gewichtheben @de
preferred label: Haltérophilie @fr
preferred label: رفع اثقال @ar
preferred label: Tyngdlyftning @se
preferred label: halterofilismo @pt-pt
preferred label: vægtløftning @dk
preferred label: 举重 @zh-hans
preferred label: vektløfting @no-nb
definition: Kräftemessen, bei dem die Wettkämpfer ein Gewicht so schwer wie möglich heben. @de
definition: De tävlande turas om att lyfta en stång med vikter påmonterade. Vikten ökar under tävlingens gång och de tävlande har tre försök i varje disciplin. De är ryck och stöt. @se
definition: A strength test where competitors lift as heavy a weight as possible
definition: Teste de força em que os atletas tentam levantar o máximo de peso possível. @pt-pt
definition: En styrketest, hvor konkurrenter løfter en så tung vægtstang som muligt. @dk
definition: 力量比赛。参赛者尽可能举起最大的重量 @zh-hans
in scheme: Media Topic
created: 2009-10-22T02:00:00+00:00
modified: 2021-07-12T12:00:00+00:00
broader: competition discipline
narrower: clean and jerk (weightlifting)
narrower: powerlifting
narrower: snatch (weightlifting)
has facet: weightliftingtype

windsurfing
type: Concept
preferred label: Windsurf @es
preferred label: Planche à voile @fr
preferred label: Windsurfing @se
preferred label: Windsurfen @de
preferred label: ركمجة @ar
preferred label: windsurf @pt-pt
preferred label: vindsurfing @dk
preferred label: 帆板运动 @zh-hans
preferred label: brettseiling @no-nb
preferred label: brettsegling @no-nn
definition: Wettkämpfer müssen so schnell wir möglich einen bestimmten Kurs auf einem Surfboard zurücklegen @de
definition: Liknar segling, men i stället för att sitta i en båt så står de tävlande på en windsurfingbräda och hanterar seglet med händerna. @se
definition: Contestants must complete a marked out course as fast as possible on a windsurf board
definition: Competição de prancha à vela em que os participantes devem completar o mais rápido possível um percurso aquático demarcado. @pt-pt
definition: Competição de prancha a vela em que os participantes devem completar o mais rápido possível um percurso aquático demarcado. @pt-br
definition: Ligner sejlads, men i stedet for at sidde i en båd konkurrerer de stående på et windsurfingbræt og håndterer sejlet med deres hænder. @dk
definition: 选手操控帆板按规定的路线以最短的时间完成赛程 @zh-hans
in scheme: Media Topic
created: 2009-10-22T02:00:00+00:00
modified: 2021-02-18T12:00:00+00:00
broader: competition discipline
has facet: windsurfingtype

wrestling
type: Concept
preferred label: مصارعة @ar
preferred label: Lucha @es
preferred label: Ringen @de
preferred label: Brottning @se
preferred label: Lutte @fr
preferred label: luta livre @pt-pt
preferred label: brydning @dk
preferred label: 摔跤 @zh-hans
preferred label: bryting @no-nb
definition: Kampsport där de tävlande med hjälp av olika grepp ska få ner motståndarens skuldror i mattan. Om en match inte slutar i fall så avgör domarröster. Man tävlar i grekisk-romersk stil och fristil. @se
definition: Kampfsport, bei dem jeder Ringer versucht den andern zu besiegen, indem er die beiden Schultern auf dem Boden hält. Punkte können auch entscheidend sein @de
definition: Combat sport where each wrestler attempts to win over his adversary, by holding both shoulders on the ground (fall) long enough to be in control. Points can also be decisive.
definition: Desporto de combate em que cada lutador tenta ganhar derrubando o adversário ou segurando os seus ombros para o manter no solo. @pt-pt
definition: Esporte de combate em que cada lutador tenta ganhar derrubando o adversário ou segurando os seus ombros para o manter no solo. @pt-br
definition: Kampsport, hvor konkurrenterne ved hjælp af forskellige greb skal få modstanderens skuldre ned i måtten. Hvis en kamp ikke ender med skuldrerne nede afgøres kampen af dommerne. Du konkurrerer i græsk-romersk stil og freestyle. @dk
definition: 搏击运动。摔跤手将对方的双肩按压在地板上，控制住足够长时间得分，根据分数定胜负 @zh-hans
in scheme: Media Topic
created: 2009-10-22T02:00:00+00:00
modified: 2021-02-18T12:00:00+00:00
broader: competition discipline
narrower: freestyle wrestling
narrower: greco-roman
narrower: Swiss wrestling
has facet: weightclasstype

short track speed skating
type: Concept
preferred label: Short-track @fr
preferred label: Patinaje de velocidad sobre pista corta @es
preferred label: Shorttrack @se
preferred label: التزحلق السريع على الجليد @ar
preferred label: Shorttrack Eisschnellauf @de
preferred label: patinagem de pista curta @pt-pt
preferred label: patinação de pista curta @pt-br
preferred label: shorttrack @dk
preferred label: 短道速滑 @zh-hans
preferred label: kortbane (skøyter) @no-nb
preferred label: kortbaneløp (skøyter) @no-nn
definition: Races competed by four or more skaters at a time on a small oval ice track
definition: Wettrennen von vier und mehr Eisschnelläufern auf einer kurzen, ovalen Eisbahn. @de
definition: Skridskotävling i heat på en oval bana. Normalt fyra tävlande per heat. @se
definition: Corridas de 4 ou mais patinadores em pista oval de gelo. Provas de qualificação, semifinais e finais determinam os vencedores. @pt-pt
definition: Skøjteløb på en oval bane. Normalt fire deltagere pr. løb. @dk
definition: 在小的椭圆形冰场进行的由4个或多个选手同时参加的速滑比赛 @zh-hans
in scheme: Media Topic
created: 2014-01-20T12:00:00+00:00
modified: 2021-02-18T12:00:00+00:00
broader: competition discipline

chess
type: Concept
preferred label: Schack @se
preferred label: xadrez @pt-pt
preferred label: skak @dk
preferred label: 国际象棋 @zh-hans
preferred label: sjakk @no-nb
preferred label: Schach @de
preferred label: Échecs @fr
preferred label: Ajedrez @es
preferred label: شطرنج @ar
definition: Brädspel mellan två spelare som har 16 pjäser var när partiet startar. Olika pjäser får flytta enligt olika mönster. Den som ställer motståndarens kung så den inte kan flytta vinner. Om ingen spelare lyckas med det kan det sluta oavgjort, vilket kallas remi. @se
definition: Competition between two players using a chequered board with 16 pieces to each side, each with specific ranges of movement depending on their identity
definition: Jogo de estratégia entre dois jogadores no qual se utiliza um tabuleiro dividido em casas alternadamente claras e escuras, com 16 peças para cada jogador, que se jogam com movimentos específicos que dependem da sua identidade. @pt-pt
definition: Brætspil mellem to spillere, der har 16 brikker hver, når spillet starter. Skiftevis laver hver modstander et træk og bevæger sig efter forskellige mønstre. Den, der sætter modstanderens konge mat, så den ikke kan flytte sig, vinder. @dk
definition: 两个棋手使用由方格组成的棋盘进行比赛，棋盘每方各有16枚棋子，每个棋子的移动规则视其身份而定 @zh-hans
definition: Wettbewerb zwischen zwei Spielern mit einem Schachbrett mit 16 Spielsteinen auf jeder Seite, die je nach ihrer Identität spezifische Bewegungsspielräume haben @de
definition: Competition between two players using a checkered board with 16 pieces to each side, each with specific ranges of movement depending on their identity
in scheme: Media Topic
created: 2014-11-07T12:00:00+00:00
modified: 2021-07-12T12:00:00+00:00
broader: competition discipline

roller sports
type: Concept
preferred label: Rullskridskosport @se
preferred label: desportos sobre patins @pt-pt
preferred label: esportes sobre patins @pt-br
preferred label: rullesport @dk
preferred label: 轮滑运动 @zh-hans
preferred label: rullesporter @no-nb
preferred label: Roller-Sport @de
preferred label: Roller sports @fr
preferred label: Patinaje @es
preferred label: رياضات التزحلق @ar
preferred label: rullesportar @no-nn
definition: Olika sorters tävlingar där de tävlande har rullskridskor på fötterna. @se
definition: Various competitions using wheeled equipment such as roller skates, inline skates, and skateboards.
definition: Várias competições que usam equipamento sobre patins, como patins de rodas, patins em linha ou skates. @pt-pt
definition: Várias competições que usam equipamento sobre patins, como patins de rodas, patins em linha ou esqueites. @pt-br
definition: Forskellige typer konkurrencer, hvor konkurrenterne har rulleskøjter på fødderne. @dk
definition: 多项使用带轮设备的运动。例如，轮滑，单排轮，滑板 @zh-hans
definition: Verschiedene Wettbewerbe mit Rollschuhen, Inline-Skates und Skateboards. @de
in scheme: Media Topic
created: 2014-11-07T12:00:00+00:00
modified: 2021-07-12T12:00:00+00:00
broader: competition discipline
narrower: roller hockey
narrower: skateboarding

martial arts
type: Concept
preferred label: Kampsport @se
preferred label: artes marciais @pt-pt
preferred label: kampsport @dk
preferred label: 武术 @zh-hans
preferred label: Kampfsport @de
preferred label: Arts martiaux @fr
preferred label: Artes marciales @es
preferred label: الفنون القتالية @ar
definition: Martial arts are codified systems and traditions of combat practices, which are practiced for a variety of reasons: self-defence, competition, physical health and fitness, entertainment, as well as mental, physical, and spiritual development.
definition: Samlingsnamn för sporter som innehåller eller förbereder för någon form av närstrid, kontrollerade i utövandet, med regler och förbud, krav på skyddsutrustning och ofta bedömning i form av ett poängsystem. @se
definition: Sistemas codificados e tradições de práticas de combate, praticadas por uma variedade de razões: autodefesa, competição, saúde e condição física, entretenimento, bem como desenvolvimento mental, físico e espiritual. @pt-pt
definition: Sistemas codificados e tradições de práticas de combate, praticadas por uma variedade de razões: autodefesa, competição, saúde e condicionamento físico, entretenimento, bem como desenvolvimento mental, físico e espiritual. @pt-br
definition: Kampsport praktiseres af forskellige årsager: selvforsvar, konkurrence, fysisk sundhed og fitness, underholdning, såvel som mental, fysisk og åndelig udvikling. @dk
definition: 武术是一种成套路体系的传统技击项目。可用于防身、比赛、强体、健身、娱乐以及身心健康、悟性开发等 @zh-hans
definition: Kampfkünste sind kodifizierte Systeme und Traditionen von Kampfpraktiken, die aus einer Vielzahl von Gründen praktiziert werden: Selbstverteidigung, Wettkampf, körperliche Gesundheit und Fitness, Unterhaltung sowie geistige, körperliche und spirituelle Entwicklung. @de
definition: Martial arts are codified systems and traditions of combat practices, which are practiced for a variety of reasons: self-defense, competition, physical health and fitness, entertainment, as well as mental, physical, and spiritual development.
in scheme: Media Topic
created: 2015-08-27T12:00:00+00:00
modified: 2021-07-12T12:00:00+00:00
broader: competition discipline
narrower: judo
narrower: jukendo
narrower: karate
narrower: kendo
narrower: kyudo
narrower: naginata
narrower: Taekwondo
narrower: wushu
narrower: mixed martial arts
narrower: krav maga
narrower: kickboxing
narrower: sambo (martial art)

artistic swimming
type: Concept
preferred label: Konstsim @se
preferred label: natação sincronizada @pt-pt
preferred label: nado sincronizado @pt-br
preferred label: synkronsvømning @dk
preferred label: 花样游泳 @zh-hans
preferred label: synkronsvømming @no-nb
preferred label: Synchronschwimmen @de
preferred label: synchronized swimming
preferred label: Natation synchronisée @fr
preferred label: Natación sincronizada @es
preferred label: سباحة متزامنة @ar
preferred label: synkronsymjing @no-nn
definition: A sport in which swimmers, in solo, duet or team configurations, perform coordinated or identical movements in time to music. They are judged and are awarded points for body position, control, and the degree of difficulty of the moves.
definition: En olympisk gren, där man tävlar i två moment: musiksimning och figursimning. @se
definition: Desporto em que os nadadores, em configurações individuais, em dueto ou por equipas, executam movimentos coordenados ou idênticos ao som de música. Eles são avaliados e recebem pontos pela posição do corpo, controlo e grau de dificuldade dos movimentos. @pt-pt
definition: Esporte em que os nadadores, em configurações individuais, em dueto ou por equipes, executam movimentos coordenados ou idênticos ao som de música. Eles são avaliados e recebem pontos pela posição do corpo, controle e grau de dificuldade dos movimentos. @pt-br
definition: En sport, hvor svømmere i solo-, duet- eller holdkonfigurationer udfører koordinerede eller identiske bevægelser i tid til musik. De bedømmes og tildeles point for kropsposition, kontrol og bevægelsens sværhedsgrad. @dk
definition: 一种游泳项目。泳者可以是单人、双人或团体，随着音乐的节拍做协调的或相同的动作， 根据体位，控制和动作难易程度打分 @zh-hans
definition: Eine Sportart, bei der Schwimmer als Solo-, Duett- oder Mannschaftsschwimmer koordinierte oder identische Bewegungen im Takt zur Musik ausführen. Sie werden beurteilt und erhalten Punkte für Körperhaltung, Kontrolle und den Schwierigkeitsgrad der Bewegungen. @de
in scheme: Media Topic
created: 2016-04-05T12:00:00+00:00
modified: 2021-07-12T12:00:00+00:00
broader: competition discipline
narrower: synchronised free routine
narrower: synchronised technical routine

rugby
type: Concept
preferred label: Rugby @se
preferred label: râguebi @pt-pt
preferred label: rúgbi @pt-br
preferred label: 英式橄榄球联盟 @zh-hans
preferred label: اتحاد الرغبي @ar
definition: En engelsk sport där två lag spelar på en bana där de passar och springer med en oval boll. Poäng får lagen genom att placera bollen i motståndarnas målzon eller sparka den mellan målstolparna. @se
definition: A form of football developed in Rugby (England) played with an oval ball that may be kicked, carried and passed from hand to hand. Points are scored when one team carries the ball over the other team's goal line or kicks the ball between two goal posts.
definition: Tipo de futebol desenvolvido em Rugby (Inglaterra) jogado com uma bola oval que pode ser chutada, carregada e passada de mão em mão. Os pontos são marcados quando uma equipa coloca a bola sobre a linha de meta da outra equipa ou chuta a bola entre os dois postes da baliza. @pt-pt
definition: Tipo de futebol desenvolvido em Rugby (Inglaterra) jogado com uma bola oval que pode ser chutada, carregada e passada de mão em mão. Os pontos são marcados quando uma equipe coloca a bola sobre a linha de meta da outra equipe ou chuta a bola entre os dois postes da baliza. @pt-br
definition: En form for fodbold udviklet i Rugby (England) spillet med en oval bold, der kan sparkes, bæres og sendes fra hånd til hånd. Der scores point, når det ene hold bærer bolden over det andet holds mållinje eller sparker bolden mellem to målposter. @dk
definition: 英式橄榄球。椭圆形的的球可以踢球、带球以及用手传球。带球过对方底线或踢球进对方门柱内得分 @zh-hans
definition: Eine im Rugby (England) entwickelte Form des Fussballs, die mit einem ovalen Ball gespielt wird, der getreten, getragen und von Hand zu Hand weitergereicht werden kann. Punkte werden erzielt, wenn eine Mannschaft den Ball über die Torlinie der anderen Mannschaft trägt oder den Ball zwischen zwei Torpfosten kickt. @de
in scheme: Media Topic
created: 2016-04-05T12:00:00+00:00
modified: 2021-07-12T12:00:00+00:00
broader: competition discipline
narrower: rugby league
narrower: rugby union
narrower: rugby sevens

eSports
type: Concept
preferred label: Esport @se
preferred label: E-Sport @de
preferred label: desporto eletrónico @pt-pt
preferred label: esporte eletrônico @pt-br
preferred label: E-sport @dk
preferred label: 电子竞技 @zh-hans
preferred label: esport @no-nb
preferred label: رياضة إلكترونية @ar
preferred label: e-sport @no-nn
definition: Tävlingar mellan deltagare som spelar spel på datorer eller speciella spelmaskiner. Kan vara både sportbaserade spel och militärt inriktade spel. @se
definition: Wettbewerbe mit Videospielen, die von professionellen Spielern gespielt werden @de
definition: Competitions involving video games played by professional gamers
definition: Competições de jogos de vídeo disputadas por jogadores profissionais. @pt-pt
definition: Konkurrencer, der involverer computer- eller videospil, der spilles af professionelle spillere. @dk
definition: 职业游戏玩家参加的视频游戏比赛 @zh-hans
in scheme: Media Topic
created: 2018-04-19T12:00:00+00:00
modified: 2021-07-12T12:00:00+00:00
broader: competition discipline

bodybuilding
type: Concept
preferred label: Styrketräning @se
preferred label: culturismo @pt-pt
preferred label: 健美 @zh-hans
preferred label: kroppsbygging @no-nb
preferred label: Bodybuilding @de
preferred label: Culturisme @fr
preferred label: Culturismo @es
preferred label: رياضة كمال الاجسام @ar
definition: Competitions where participants perform specific poses to display their muscles that have been strengthened and enlarged through strenuous exercise. Competitors are judged based on criteria such as symmetry, muscularity and conditioning.
definition: Fysiska aktiviteter som mest syftar till att öka en persons muskelstyrka. @se
definition: Competições em que os participantes realizam poses específicas para exibir os músculos fortalecidos e ampliados através de exercícios intensos. Os concorrentes são julgados com base em critérios como simetria, musculosidade e condição física. @pt-pt
definition: Konkurrence, hvor deltagerne poserer for at vise deres muskler frem og bliver vurderet af et dommerpanel. @dk
definition: 在比赛中，参赛者要摆出特定的姿势来展示他们经过剧烈运动后得到强化和扩大的肌肉。参赛者的评判标准包括对称性、肌肉发达程度和条件反射等 @zh-hans
definition: Wettbewerbe, bei denen die Teilnehmer bestimmte Posen ausführen, um ihre Muskeln zu zeigen, die durch anstrengende Übungen gestärkt und vergrößert wurden. Die Wettkämpfer werden anhand von Kriterien wie Symmetrie, Muskelkraft und Kondition beurteilt. @de
in scheme: Media Topic
created: 2019-06-26T12:00:00+00:00
modified: 2021-07-12T12:00:00+00:00
broader: competition discipline

racquetball
type: Concept
preferred label: racketball @dk
preferred label: Raquetboll @se
preferred label: 短柄墙球 @zh-hans
preferred label: raquetebol @pt-pt
preferred label: Racquetball @de
preferred label: Raquetbol @es
preferred label: كرة الراح @ar
definition: A racquet sport similar to squash in which the ball must bounce once before being struck and with a greater area of in-bound play
definition: En ketsjersport, der minder om squash,men spilles med en ketsjer med kortere skaft. Den spilles også på en lukket bane, hvor man må benytte alle flader, når man sender bolden afsted. @dk
definition: Bollsport som är väldigt lik Squash. @se
definition: 又译美式壁球，类似于壁球的球拍运动，在击球之前，球必须反弹一次，但相比壁球有更大的击打空间 @zh-hans
definition: Desporto de raquete semelhante ao squash em que a bola deve bater uma vez antes de ser atingida e com uma área maior de jogo. @pt-pt
definition: Esporte de raquete semelhante ao squash em que a bola deve quicar uma vez antes de ser atingida e com uma área maior de jogo. @pt-br
definition: Squashähnlicher Schlägersport, bei dem der Ball vor dem Schlagen einmal abprallen muss und bei dem eine grössere Spielfläche zur Verfügung steht. @de
in scheme: Media Topic
created: 2019-10-07T12:00:00+00:00
modified: 2021-07-12T12:00:00+00:00
broader: competition discipline

ringette
type: Concept
preferred label: Ringette @se
preferred label: 冰圈运动 @zh-hans
preferred label: Ringuette @fr
preferred label: رينغيت @ar
definition: En holdsport, der spilles på is. Spillerne er udstyret med helt lige stave og skal forsøge at få en gummring i modstandernes mål. @dk
definition: A team sport usually played on ice by skaters using a straight stick. Players pass and shoot a rubber ring in order to place it in the opponent's goal
definition: Spelas på en vanlig hockeyrink men spelarna har käppar istället för klubbor och man spelar med en ring istället för en puck. @se
definition: 一项团队运动，选手使用直杆在冰面滑行击打橡胶圈，目的是将橡胶圈打入对方球门 @zh-hans
definition: Desporto de equipa praticado geralmente no gelo por patinadores usando um taco sem curvatura. Os jogadores passam e atiram um anel de borracha para colocá-lo na baliza do adversário. @pt-pt
definition: Esporte de equipe praticado geralmente no gelo por patinadores usando um taco sem curvatura. Os jogadores passam e atiram um anel de borracha para colocá-lo no gol do adversário. @pt-br
definition: Eine Mannschaftssportart, die üblicherweise von Schlittschuhläufern mit einem geraden Stock auf dem Eis ausgeübt wird. Die Spieler passen und schießen einen Gummiring, um ihn im gegnerischen Tor zu platzieren. @de
in scheme: Media Topic
created: 2019-10-07T12:00:00+00:00
modified: 2021-07-12T12:00:00+00:00
broader: competition discipline

arm wrestling
type: Concept
preferred label: armlægning @dk
preferred label: Armbrytning @se
preferred label: 掰手腕 @zh-hans
preferred label: håndbak @no-nb
preferred label: braço de ferro @pt-pt
preferred label: Armdrücken @de
preferred label: Bras de fer @fr
preferred label: Pulsear @es
preferred label: خدمات رعاية الاطفال @ar
preferred label: handbak @no-nn
definition: En sport, hvor det gælder om at lægge den andens arm ned. @dk
definition: A form of wrestling in which two participants grapple arm-to-arm
definition: Kallas och armsport. Två tävlande vilar armbågen på ett bord och försöker tvinga ner den andres hand på bordet. @se
definition: 两名选手较量臂力的比赛 @zh-hans
definition: Tipo de luta em que dois participantes lutam braço a braço. @pt-pt
definition: Eine Form des Ringkampfes, bei der zwei Teilnehmer Arm an Arm kämpfen @de
in scheme: Media Topic
created: 2019-11-25T12:00:00+00:00
modified: 2021-07-12T12:00:00+00:00
broader: competition discipline

padel
type: Concept
preferred label: Padel @se
preferred label: 笼式网球 @zh-hans
preferred label: Padel-tennis @fr
preferred label: Pádel @es
preferred label: بادل تنس @ar
definition: Racquet sport typically played in doubles on an enclosed court
definition: Racket sport typically played in doubles on an enclosed court
definition: Racketsport, ibland kallad padeltennis, där tvåmannalag möts i en stängd bana. @se
definition: En ketsjersport, der spilles på en lukket bane, og som er en mellemting mellem tennis og squash. @dk
definition: Desporto de raquete, disputado por duas duplas frente a frente em recinto fechado. @pt-pt
definition: Esporte de raquete, disputado por duas duplas frente a frente em recinto fechado. @pt-br
definition: 通常在封闭的场地上用球拍进行的双打运动 @zh-hans
definition: Schlägersportart, die typischerweise im Doppel auf einem geschlossenen Platz gespielt wird @de
in scheme: Media Topic
created: 2021-02-18T12:00:00+00:00
modified: 2021-07-12T12:00:00+00:00
broader: competition discipline

kiting
type: Concept
preferred label: Kitesurf @se
preferred label: kite @pt-pt
preferred label: 风筝运动 @zh-hans
preferred label: Kiten @de
preferred label: Kiteboarding @fr
preferred label: تزلج شراعي @ar
definition: Action sport where a person harnesses the power of the wind to propel themselves across water, land or snow on a board, snowboard or skis. Variations of the sport are called kiteboarding/kitesurfing, snowkiting or landkiting.
definition: Sport, hvor man iført en faldskærm bruger vinden til at bevæge sig fremad med. Kitesurfing ved kysterne er den mest populære form. @dk
definition: De tävlande står på en lite bräda på vatten och dras fram av en drake som de kan styra för att utföra trick. @se
definition: Desporto radical em que o praticante aproveita a força do vento para se impulsionar na água, em terra ou na neve sobre uma prancha ou esquis. Variações deste desporto incluem kitesurf/kiteboard, snowkite ou landkite. @pt-pt
definition: Esporte radical em que o praticante aproveita a força do vento para se impulsionar na água, em terra ou na neve sobre uma prancha ou esquis. Variações desse esporte incluem kitesurf/kiteboard, snowkite ou landkite. @pt-br
definition: 一类体育运动，人们借助风力推动自己在划板、滑雪板或雪橇上穿越水面、地面或雪地。这项运动的按种类分为风筝冲浪、雪地风筝或陆地风筝 @zh-hans
definition: Action-Sportart, bei der sich eine Person die Kraft des Windes zunutze macht, um sich auf einem Brett, Snowboard oder Skiern über Wasser, Land oder Schnee fortzubewegen. Variationen des Sports werden Kiteboarding/Kitesurfen, Snowkiting oder Landkiting genannt. @de
in scheme: Media Topic
created: 2021-02-18T12:00:00+00:00
modified: 2021-07-12T12:00:00+00:00
broader: competition discipline

stand up paddleboarding (SUP)
type: Concept
preferred label: brettpadling (SUP) @no-nb
preferred label: SUP @se
preferred label: stand up paddle (SUP) @pt-pt
preferred label: 站立划水板（SUP） @zh-hans
preferred label: Stand Up Paddling (SUP) @de
preferred label: Stand up paddle @fr
preferred label: ركوب الامواج وقوفا @ar
definition: Water sport using a board and paddle to propel through the water while standing
definition: Vandsport, hvor man bruger et bræt og en padel til at bevæge sig fremad med. @dk
definition: De tävlande står på brädor liknande windsurfing och paddlar sig fram. @se
definition: Desporto aquático em que o praticante fica de pé sobre uma prancha e usa um remo para se deslocar na água. @pt-pt
definition: Esporte aquático em que o praticante fica de pé sobre uma prancha e usa um remo para se deslocar na água. @pt-br
definition: 一种站立在划水板上用桨划水推进的水上运动 @zh-hans
definition: Wassersport, bei dem man sich mit Brett und Paddel im Stehen durch das Wasser bewegt @de
in scheme: Media Topic
created: 2021-02-18T12:00:00+00:00
modified: 2021-07-12T12:00:00+00:00
broader: competition discipline

cheerleading
type: Concept
preferred label: Cheerleeding @se
preferred label: 啦啦操 @zh-hans
preferred label: Cheerleading @de
preferred label: Porrismo @es
preferred label: فرق التشجيع @ar
definition: Cheer squads competing against each other to perform a routine that includes stunts, jumps and tumbling set to music. Squads are judged on difficulty and execution.
definition: Grupper som utför gymnastiska program avsedda att heja på något lag tävlar mot varandra. @se
definition: Idræt, hvor heppekor konkurrerer om at udføre de mest spektakulære øvelser. @dk
definition: Equipas de cheerleaders que competem entre si realizando uma rotina que inclui acrobacias, saltos e tumbling ao som de música. As equipas são julgadas pela dificuldade e pela execução dos exercícios. @pt-pt
definition: Equipes de cheerleaders que competem entre si realizando uma rotina que inclui acrobacias, saltos e tumbling ao som de música. As equipes são julgadas pela dificuldade e pela execução dos exercícios. @pt-br
definition: 在音乐伴奏下表演包括特技、跳跃和翻滚的一整套动作的竞技小分队，用动作难度和完成度来评判。 @zh-hans
definition: Cheer Squads, die gegeneinander antreten, um eine Routine vorzuführen, die Stunts, Sprünge und Tumbling zu Musik beinhaltet. Die Squads werden nach Schwierigkeit und Ausführung bewertet. @de
in scheme: Media Topic
created: 2021-02-18T12:00:00+00:00
modified: 2021-07-12T12:00:00+00:00
broader: competition discipline

3x3 basketball
type: Concept
preferred label: 3x3 @se
preferred label: Baloncesto 3x3 @es
preferred label: Basket-ball 3x3 @fr
preferred label: كرة السلة الثلاثيات @ar
preferred label: 3×3-Basketball @de
definition: A variation of basketball played three a side on one basketball hoop
definition: Variant av basketboll med tre personer per lag som spelar mot en korg. @se
definition: Ein variant av basketball spelt tre mot tre mot éi korg. @no-nn
definition: En variant av basketball spilt tre mot tre mot én kurv. @no-nb
definition: Eine Variante des Basketballs, die zu dritt auf einen Basketballkorb gespielt wird. @de
in scheme: Media Topic
created: 2021-07-12T12:00:00+00:00
modified: 2021-12-21T12:00:00+00:00
broader: competition discipline

canoe slalom
type: Concept
preferred label: slalåmpadling @no-nb
preferred label: Kanotslalom @se
preferred label: Piragüismo en eslalon @es
preferred label: Canoë-kayak - Slalom @fr
preferred label: وايتووتر سلالوم @ar
preferred label: Kanuslalom @de
definition: Competitors navigate a canoe or a kayak on a white-water course, passing through a combination of upstream and downstream gates on river rapids in the fastest time possible
definition: Kanotslalom är en olympisk tävlingssport som går ut på att föra en kanadensare eller kajak på snabbast tid genom portar som hänger över banan. Varje port består av två stänger som är antingen röda/vita eller gröna/vita, och portarna ska passeras i nummerordning. @se
definition: Die Teilnehmer steuern ein Kanu oder ein Kajak auf einer Wildwasserstrecke, wobei sie eine Kombination aus flussaufwärts und flussabwärts gelegenen Toren auf Stromschnellen in der schnellstmöglichen Zeit passieren müssen. @de
in scheme: Media Topic
created: 2021-07-12T12:00:00+00:00
modified: 2021-12-21T12:00:00+00:00
broader: competition discipline

canoe sprint
type: Concept
preferred label: sprintpadling @no-nb
preferred label: Kanotsprint @se
preferred label: Piragüismo en aguas tranquilas @es
preferred label: Canoë-kayak - Ligne @fr
preferred label: سباق القوارب @ar
preferred label: Kanurennsport @de
definition: Taking place on a flatwater course, multiple canoes take off at once and race each other to the finish
definition: Olympisk tävlingsport med kanot eller kajak på sträckorna 200, 500 och 1000 meter. @se
definition: Auf einer Flachwasserstrecke starten mehrere Kanus gleichzeitig und fahren gegeneinander ins Ziel. @de
in scheme: Media Topic
created: 2021-07-12T12:00:00+00:00
modified: 2021-12-21T12:00:00+00:00
broader: competition discipline

road cycling
type: Concept
preferred label: landeveisritt (sykling) @no-nb
preferred label: Landsvägscykling @se
preferred label: landevegsritt @no-nn
preferred label: Ciclismo en ruta @es
preferred label: Cyclisme sur route @fr
preferred label: سباق الدراجات على الطريق @ar
preferred label: Straßenradsport @de
definition: Cycling events held on roads, including road races and time trials
definition: Cykeltävlingar på vanliga vägar och gator. @se
definition: Radsportveranstaltungen, die auf der Straße stattfinden, einschließlich Straßenrennen und Zeitfahren @de
in scheme: Media Topic
created: 2021-07-12T12:00:00+00:00
modified: 2021-12-21T12:00:00+00:00
broader: competition discipline

track cycling
type: Concept
preferred label: banesykling @no-nb
preferred label: Bancykel @se
preferred label: Ciclismo en pista @es
preferred label: Cyclisme sur piste @fr
preferred label: دراجات المضمار @ar
preferred label: Bahnradsport @de
definition: Cycling competitions held on tracks, including sprint, team sprint, keirin, team pursuit, omnium and madison events
definition: Cykeltävling på en oval bana som är kraftigt doserad och medger hög fart även i kurvorna. @se
definition: Radsportwettbewerbe auf der Bahn, einschließlich Sprint, Teamsprint, Keirin, Mannschaftsverfolgung, Omnium und Madison @de
in scheme: Media Topic
created: 2021-07-12T12:00:00+00:00
modified: 2021-12-21T12:00:00+00:00
broader: competition discipline

football 5-a-side
type: Concept
preferred label: femmerfotball @no-nb
preferred label: 5-mannafotboll @se
preferred label: femmarfotball @no-nn
preferred label: Futbito @es
preferred label: Foot à 5 @fr
preferred label: كرة القدم الخماسية @ar
preferred label: Kleinfeldfußball @de
definition: A variation of association football in which each team fields five players and play is on a smaller pitch. An official Summer Paralympics sport.
definition: Variant av fotboll med fem spelare på en mindre plan. @se
definition: Eine Variante des Verbandsfußballs, bei der jede Mannschaft aus fünf Spielern besteht und auf einem kleineren Spielfeld gespielt wird. Eine offizielle Sportart der Sommer-Paralympics. @de
in scheme: Media Topic
created: 2021-07-12T12:00:00+00:00
modified: 2021-12-21T12:00:00+00:00
broader: competition discipline

goalball
type: Concept
preferred label: målball @no-nb
preferred label: Goalball @se
preferred label: Golbol @es
preferred label: كرة الهدف @ar
definition: A team sport for athletes with a vision impairment, using a ball containing bells
definition: Lagbollsport för personer med synnedsättning där bollen innehåller pinglor. @se
definition: Ein Mannschaftssport für Sportler mit einer Sehbehinderung, bei dem ein Ball mit Glocken verwendet wird @de
in scheme: Media Topic
created: 2021-07-12T12:00:00+00:00
modified: 2021-12-21T12:00:00+00:00
broader: competition discipline

crossbow shooting
type: Concept
preferred label: قوس @ar
preferred label: Tir à l'arbalète @fr
preferred label: Tiro con ballesta @es
preferred label: Armbrust @de
preferred label: Armborstskytte @se
preferred label: tiro com besta @pt-pt
preferred label: armbrøst @dk
preferred label: 弩射 @zh-hans
preferred label: armbrøstskyting @no-nb
definition: Schießen mit der Armbrust auf Zielscheiben in unterschiedlichen Distanzen @de
definition: Som bågskytte, men med en armborst som skjuter hårdare och längre än en pilbåge och behöver laddas innan den kan avfyras. @se
definition: Shooting with crossbow on targets from different distances
definition: Tiro com besta contra alvos colocados a várias distâncias. @pt-pt
definition: Som en bueskytte, men med en armbrøst, der skyder hårdere og længere end en bue og skal lades, før den kan skyde. @dk
definition: 使用十字弓向不同距离的靶子射箭 @zh-hans
in scheme: Media Topic
created: 2009-10-22T02:00:00+00:00
modified: 2021-02-18T12:00:00+00:00
broader: archery

longbow
type: Concept
preferred label: قوس @ar
preferred label: Arc long @fr
preferred label: Langbogen @de
preferred label: Arco largo inglés @es
preferred label: Långbågeskytte @se
preferred label: tiro com arco longo @pt-pt
preferred label: langbue @dk
preferred label: 长弓射箭 @zh-hans
preferred label: langbueskyting @no-nb
preferred label: langbogeskyting @no-nn
definition: Bågskytte, men utan de hjälpmedel som finns moderna pilbågar. En långbåge ska mer påminna om gamla tiders pilbågar. @se
definition: Shooting with longbow on targets from different distances. The competition is held outdoors on an open (flat) field.
definition: Schießen mit einem Langbogen auf Zielscheiben aus unterschiedlicher Distanz. Der Wettkampf findet draußen auf einem großen flachen Feld statt. @de
definition: Tiro com arco longo contra alvos colocados a várias distâncias. A competição decorre no exterior, num campo grande e plano. @pt-pt
definition: Tiro com arco longo contra alvos colocados a várias distâncias. A competição decorre no exterior, em um campo grande e plano. @pt-br
definition: Skyd med langbue på mål fra forskellige afstande. Konkurrencen afholdes udendørs på et åbent (fladt) felt. @dk
definition: 用长弓射击不同距离的目标。比赛在室外露天区域进行 @zh-hans
in scheme: Media Topic
created: 2009-10-22T02:00:00+00:00
modified: 2021-05-05T12:00:00+00:00
broader: archery
broad match: http://cv.iptc.org/newscodes/subjectcode/15004000

cross-country run
type: Concept
preferred label: Cross-country @fr
preferred label: Terränglöpning @se
preferred label: سباق الضواحي @ar
preferred label: Geländelauf @de
preferred label: corrida de corta-mato @pt-pt
preferred label: corrida de cross-country @pt-br
preferred label: crossløb @dk
preferred label: 越野跑 @zh-hans
preferred label: terrengløp @no-nb
definition: Lopp längs en utmärkt väg över blandad terräng. @se
definition: Wettkämpfer laufen über rauen Untergrund und nicht auf einer Bahn @de
definition: Competitors run over rough ground and not on a track
definition: Os atletas correm em terreno acidentado e não numa pista. @pt-pt
definition: Os atletas correm em terreno acidentado e não em uma pista. @pt-br
definition: En løbedisciplin indenfor atletikken, hvor atleter konkurrerer i et terræn, som er anderledes end landevejen eller atletikbanen. @dk
definition: 参赛者在崎岖的道路上而不是在跑道上的赛跑 @zh-hans
in scheme: Media Topic
created: 2009-10-22T02:00:00+00:00
modified: 2021-05-05T12:00:00+00:00
broader: athletics
broad match: http://cv.iptc.org/newscodes/subjectcode/15005000

decathlon
type: Concept
preferred label: Decathlon @fr
preferred label: Decatlón @es
preferred label: Tiokamp @se
preferred label: Zehnkampf @de
preferred label: عشاري @ar
preferred label: decatlo @pt-pt
preferred label: tikamp @dk
preferred label: 十项全能 @zh-hans
definition: Individual men's competition which involves accumulating points in 10 different disciplines over two days: 1st day - 100m, long-jump, shot-putt, high-jump, 400m. 2nd day - 110m hurdles, discus, pole-vault, javelin and 1,500 metres.
definition: En friidrottsgren där de tävlande utför tio olika grenar under två dagars tävlande. Varje resultat ger poäng så grenarna blir jämförbara och vinnaren är den med högst totalsumma. @se
definition: Einzelwettkampf der Männer, der das Erreichen von Punkten in 10 Disziplinen über 2 Tage anstrebt: 1. Tag - 1000 m, Weitsprung, Kugelstoßen, 400 m. 2. Tag - 110 m Hürden, Diskuswerfen, Stabhochsprung, Speerwerfen und 1500 m @de
definition: Competição individual masculina envolvendo 10 provas diferentes durante 2 dias. 1º dia: 100m, salto em comprimento, lançamento do peso, salto em altura e 400m. 2º dia: 110m barreiras, lançamento do disco, salto à vara, lançamento do dardo e 1500m. @pt-pt
definition: Competição individual masculina envolvendo 10 provas diferentes durante 2 dias. 1º dia: 100m, salto em distância, lançamento de peso, salto em altura e 400m. 2º dia: 110m barreiras, lançamento de disco, salto com vara, lançamento de dardo e 1500m. @pt-br
definition: En atletikgren, hvor deltagerne udfører ti forskellige discipliner i løbet af to dages konkurrence. @dk
definition: 男子个人项目，两天内完成10个不同的项目，累积积分:第一天：100米跑，跳远，铅球，跳高，400米跑。 第二天：110米栏，铁饼，撑竿跳高，标枪和1500米跑 @zh-hans
definition: Individual men's competition which involves accumulating points in 10 different disciplines over two days: 1st day - 100m, long-jump, shot-putt, high-jump, 400m. 2nd day - 110m hurdles, discus, pole-vault, javelin and 1,500 meters.
in scheme: Media Topic
created: 2009-10-22T02:00:00+00:00
modified: 2021-02-18T12:00:00+00:00
broader: athletics

discus throw
type: Concept
preferred label: Diskuswerfen @de
preferred label: Diskus @se
preferred label: Lancer du disque @fr
preferred label: Lanzamiento de disco @es
preferred label: رمي القرص @ar
preferred label: lançamento do disco @pt-pt
preferred label: lançamento de disco @pt-br
preferred label: diskoskast @dk
preferred label: 铁饼 @zh-hans
preferred label: diskos @no-nb
definition: Tävlande kastar en rund skiva så långt som möjligt. @se
definition: Competitors stand in a netted circle with a 2.50 metres diameter and with a turning motion attempt to throw a discus weighing 2kg for men and 1kg for women as far as possible
definition: Wettkämpfer stehen in einem vernetzten Kreis mit 2.50 Meter Durchmesser und versuchen mit einer Drehbewegung einen Diskus mit 2 kg Gewicht bei Männern und 1 kg für Frauen so weit wie möglich zu werfen @de
definition: Prova em que os atletas, dentro de um círculo com 2.50 metros de diâmetro, dão várias voltas antes de lançarem o mais longe possível um disco de metal que pesa 2 kg para os homens e 1 kg para as mulheres. Ganha quem fizer o lançamento mais longo. @pt-pt
definition: Konkurrenterne står i en cirkel med net rundt om og forsøger med en drejebevægelse at kaste en diskos. @dk
definition: 选手站在2.5米直径的带围护的场地内通过旋转来投掷一个2公斤（男子）或1公斤（女子）的铁饼。越远成绩越好 @zh-hans
definition: Competitors stand in a netted circle with a 2.50 meters diameter and with a turning motion attempt to throw a discus weighing 2kg for men and 1kg for women as far as possible
in scheme: Media Topic
created: 2009-10-22T02:00:00+00:00
modified: 2021-02-18T12:00:00+00:00
broader: athletics

hammer throw
type: Concept
preferred label: Slägga @se
preferred label: Hammerwerfen @de
preferred label: رمي المطرقة @ar
preferred label: Lanzamiento de martillo @es
preferred label: Lancer de marteau @fr
preferred label: lançamento do martelo @pt-pt
preferred label: lançamento de martelo @pt-br
preferred label: hammerkast @dk
preferred label: 链球 @zh-hans
preferred label: sleggekast @no-nb
definition: Wettkämpfer werfen einen Hammer aus einem vernetzten Kreis mit 2.13 Meter Durchmesser, der aus einer Metallkugel, einer Kette und einem Griff besteht, so weit sie können. Der Hammer wiegt 7.26 kg bei Männern und 4 kg bei Frauen @de
definition: De tävlande kastar ett redskap som består av ett handtag, en kedja och en kula så långt som möjligt. @se
definition: Competitors throw a hammer consisting of a metal ball, chain and handle as far as they can from a netted circle which is 2.13 metres in diameter. The hammer weighs 7.26kg for men and 4kg for women
definition: Prova em que os atletas, dentro de um círculo com 2.13 metros de diâmetro, lançam o mais longe possível um martelo (bola de metal, com cabo e pega) que pesa 7.26 kg para os homens e 4 kg para as mulheres. Ganha quem fizer o lançamento mais longo. @pt-pt
definition: Konkurrenterne kaster en hammer bestående af en metalkugle, kæde og håndtag så langt de kan fra en cirkel med net rundt om. @dk
definition: 参赛者从直径为2.13米的网圈中尽可能地投掷由金属球，链条和手柄组成的金属球。 男选手球重7.26公斤，女选手球重4公斤 @zh-hans
definition: Competitors throw a hammer consisting of a metal ball, chain and handle as far as they can from a netted circle which is 2.13 meters in diameter. The hammer weighs 7.26kg for men and 4kg for women
in scheme: Media Topic
created: 2009-10-22T02:00:00+00:00
modified: 2021-02-18T12:00:00+00:00
broader: athletics

heptathlon
type: Concept
preferred label: Heptatlón @es
preferred label: سباعي @ar
preferred label: Heptathlon @fr
preferred label: Siebenkampf @de
preferred label: Sjukamp @se
preferred label: heptatlo @pt-pt
preferred label: syvkamp @dk
preferred label: 七项全能 @zh-hans
preferred label: sjukamp @no-nb
definition: Einzelwettkampf der Frauen, umfasst 7 Disziplinen über 2 Tage: 1. Tag - 100 m Hürden, Hochsprung, Kugelstoßen, 200 Meter. 2. Tag - Weitsprung, Speerwerfen, 800 Meter @de
definition: Competition involving seven separate disciplines over two days. 1st day - 100m hurdles, high jump, shot put, 200 metres. 2nd day - long-jump, javelin, 800 metres
definition: Friidrottsgren för kvinnor med sju grenar under två dagar. Bästa resultatet i varje gren ger en jämförbar poäng och högsta summa vinner. @se
definition: Competição individual feminina que consiste em acumular pontos em 7 provas diferentes durante 2 dias. 1º dia: 100m barreiras, salto em altura, lançamento do peso e 200m. 2º dia: salto em comprimento, lançamento do dardo e 800m. @pt-pt
definition: Competição individual feminina que consiste em acumular pontos em 7 provas diferentes durante 2 dias. 1º dia: 100m barreiras, salto em altura, arremesso de peso e 200m. 2º dia: salto em distância, lançamento de dardo e 800m. @pt-br
definition: En atletikgren for kvinder med syv discipliner over to dage. Det bedste resultat i hver disciplin giver en sammenlignelig score, og den deltager med højeste sum vinder. @dk
definition: 一项有七个不同项目的比赛，分两天完成。第一天：100米跨栏，跳高，铅球和200米跑。第二天：跳远，标枪和800米跑 @zh-hans
definition: Competition involving seven separate disciplines over two days. 1st day - 100m hurdles, high jump, shot put, 200 meters. 2nd day - long-jump, javelin, 800 meters
in scheme: Media Topic
created: 2009-10-22T02:00:00+00:00
modified: 2021-02-18T12:00:00+00:00
broader: athletics

high jump
type: Concept
preferred label: Höjdhopp @se
preferred label: قفز عالي @ar
preferred label: Hochsprung @de
preferred label: Saut en hauteur @fr
preferred label: Salto de altura @es
preferred label: salto em altura @pt-pt
preferred label: højdespring @dk
preferred label: 跳高 @zh-hans
preferred label: høydehopp @no-nb
preferred label: høgdehopp @no-nn
definition: De tävlande försöker hoppa över en horisontell pinne som vilar på ett stativ. @se
definition: Competitors build up speed over a short sprint and then jump as high as possible over a horizontal bar
definition: Wettkämpfer springen so hoch wie möglich über eine Latte, die höher gehängt wird, wenn eine Höhe erreicht ist @de
definition: Prova em que os atletas saltam o mais alto possível sobre uma barra horizontal, que é subida a cada ronda de saltos. Ganha quem atingir a marca mais alta. @pt-pt
definition: Konkurrenterne opbygger hastigheden over en kort sprint og springer så højt som muligt over en vandret bjælke. @dk
definition: 选手短距助跑后尽可能高地跳过横杆 @zh-hans
in scheme: Media Topic
created: 2009-10-22T02:00:00+00:00
modified: 2021-02-18T12:00:00+00:00
broader: athletics

hurdles
type: Concept
preferred label: Häcklöpning @se
preferred label: Salto de vallas @es
preferred label: Hürden @de
preferred label: Course de haies @fr
preferred label: حواجز @ar
preferred label: barreiras @pt-pt
preferred label: hækkeløb @dk
preferred label: 跨栏 @zh-hans
preferred label: hekkeløp @no-nb
definition: A sprint running race where athletes jump over a series of upright frames
definition: Ein Wettlauf im Sprint, bei dem die Athleten über eine Reihe von Hürden springen müssen @de
definition: De tävlande springer en sträcka samtidigt som de hoppar över utställda hinder. @se
definition: Corrida de velocidade em que os atletas saltam sobre uma série de obstáculos verticais. @pt-pt
definition: Et sprintløb, hvor atleter hopper over en række opstillede forhindringer. @dk
definition: 选手跨越一系列直立栏架的短跑项目 @zh-hans
in scheme: Media Topic
created: 2009-10-22T02:00:00+00:00
modified: 2021-05-05T12:00:00+00:00
broader: athletics
broad match: http://cv.iptc.org/newscodes/subjectcode/15005000

javelin throw
type: Concept
preferred label: Speerwurf @de
preferred label: رمي الرمح @ar
preferred label: Lanzamiento de jabalina @es
preferred label: Spjutkastning @se
preferred label: Lancer de javelot @fr
preferred label: lançamento do dardo @pt-pt
preferred label: lançamento de dardo @pt-br
preferred label: spydkast @dk
preferred label: 标枪 @zh-hans
definition: De tävlande kastar ett spjut så långt som möjligt. @se
definition: Wettkämpfer versuchen in einer speziell markierten Wurfzone einen Speer so weit zu werfen wie möglich. Der Speer wiegt 800 Gramm für Männer und 600 Gramm für Frauen @de
definition: Competitors in a specially-designated throwing area attempt to fling a spear-like javelin as far as possible. The javelin weighs 800 grams for men and 600 grams for women.
definition: Prova em que os atletas, a partir de uma área de lançamento própria, arremessam o mais longe possível um dardo que pesa 800 gramas para os homens e 600 gramas para as mulheres. Ganha quem fizer o lançamento mais longo. @pt-pt
definition: Deltagerne kaster et spyd så langt som muligt. @dk
definition: 在一个特别指定的投掷区，选手们尽可能远地投掷长矛状标枪。 男子标枪重800克，女子标枪重600克 @zh-hans
in scheme: Media Topic
created: 2009-10-22T02:00:00+00:00
modified: 2021-02-18T12:00:00+00:00
broader: athletics

long distance run
type: Concept
preferred label: Långdistanslöpning @se
preferred label: Carrera de larga distancia @es
preferred label: Course d'endurance @fr
preferred label: جري المسافات الطويلة @ar
preferred label: Langstreckenlauf @de
preferred label: corrida de fundo @pt-pt
preferred label: langdistanceløb @dk
preferred label: 长跑 @zh-hans
preferred label: langdistanseløp @no-nb
definition: Alla former av springtävlingar som är längre än 1500 meter. @se
definition: A running race at distances for more than 1500 metres
definition: Wettlauf über eine Distanz von mehr als 1500 Metern @de
definition: Corrida de distâncias superiores a 1500 metros. @pt-pt
definition: Alle former for løbekonkurrence, der er længere end 1500 meter. @dk
definition: 距离超过1500米的赛跑 @zh-hans
definition: A running race at distances for more than 1500 meters
in scheme: Media Topic
created: 2009-10-22T02:00:00+00:00
modified: 2021-02-18T12:00:00+00:00
broader: athletics
broad match: http://cv.iptc.org/newscodes/subjectcode/15005000

long jump
type: Concept
preferred label: Weitsprung @de
preferred label: قفز طويل @ar
preferred label: Längdhopp @se
preferred label: Salto de longitud @es
preferred label: Saut en longueur @fr
preferred label: salto em comprimento @pt-pt
preferred label: salto em distância @pt-br
preferred label: længdespring @dk
preferred label: 跳远 @zh-hans
preferred label: lengdehopp @no-nb
definition: Tävlande tar sats och hoppar så långt som möjligt. @se
definition: Competitors build up speed over a short sprint and then jump in one leap as far as possible
definition: Wettkämpfer beschleunigen über eine kurze Distanz ihre Geschwindigkeit und springen dann so weit wie möglich ab einem vorgegeben Punkt in eine Sandgrube @de
definition: Prova em que os atletas fazem uma corrida curta para ganhar velocidade até um ponto determinado e depois se impulsionam saltando para a frente antes de caírem sobre uma caixa de areia. Ganha quem fizer o salto mais longo. @pt-pt
definition: Konkurrenter opbygger hastigheden over en kort sprint og springer så langt som muligt. @dk
definition: 选手短距助跑后在一次跳跃中尽量往远跳 @zh-hans
in scheme: Media Topic
created: 2009-10-22T02:00:00+00:00
modified: 2021-02-18T12:00:00+00:00
broader: athletics

middle distance run
type: Concept
preferred label: Mittelstreckenlauf @de
preferred label: Demi-fond @fr
preferred label: سباق مسافات متوسطة @ar
preferred label: Carrera de media distancia @es
preferred label: Medeldistanslöpning @se
preferred label: corrida de meio-fundo @pt-pt
preferred label: mellemdistanceløb @dk
preferred label: 中距离跑 @zh-hans
preferred label: mellomdistanseløp @no-nb
definition: Wettlauf über eine Distanz von mehr als 400 Metern bis zu 1500 Metern @de
definition: A running race at distances for more than 400 metres and up to and including 1500 metres
definition: Springtävlingar som är mellan 400 och 1500 meter. @se
definition: Corrida de distâncias entre 400 e 1500 metros. @pt-pt
definition: Løbskonkurrencer på mere end 400 meter og maksimalt 1500 meter. @dk
definition: 距离大于400米至最多为1500米间的赛跑 @zh-hans
definition: A running race at distances for more than 400 meters and up to and including 1500 meters
in scheme: Media Topic
created: 2009-10-22T02:00:00+00:00
modified: 2021-02-18T12:00:00+00:00
broader: athletics
broad match: http://cv.iptc.org/newscodes/subjectcode/15005000

pentathlon
type: Concept
preferred label: Femkamp @se
preferred label: Fünfkampf @de
preferred label: Pentatlon @es
preferred label: Pentathlon @fr
preferred label: خماسي @ar
preferred label: pentatlo @pt-pt
preferred label: femkamp @dk
preferred label: 五项全能 @zh-hans
definition: Aktuell bei DM/EM/WM in der Halle: 60 m Hürden, Hochsprung, Kugelstoßen, Weitsprung und 800 m. @de
definition: Inomhustävling där de tävlande genomför fem olika grenar, jämförbar med tiokamp utomhus. @se
definition: Only indoor, 60m hurdles, high jump, shot put, long jump, 800 m
definition: Competição em pista fechada composta por 60 m barreiras, salto em altura, lançamento do peso, salto em comprimento, 800 m. @pt-pt
definition: Competição em pista fechada composta por 60 m barreiras, salto em altura, arremesso de peso, salto em distância, 800 m. @pt-br
definition: Indendørskonkurrence, hvor deltagerne udfører fem forskellige discipliner, svarende til tikamp udendørs. @dk
definition: 室内比赛项目，包括60米跨栏，跳高，铅球，跳远和800米 @zh-hans
in scheme: Media Topic
created: 2009-10-22T02:00:00+00:00
modified: 2021-02-18T12:00:00+00:00
broader: athletics

pole vault
type: Concept
preferred label: القفز بالزانة @ar
preferred label: Stabhochsprung @de
preferred label: Saut à la perche @fr
preferred label: Salto con pértiga @es
preferred label: Stavhopp @se
preferred label: salto à vara @pt-pt
preferred label: salto com vara @pt-br
preferred label: stangspring @dk
preferred label: 撑杆跳 @zh-hans
preferred label: stavsprang @no-nb
definition: Med hjälp av en stav ska de tävlande ta sig över så hög höjd som möjligt. @se
definition: Competitors use a flexible pole to propel themselves feet-first into the air and clear a bar which is raised higher at each round of jumps.
definition: Wettkämpfer benutzen einen flexiblen Stab, mit dem sie sich selbst in die Luft befördern und eine Latte überspringen, die in jeder Runde höher gehängt wird @de
definition: Prova em que os atletas usam uma vara flexível para se projetarem com os pés para o ar e transpor uma barra horizontal que é subida a cada ronda de saltos. Ganha quem atingir a marca mais alta. @pt-pt
definition: Ved hjælp af en stang skal deltagerne nå en så høj højde som muligt. @dk
definition: 参赛者使用一根柔韧的杆子将自己的脚朝上地升到空中并越过横杆，在每轮跳跃横杆都会升高高度 @zh-hans
in scheme: Media Topic
created: 2009-10-22T02:00:00+00:00
modified: 2021-02-18T12:00:00+00:00
broader: athletics

race walking
type: Concept
preferred label: Marche @fr
preferred label: Gehen @de
preferred label: Marcha atlética @es
preferred label: سباق المشي @ar
preferred label: Gång @se
preferred label: marcha atlética @pt-pt
preferred label: kapgang @dk
preferred label: 竞走 @zh-hans
preferred label: kappgang @no-nb
definition: A race requiring the competitor to have always one foot on the ground
definition: De tävlande ska avverka en bana på så kort tid som möjligt utan att springa. De tävlande måste alltid ha en fot i kontakt med marken. @se
definition: Ein Wettlauf, bei dem der Läufer immer einen Fuß auf dem Boden haben muss @de
definition: Corrida em que o atleta deve manter um dos pés sempre em contacto com o chão. @pt-pt
definition: Corrida em que o atleta deve manter um dos pés sempre em contato com o chão. @pt-br
definition: Et løb, der kræver, at konkurrenten altid har en fod på jorden. @dk
definition: 要求参赛者总有一只脚着地的竞走比赛 @zh-hans
in scheme: Media Topic
created: 2009-10-22T02:00:00+00:00
modified: 2021-02-18T12:00:00+00:00
broader: athletics
broad match: http://cv.iptc.org/newscodes/subjectcode/15005000

relay run
type: Concept
preferred label: Carrera de relevos @es
preferred label: Staffellauf @de
preferred label: سباق التتابع @ar
preferred label: Relais @fr
preferred label: Stafett @se
preferred label: estafetas @pt-pt
preferred label: revezamento @pt-br
preferred label: stafetløb @dk
preferred label: 接力跑 @zh-hans
preferred label: stafettløp @no-nb
preferred label: stafett @no-nn
definition: A team of athletes run a relay over identical distances
definition: Ein Team von Läufern, die eine Staffel über die gleiche Distanz laufen @de
definition: Springtävlingar där personer i ett lag tar en delsträcka var. @se
definition: Atletas da mesma equipa revezam-se durante um percurso, cumprindo distâncias iguais. @pt-pt
definition: Atletas da mesma equipe se revezam durante um percurso, cumprindo distâncias iguais. @pt-br
definition: Et stafetløb er en konkurrence, hvor flere hold-deltagere afløser hinanden og viderelevere en depeche for at levere en samlet præstation. @dk
definition: 每人跑同样距离的接力形式的团队比赛 @zh-hans
in scheme: Media Topic
created: 2009-10-22T02:00:00+00:00
modified: 2021-02-18T12:00:00+00:00
broader: athletics
broad match: http://cv.iptc.org/newscodes/subjectcode/15005000

shot put
type: Concept
preferred label: Lancer du poids @fr
preferred label: Kugelstoßen @de
preferred label: Lanzamiento de peso @es
preferred label: Kulstötning @se
preferred label: رمي الجلة @ar
preferred label: lançamento do peso @pt-pt
preferred label: arremesso de peso @pt-br
preferred label: kuglestød @dk
preferred label: 铅球 @zh-hans
preferred label: kulestøt @no-nb
preferred label: kulestøyt @no-nn
definition: De tävlande stöter en metallkula så långt som möjligt. @se
definition: Wettkämpfer stehen in einem Kreis mit 2.13 Meter Durchmesser und versuchen eine Metallkugel mit einem Gewicht von 7.26 kg für Männer und 4 kg für Frauen, so weit wie möglich zu werfen. Der längste Wurf gewinnt. @de
definition: Competitors stand in a circle with a 2.13 metres diameter and attempt to throw a metal ball weighing 7.26 kg for men and 4kg for women as far as possible. The longest throw wins.
definition: Prova em que os atletas, dentro de um círculo com 2.13 metros de diâmetro, tentam lançar o mais longe possível uma bola de metal que pesa 7,26 kg para os homens e 4 kg para as mulheres. Ganha quem fizer o lançamento mais longo. @pt-pt
definition: Konkurrenter står i en cirkel og forsøger at støde en metalkugle så langt som muligt. @dk
definition: 赛手站在2.13米直径的圆圈内投掷一个7.25公斤（男子）或4公斤（女子）的金属球。投掷最远者获胜 @zh-hans
definition: Competitors stand in a circle with a 2.13 meters diameter and attempt to throw a metal ball weighing 7.26 kg for men and 4kg for women as far as possible. The longest throw wins.
in scheme: Media Topic
created: 2009-10-22T02:00:00+00:00
modified: 2021-02-18T12:00:00+00:00
broader: athletics

sprint run
type: Concept
preferred label: Sprint @de
preferred label: Sprintdistanser @se
preferred label: Course de vitesse @fr
preferred label: عدو سريع @ar
preferred label: sprint @pt-pt
preferred label: sprintløb @dk
preferred label: 短跑 @zh-hans
preferred label: sprintløp @no-nb
definition: Wettlauf über eine Distanz bis zu 400 Metern @de
definition: Springtävlingar på distanser till och med 400 meter. @se
definition: A running race at distances of up to and including 400 metres
definition: Corrida de velocidade de distâncias até 400 metros. @pt-pt
definition: Spurtkonkurrencer i afstande til og med 400 meter. @dk
definition: 400米及以下的短跑运动 @zh-hans
definition: A running race at distances of up to and including 400 meters
in scheme: Media Topic
created: 2009-10-22T02:00:00+00:00
modified: 2021-02-18T12:00:00+00:00
broader: athletics

triple jump
type: Concept
preferred label: Dreisprung @de
preferred label: Triple saut @fr
preferred label: Tresteg @se
preferred label: وثبة ثلاثية @ar
preferred label: Triple salto @es
preferred label: triplo salto @pt-pt
preferred label: salto triplo @pt-br
preferred label: trespring @dk
preferred label: 三级跳远 @zh-hans
preferred label: tresteg @no-nb
definition: En variant av längdhopp där de tävlande får ta tre steg efter avstamp från hoppbrädan. @se
definition: Wettkämpfer beschleunigen ihre Geschwindigkeit über eine kurze Distanz und versuchen dann so weit wie möglich zu springen, wobei sie einen Hop, einen Step und einen Jump benutzen @de
definition: Competitors build up speed over a short sprint and then attempt to jump as far forward as they can using a hop, skip and a jump technique.
definition: Prova em que os atletas fazem uma corrida curta para ganhar velocidade até um ponto determinado e depois se impulsionam encadeando três saltos sucessivos que terminam com uma queda sobre uma caixa de areia. Ganha quem fizer o salto mais longo. @pt-pt
definition: En variant af længdespring, hvor deltagerne får lov til at tage et hop, et skridt og et spring. @dk
definition: 参赛者通过短距离加速助跑，然后利用单足跳、跨跳和跳跃技术尽可能地向前跳出最远的距离 @zh-hans
in scheme: Media Topic
created: 2009-10-22T02:00:00+00:00
modified: 2021-02-18T12:00:00+00:00
broader: athletics

steeplechase (athletics)
type: Concept
preferred label: forhindringsløb @dk
preferred label: hinderløp @no-nb
preferred label: corrida de obstáculos (atletismo) @pt-br
preferred label: Hinderlöpning @se
preferred label: 障碍跑 @zh-hans
preferred label: Hindernislauf (Leichtathletik) @de
preferred label: Steeple @fr
preferred label: Carrera con obstáculos @es
preferred label: سباق الموانع @ar
definition: Atletikdisciplin, hvor forhindringer som bomme og vandgrave skal forceres. @dk
definition: Obstacle race in athletics including barriers and water jumps
definition: Corrida de obstáculos no atletismo, que inclui barreiras e saltos de água. @pt-br
definition: Löptävlingar på bana med olika hinder som bockar och vattengrav. @se
definition: 包括障碍物和水池跨越的有障碍赛跑 @zh-hans
definition: Hindernisrennen in der Leichtathletik einschließlich Barrieren und Wassersprünge @de
in scheme: Media Topic
created: 2019-07-23T12:00:00+00:00
modified: 2021-07-12T12:00:00+00:00
broader: athletics

rubberball baseball
type: Concept
preferred label: Baseboll med gummiboll @se
preferred label: Béisbol con pelota blanda @es
preferred label: Rubberball @de
preferred label: Rubberball baseball @fr
preferred label: بيسبول بكرة مطاطية @ar
preferred label: beisebol de bola de borracha @pt-pt
preferred label: rubberball baseball (nanshiki) @dk
preferred label: 橡胶棒球 @zh-hans
preferred label: japansk baseball @no-nb
definition: Manchmal als 'Softbaseball' bezeichnet, das Spiel wird mit einem gummierten Ball unterschiedlicher Härte, abhängig vom Alter und der Spielstärke der Spieler durchgeführt @de
definition: Sometimes called ''soft baseball,'' the game is played with a rubber baseball of varying degrees of hardness depending upon the age and level of the players.
definition: Som baseboll fast med en boll gjord av gummi. @se
definition: Também denominado *soft baseball*, é um jogo de beisebol disputado com uma bola de borracha de dureza variável, dependendo das idades e níveis dos jogadores. @pt-pt
definition: Também denominado *soft baseball*, é um jogo de beisebol disputado com uma bola de borracha de dureza variável, dependendo das idades ou níveis dos jogadores. @pt-br
definition: Nogle gange kaldet ''blød baseball'', spillet spilles med en gummibaseball i forskellige grader af hårdhed, afhængig af spillernes alder og niveau. @dk
definition: 有时也叫软式棒球。比赛是使用不同硬度的橡胶棒球，取决于球员的年龄和水平 @zh-hans
definition: Japansk ballspel avleidd frå baseball med ei hard gummikule i staden for ein vanleg baseball av lêr. Også kalla nankyu-baseball og nanshiki-baseball. @no-nn
definition: Japansk ballspill avledet fra baseball med en hard gummikule i stedet for en vanlig baseball av lær. Også omtalt som nankyu-baseball og nanshiki-baseball. @no-nb
in scheme: Media Topic
created: 2009-10-22T02:00:00+00:00
modified: 2021-05-05T12:00:00+00:00
broader: baseball

bantamweight (boxing)
type: Concept
preferred label: Coq (boxe) @fr
preferred label: Bantamvikt, (Boxning) @se
preferred label: وزن الديك @ar
preferred label: Peso gallo (boxeo) @es
preferred label: Bantamgewicht (Boxen) @de
preferred label: peso-galo (boxe) @pt-pt
preferred label: bantamvægt @dk
preferred label: 雏量级 @zh-hans
preferred label: bantamvekt @no-nb
definition: Gewichtsklasse die je nach Verband oder der Olympischen Spiele variiert @de
definition: Weight category which varies according to the federation or the Olympic Games
definition: Categoria de peso que varia segundo a federação ou os Jogos Olímpicos. @pt-pt
definition: Vægtkategori, der varierer afhængigt af føderationen eller de olympiske lege. @dk
definition: 拳击的体重级别，根据各个联合会或奥运会的规定不同而有所不同 @zh-hans
in scheme: Media Topic
created: 2009-10-22T02:00:00+00:00
retired: 2015-02-24T12:00:00+00:00
modified: 2021-12-21T12:00:00+00:00
broader: boxing

cruiserweight (boxing)
type: Concept
preferred label: Cruiservikt, (Boxning) @se
preferred label: Peso crucero (boxeo) @es
preferred label: وزن المطوف @ar
preferred label: Cruisergewicht (Boxen) @de
preferred label: Mi-lourds (boxe) @fr
preferred label: peso-cruzador (boxe) @pt-pt
preferred label: cruiservægt @dk
preferred label: 初重量级 @zh-hans
preferred label: cruiservekt @no-nb
definition: Gewichtsklasse die je nach Verband oder der Olympischen Spiele variiert @de
definition: Weight category which varies according to the federation or the Olympic Games
definition: Categoria de peso que varia segundo a federação ou os Jogos Olímpicos. @pt-pt
definition: Vægtkategori, der varierer afhængigt af føderationen eller de olympiske lege. @dk
definition: 拳击的体重级别，根据各个联合会或奥运会的规定不同而有所不同 @zh-hans
in scheme: Media Topic
created: 2009-10-22T02:00:00+00:00
retired: 2015-02-24T12:00:00+00:00
modified: 2021-12-21T12:00:00+00:00
broader: boxing

featherweight (boxing)
type: Concept
preferred label: Peso pluma (boxeo) @es
preferred label: وزن الريشة @ar
preferred label: Fjädervikt, (Boxning) @se
preferred label: Federgewicht (Boxen) @de
preferred label: Poids-plume (boxe) @fr
preferred label: peso-pluma (boxe) @pt-pt
preferred label: peso-pena (boxe) @pt-br
preferred label: fjervægt @dk
preferred label: 羽量级 @zh-hans
preferred label: fjærvekt @no-nb
preferred label: fjørvekt @no-nn
definition: Gewichtsklasse die je nach Verband oder der Olympischen Spiele variiert @de
definition: Weight category which varies according to the federation or the Olympic Games
definition: Categoria de peso que varia segundo a federação ou os Jogos Olímpicos. @pt-pt
definition: Vægtkategori, der varierer afhængigt af føderationen eller de olympiske lege. @dk
definition: 拳击的体重级别，根据各个联合会或奥运会的规定不同而有所不同 @zh-hans
in scheme: Media Topic
created: 2014-04-08T12:00:00+00:00
retired: 2015-02-24T12:00:00+00:00
modified: 2021-12-21T12:00:00+00:00
broader: boxing

flyweight (boxing)
type: Concept
preferred label: Mosca (boxeo) @es
preferred label: Mouches (boxe) @fr
preferred label: وزن الذبابة @ar
preferred label: Fliegengewicht (Boxen) @de
preferred label: Flugvikt, (Boxning) @se
preferred label: peso-mosca (boxe) @pt-pt
preferred label: fluevægt @dk
preferred label: 蝇量级 @zh-hans
preferred label: fluevekt @no-nb
preferred label: flugevekt @no-nn
definition: Weight category which varies according to the federation or the Olympic Games
definition: Gewichtsklasse die je nach Verband oder der Olympischen Spiele variiert @de
definition: Categoria de peso que varia segundo a federação ou os Jogos Olímpicos. @pt-pt
definition: Vægtkategori, der varierer afhængigt af føderationen eller de olympiske lege. @dk
definition: 拳击的体重级别，根据各个联合会或奥运会的规定不同而有所不同 @zh-hans
in scheme: Media Topic
created: 2009-10-22T02:00:00+00:00
retired: 2015-02-24T12:00:00+00:00
modified: 2021-12-21T12:00:00+00:00
broader: boxing

heavyweight (boxing)
type: Concept
preferred label: Schwergewicht (Boxen) @de
preferred label: الوزن الثقيل (ملاكمة) @ar
preferred label: Tungvikt, (Boxning) @se
preferred label: Peso pesado (boxeo) @es
preferred label: Lourds (boxe) @fr
preferred label: peso-pesado (boxe) @pt-pt
preferred label: sværvægt @dk
preferred label: 重量级 @zh-hans
preferred label: tungvekt @no-nb
definition: Weight category which varies according to the federation or the Olympic Games
definition: Gewichtsklasse die je nach Verband oder der Olympischen Spiele variiert @de
definition: Categoria de peso que varia segundo a federação ou os Jogos Olímpicos. @pt-pt
definition: Vægtkategori, der varierer afhængigt af føderationen eller de olympiske lege. @dk
definition: 拳击的体重级别，根据各个联合会或奥运会的规定不同而有所不同 @zh-hans
in scheme: Media Topic
created: 2009-10-22T02:00:00+00:00
retired: 2015-02-24T12:00:00+00:00
modified: 2021-12-21T12:00:00+00:00
broader: boxing

light flyweight (boxing)
type: Concept
preferred label: Mi-mouches (boxe) @fr
preferred label: Minimosca (boxeo) @es
preferred label: Lätt flugvikt, (Boxning) @se
preferred label: وزن خفيف الذبابة @ar
preferred label: Leicht-Fliegengewicht (Boxen) @de
preferred label: peso-mosca-ligeiro (boxe) @pt-pt
preferred label: letfluevægt @dk
preferred label: 轻蝇量级 @zh-hans
preferred label: lett fluevekt @no-nb
preferred label: lett flugevekt @no-nn
definition: Gewichtsklasse die je nach Verband oder der Olympischen Spiele variiert @de
definition: Weight category which varies according to the federation or the Olympic Games
definition: Categoria de peso que varia segundo a federação ou os Jogos Olímpicos. @pt-pt
definition: Vægtkategori, der varierer afhængigt af føderationen eller de olympiske lege. @dk
definition: 拳击的体重级别，根据各个联合会或奥运会的规定不同而有所不同 @zh-hans
in scheme: Media Topic
created: 2009-10-22T02:00:00+00:00
retired: 2015-02-24T12:00:00+00:00
modified: 2021-12-21T12:00:00+00:00
broader: boxing

light-heavyweight (boxing)
type: Concept
preferred label: Leicht-Schwergewicht (Boxen) @de
preferred label: Mediano (boxeo) @es
preferred label: Lätt tungvikt, (Boxning) @se
preferred label: Moyens (boxe) @fr
preferred label: وزن خفيف الثقيل @ar
preferred label: peso-meio-pesado (boxe) @pt-pt
preferred label: letsværvægt @dk
preferred label: 轻重量级 @zh-hans
preferred label: lett tungvekt @no-nb
definition: Weight category which varies according to the federation or the Olympic Games
definition: Gewichtsklasse die je nach Verband oder der Olympischen Spiele variiert @de
definition: Categoria de peso que varia segundo a federação ou os Jogos Olímpicos. @pt-pt
definition: Vægtkategori, der varierer afhængigt af føderationen eller de olympiske lege. @dk
definition: 拳击的体重级别，根据各个联合会或奥运会的规定不同而有所不同 @zh-hans
in scheme: Media Topic
created: 2009-10-22T02:00:00+00:00
retired: 2015-02-24T12:00:00+00:00
modified: 2021-12-21T12:00:00+00:00
broader: boxing

light-middleweight (boxing)
type: Concept
preferred label: Leicht-Mittelgewicht (Boxen) @de
preferred label: Superligero (boxeo) @es
preferred label: وزن خفيف المتوسط @ar
preferred label: Super légers (boxe) @fr
preferred label: Lätt mellanvikt, (Boxning) @se
preferred label: peso-médio-ligeiro (boxe) @pt-pt
preferred label: letmellemvægt @dk
preferred label: 轻中量级 @zh-hans
preferred label: super weltervekt @no-nb
definition: Gewichtsklasse die je nach Verband oder der Olympischen Spiele variiert @de
definition: Weight category which varies according to the federation or the Olympic Games
definition: Categoria de peso que varia segundo a federação ou os Jogos Olímpicos. @pt-pt
definition: Vægtkategori, der varierer afhængigt af føderationen eller de olympiske lege. @dk
definition: 拳击的体重级别，根据各个联合会或奥运会的规定不同而有所不同 @zh-hans
in scheme: Media Topic
created: 2009-10-22T02:00:00+00:00
retired: 2015-02-24T12:00:00+00:00
modified: 2021-12-21T12:00:00+00:00
broader: boxing

light-welterweight (boxing)
type: Concept
preferred label: Super-plumes (boxe) @fr
preferred label: Leicht-Weltergewicht (Boxen) @de
preferred label: Superpluma (boxeo) @es
preferred label: Lätt weltervikt, (Boxning) @se
preferred label: وزن خفيف الوسط @ar
preferred label: peso-meio-médio-ligeiro (boxe) @pt-pt
preferred label: letweltervægt @dk
preferred label: 轻沉量级 @zh-hans
preferred label: super lettvekt @no-nb
definition: Weight category which varies according to the federation or the Olympic Games
definition: Gewichtsklasse die je nach Verband oder der Olympischen Spiele variiert @de
definition: Categoria de peso que varia segundo a federação ou os Jogos Olímpicos. @pt-pt
definition: Vægtkategori, der varierer afhængigt af føderationen eller de olympiske lege. @dk
definition: 拳击的体重级别，根据各个联合会或奥运会的规定不同而有所不同 @zh-hans
in scheme: Media Topic
created: 2009-10-22T02:00:00+00:00
retired: 2015-02-24T12:00:00+00:00
modified: 2021-12-21T12:00:00+00:00
broader: boxing

lightweight (boxing)
type: Concept
preferred label: الوزن الخفيف (ملاكمة) @ar
preferred label: Pluma (boxeo) @es
preferred label: Plumes (boxe) @fr
preferred label: Leichtgewicht (Boxen) @de
preferred label: Lättvikt, (Boxning) @se
preferred label: peso-leve (boxe) @pt-pt
preferred label: letvægt @dk
preferred label: 轻量级 @zh-hans
preferred label: lettvekt @no-nb
definition: Weight category which varies according to the federation or the Olympic Games
definition: Gewichtsklasse die je nach Verband oder der Olympischen Spiele variiert @de
definition: Categoria de peso que varia segundo a federação ou os Jogos Olímpicos. @pt-pt
definition: Vægtkategori, der varierer afhængigt af føderationen eller de olympiske lege. @dk
definition: 拳击的体重级别，根据各个联合会或奥运会的规定不同而有所不同 @zh-hans
in scheme: Media Topic
created: 2009-10-22T02:00:00+00:00
retired: 2015-02-24T12:00:00+00:00
modified: 2021-12-21T12:00:00+00:00
broader: boxing

middleweight (boxing)
type: Concept
preferred label: Mellanvikt, (Boxning) @se
preferred label: الوزن المتوسط (ملاكمة) @ar
preferred label: Mittelgewicht (Boxen) @de
preferred label: Mi-moyens (boxe) @fr
preferred label: Medio mediano (boxeo) @es
preferred label: peso-médio (boxe) @pt-pt
preferred label: mellemvægt @dk
preferred label: 中量级 @zh-hans
preferred label: mellomvekt @no-nb
definition: Gewichtsklasse die je nach Verband oder der Olympischen Spiele variiert @de
definition: Weight category which varies according to the federation or the Olympic Games
definition: Categoria de peso que varia segundo a federação ou os Jogos Olímpicos. @pt-pt
definition: Vægtkategori, der varierer afhængigt af føderationen eller de olympiske lege. @dk
definition: 拳击的体重级别，根据各个联合会或奥运会的规定不同而有所不同 @zh-hans
in scheme: Media Topic
created: 2009-10-22T02:00:00+00:00
retired: 2015-02-24T12:00:00+00:00
modified: 2021-12-21T12:00:00+00:00
broader: boxing

straw weight (boxing)
type: Concept
preferred label: Strohgewicht (Boxen) @de
preferred label: وزن القشة @ar
preferred label: Paja (boxeo) @es
preferred label: Minivikt, (Boxning) @se
preferred label: Poids pailles (boxe) @fr
preferred label: peso-palha (boxe) @pt-pt
preferred label: stråvægt @dk
preferred label: 草量级 @zh-hans
preferred label: stråvekt @no-nb
definition: Gewichtsklasse die je nach Verband oder der Olympischen Spiele variiert @de
definition: Weight category which varies according to the federation or the Olympic Games
definition: Categoria de peso que varia segundo a federação ou os Jogos Olímpicos. @pt-pt
definition: Vægtkategori, der varierer afhængigt af føderationen eller de olympiske lege. @dk
definition: 拳击的体重级别，根据各个联合会或奥运会的规定不同而有所不同 @zh-hans
in scheme: Media Topic
created: 2009-10-22T02:00:00+00:00
retired: 2015-02-24T12:00:00+00:00
modified: 2021-12-21T12:00:00+00:00
broader: boxing
broad match: http://cv.iptc.org/newscodes/subjectcode/15014000

super-bantamweight (boxing)
type: Concept
preferred label: Super coq (boxe) @fr
preferred label: Super-Bantamgewicht (Boxen) @de
preferred label: وزن فوق الديك @ar
preferred label: Tung bantamvikt, (Boxning) @se
preferred label: Supergallo (boxeo) @es
preferred label: peso-supergalo (boxe) @pt-pt
preferred label: superbantamvægt @dk
preferred label: 超雏量级 @zh-hans
preferred label: super bantamvekt @no-nb
definition: Weight category which varies according to the federation or the Olympic Games
definition: Gewichtsklasse die je nach Verband oder der Olympischen Spiele variiert @de
definition: Categoria de peso que varia segundo a federação ou os Jogos Olímpicos. @pt-pt
definition: Vægtkategori, der varierer afhængigt af føderationen eller de olympiske lege. @dk
definition: 拳击的体重级别，根据各个联合会或奥运会的规定不同而有所不同 @zh-hans
in scheme: Media Topic
created: 2009-10-22T02:00:00+00:00
retired: 2015-02-24T12:00:00+00:00
modified: 2021-12-21T12:00:00+00:00
broader: boxing

super-featherweight (boxing)
type: Concept
preferred label: Tung fjädervikt, (Boxning) @se
preferred label: Super-poids plumes (boxe) @fr
preferred label: وزن فوق الريشة @ar
preferred label: Super peso pluma (boxeo) @es
preferred label: Super-Federgewicht (Boxen) @de
preferred label: peso-superpluma (boxe) @pt-pt
preferred label: peso-superpena (boxe) @pt-br
preferred label: superfjervægt @dk
preferred label: 超羽量级 @zh-hans
preferred label: super fjærvekt @no-nb
preferred label: super fjørvekt @no-nn
definition: Weight category which varies according to the federation or the Olympic Games
definition: Gewichtsklasse die je nach Verband oder der Olympischen Spiele variiert @de
definition: Categoria de peso que varia segundo a federação ou os Jogos Olímpicos. @pt-pt
definition: Vægtkategori, der varierer afhængigt af føderationen eller de olympiske lege. @dk
definition: 拳击的体重级别，根据各个联合会或奥运会的规定不同而有所不同 @zh-hans
in scheme: Media Topic
created: 2009-10-22T02:00:00+00:00
retired: 2015-02-24T12:00:00+00:00
modified: 2021-12-21T12:00:00+00:00
broader: boxing

super-flyweight (boxing)
type: Concept
preferred label: Super-Fliegengewicht (Boxen) @de
preferred label: وزن فوق الذبابة @ar
preferred label: Supermosca (boxeo) @es
preferred label: Super-mouches (boxe) @fr
preferred label: Tung flugvikt, (Boxning) @se
preferred label: peso-supermosca (boxe) @pt-pt
preferred label: superfluevægt @dk
preferred label: 超蝇量级 @zh-hans
preferred label: super fluevekt @no-nb
preferred label: super flugevekt @no-nn
definition: Weight category which varies according to the federation or the Olympic Games
definition: Gewichtsklasse die je nach Verband oder der Olympischen Spiele variiert @de
definition: Categoria de peso que varia segundo a federação ou os Jogos Olímpicos. @pt-pt
definition: Vægtkategori, der varierer afhængigt af føderationen eller de olympiske lege. @dk
definition: 拳击的体重级别，根据各个联合会或奥运会的规定不同而有所不同 @zh-hans
in scheme: Media Topic
created: 2009-10-22T02:00:00+00:00
retired: 2015-02-24T12:00:00+00:00
modified: 2021-12-21T12:00:00+00:00
broader: boxing

super-heavyweight (boxing)
type: Concept
preferred label: وزن فوق الثقيل @ar
preferred label: Super-Schwergewicht (Boxen) @de
preferred label: Super-lourds (boxe) @fr
preferred label: Superpesado (boxeo) @es
preferred label: Supertungvikt, (Boxning) @se
preferred label: peso-superpesado (boxe) @pt-pt
preferred label: supersværvægt @dk
preferred label: 超重量级 @zh-hans
preferred label: super-tungvekt @no-nb
definition: Weight category which varies according to the federation or the Olympic Games
definition: Gewichtsklasse die je nach Verband oder der Olympischen Spiele variiert @de
definition: Categoria de peso que varia segundo a federação ou os Jogos Olímpicos. @pt-pt
definition: Vægtkategori, der varierer afhængigt af føderationen eller de olympiske lege. @dk
definition: 拳击的体重级别，根据各个联合会或奥运会的规定不同而有所不同 @zh-hans
in scheme: Media Topic
created: 2009-10-22T02:00:00+00:00
retired: 2015-02-24T12:00:00+00:00
modified: 2021-12-21T12:00:00+00:00
broader: boxing

super-middleweight (boxing)
type: Concept
preferred label: Tung mellanvikt, (Boxning) @se
preferred label: Supermediano (boxeo) @es
preferred label: Super mi-moyens (boxe) @fr
preferred label: Super-Mittelgewicht (Boxen) @de
preferred label: وزن فوق المتوسط @ar
preferred label: peso-supermédio (boxe) @pt-pt
preferred label: supermellemvægt @dk
preferred label: 超中量级 @zh-hans
preferred label: super mellomvekt @no-nb
definition: Gewichtsklasse die je nach Verband oder der Olympischen Spiele variiert @de
definition: Weight category which varies according to the federation or the Olympic Games
definition: Categoria de peso que varia segundo a federação ou os Jogos Olímpicos. @pt-pt
definition: Vægtkategori, der varierer afhængigt af føderationen eller de olympiske lege. @dk
definition: 拳击的体重级别，根据各个联合会或奥运会的规定不同而有所不同 @zh-hans
in scheme: Media Topic
created: 2009-10-22T02:00:00+00:00
retired: 2015-02-24T12:00:00+00:00
modified: 2021-12-21T12:00:00+00:00
broader: boxing

welterweight (boxing)
type: Concept
preferred label: الوزن الوسط @ar
preferred label: Weltervikt, (Boxning) @se
preferred label: Légers (boxe) @fr
preferred label: Ligero (boxeo) @es
preferred label: Weltergewicht (Boxen) @de
preferred label: peso-meio-médio (boxe) @pt-pt
preferred label: weltervægt @dk
preferred label: 沉量级 @zh-hans
preferred label: weltervekt @no-nb
definition: Gewichtsklasse die je nach Verband oder der Olympischen Spiele variiert @de
definition: Weight category which varies according to the federation or the Olympic Games
definition: Categoria de peso que varia segundo a federação ou os Jogos Olímpicos. @pt-pt
definition: Vægtkategori, der varierer afhængigt af føderationen eller de olympiske lege. @dk
definition: 拳击的体重级别，根据各个联合会或奥运会的规定不同而有所不同 @zh-hans
in scheme: Media Topic
created: 2009-10-22T02:00:00+00:00
retired: 2015-02-24T12:00:00+00:00
modified: 2021-12-21T12:00:00+00:00
broader: boxing

C1 (canoeing)
type: Concept
preferred label: C1 @se
preferred label: C1 (Kanu) @de
preferred label: كانو فردي @ar
preferred label: C1 (canotaje) @es
preferred label: C1 (canoë) @fr
preferred label: C1 (kano) @dk
preferred label: 单人划艇 @zh-hans
preferred label: C1 (kanopadling) @no-nb
definition: Einsitzer Kanu (offenes Boot) mit Wettkämpfern die ein Einzelpaddel benutzen @de
definition: One-seater canoe (open boat with competitor using a single bladed paddle
definition: Canoa de 1 lugar (embarcação aberta para uma pessoa que rema com pagaia simples). @pt-pt
definition: Canoa de 1 lugar (embarcação aberta para uma pessoa que rema com remo simples). @pt-br
definition: Et-sædet kano. @dk
definition: 单座赛艇。开放式的赛艇，参赛者使用单叶桨 @zh-hans
in scheme: Media Topic
created: 2009-10-22T02:00:00+00:00
retired: 2015-02-24T12:00:00+00:00
modified: 2021-12-21T12:00:00+00:00
broader: canoeing

C2 (canoeing)
type: Concept
preferred label: C2 (canotaje) @es
preferred label: C2 (Kanu) @de
preferred label: C2 @se
preferred label: كانو زوجي @ar
preferred label: C2 (canoë) @fr
preferred label: C2 (kano) @dk
preferred label: 双人划艇 @zh-hans
preferred label: C2 (kanopadling) @no-nb
definition: Zweisitzer Kanu (offenes Boot) mit Wettkämpfern die ein Einzelpaddel benutzen @de
definition: Two-seater canoe (open boat) - competitors use a single bladed paddle
definition: Canoa de 2 lugares (embarcação aberta para duas pessoas que remam com pagaia simples). @pt-pt
definition: Canoa de 2 lugares (embarcação aberta para duas pessoas que remam com remo simples). @pt-br
definition: Tosædet kano. @dk
definition: 双座赛艇。开放式的赛艇，参赛者使用单叶桨 @zh-hans
in scheme: Media Topic
created: 2009-10-22T02:00:00+00:00
retired: 2015-02-24T12:00:00+00:00
modified: 2021-12-21T12:00:00+00:00
broader: canoeing

C4 (canoeing)
type: Concept
preferred label: كانو رباعي @ar
preferred label: C4 (canoë) @fr
preferred label: C4 @se
preferred label: C4 (Kanu) @de
preferred label: C4 (canotaje) @es
preferred label: C4 (kano) @dk
preferred label: 四人划艇 @zh-hans
preferred label: C4 (kanopadling) @no-nb
definition: Four-seater canoe (open boat) with each competitor using a single bladed paddle
definition: Viersitzer Kanu (offenes Boot) mit Wettkämpfern die ein Einzelpaddel benutzen @de
definition: Canoa de 4 lugares (embarcação aberta para quatro pessoas que remam com pagaia simples). @pt-pt
definition: Canoa de 4 lugares (embarcação aberta para quatro pessoas que remam com remo simples). @pt-br
definition: Fire-sædet kano. @dk
definition: 四座赛艇。开放式的赛艇，参赛者使用单叶桨 @zh-hans
in scheme: Media Topic
created: 2009-10-22T02:00:00+00:00
retired: 2015-02-24T12:00:00+00:00
modified: 2021-12-21T12:00:00+00:00
broader: canoeing
broad match: http://cv.iptc.org/newscodes/subjectcode/15015010

canoe sailing
type: Concept
preferred label: Kanotsegling @se
preferred label: Canoë à voile @fr
preferred label: كانو @ar
preferred label: Kanusegeln @de
preferred label: Canoa a vela @es
preferred label: canoa à vela @pt-pt
preferred label: canoa a vela @pt-br
preferred label: kanosejlads @dk
preferred label: 帆板 @zh-hans
preferred label: kanoseiling @no-nb
preferred label: kanosegling @no-nn
definition: A race involving a canoe equipped with a sail.
definition: Ein Rennen mit einem Kanu mit Segel @de
definition: Tävling med kanoter där kanoterna är utrustade med segel. @se
definition: Corrida de canoa com vela. @pt-pt
definition: Et løb, der involverer en kano udstyret med et sejl. @dk
definition: 有帆的独木舟比赛 @zh-hans
note: Retired. Use Media Topic canoeing + sports facet canoekayaktype
in scheme: Media Topic
created: 2009-10-22T02:00:00+00:00
retired: 2017-07-04T12:00:00+00:00
modified: 2021-05-05T12:00:00+00:00
broader: canoeing

pontoniering
type: Concept
preferred label: Pontoniering @fr
preferred label: Pontonering @se
preferred label: 军事浮桥赛艇赛 @zh-hans
preferred label: pontongiering @no-nb
definition: Team sport, military tradition, similar to canoe regatta, in boats
definition: Båtsport i lag med militära traditioner. @se
definition: Mannschaftssport in militärischer Tradition mit Booten, ähnlich der Kanuregatta @de
definition: Desporto de equipa, de tradição militar, que usa barcos semelhantes às canoas. @pt-pt
definition: Esporte de equipe, de tradição militar, que usa barcos semelhantes às canoas. @pt-br
definition: Sejlsport i hold med militære traditioner. @dk
definition: 团队运动，军事传统，类似独木舟赛舟会，在船上进行 @zh-hans
note: Retired. Use Media Topic canoeing + sports facet canoekayaktype
in scheme: Media Topic
created: 2009-10-22T02:00:00+00:00
retired: 2017-07-04T12:00:00+00:00
modified: 2021-02-18T12:00:00+00:00
broader: canoeing

ice climbing
type: Concept
preferred label: تسلق الجليد @ar
preferred label: Eisklettern @de
preferred label: Escalada en hielo @es
preferred label: Escalade glaciaire @fr
preferred label: Isklättring @se
preferred label: escalada no gelo @pt-pt
preferred label: isklatring @dk
preferred label: 攀冰 @zh-hans
definition: Klettern auf Eisflächen, wie Eisfälle und gefrorene Klippen @de
definition: Tävlingar i att ta sig uppför frusna vattenfall eller klippor där vattnet frusit. @se
definition: Climbing of ice features such as icefalls and frozen cliffs
definition: Escalar estruturas geladas, como cascatas de gelo e penhascos congelados. @pt-pt
definition: Isklatring er aktiviteten at klatre på isformationer, hvilket også kaldes fossklatring efter det norske ord for vandfald. @dk
definition: 攀爬冰瀑和被冰封冻的悬崖 @zh-hans
in scheme: Media Topic
created: 2009-10-22T02:00:00+00:00
modified: 2021-02-18T12:00:00+00:00
broader: mountain climbing
broad match: http://cv.iptc.org/newscodes/subjectcode/15016000

mountaineering
type: Concept
preferred label: Escalada alpina @es
preferred label: Alpinismus @de
preferred label: Bergsklättring @se
preferred label: تسلق الجبال @ar
preferred label: Alpinisme @fr
preferred label: montanhismo @pt-pt
preferred label: bjergbestigning @dk
preferred label: 高山攀登 @zh-hans
preferred label: alpinklatring @no-nb
definition: Competitive alpine climbing
definition: Tävlingar i att klättra uppför berg. Olika leder och svårighetsgrader. @se
definition: Bergsteigen im Hochgebirge @de
definition: Subir uma montanha com neve ou gelo. @pt-pt
definition: Konkurrencer i klatring op ad bjerge. Forskellige sværhedsgrader. @dk
definition: 登阿尔卑斯山 @zh-hans
in scheme: Media Topic
created: 2009-10-22T02:00:00+00:00
modified: 2023-10-02T12:00:00+00:00
broader: mountain climbing

icestock sport
type: Concept
preferred label: Crosse sur glace @fr
preferred label: كيرلينغ (المانيا) @ar
preferred label: Ice stock sport (curling bávaro) @es
preferred label: Isstock @se
preferred label: Eisstockschießen @de
preferred label: ice stock sport @pt-pt
preferred label: isstok @dk
preferred label: 冰上滑盘 @zh-hans
preferred label: isstokk @no-nb
definition: Similar to curling, played on targets on ice, different stones with straight handle and different rules, played in alpine countries
definition: Påminner om curling men i stället för stenar är det en platta med rakt handtag. Spelas mest i Mellaneuropa kring Alperna. @se
definition: Ähnlich dem Curling, wird auf Ziele auf dem Eis gespielt, anderer Spielstein mit geradem Stockgriff und abweichenden Regeln, vornehmlich in Alpenländern gespielt @de
definition: Jogo semelhante ao curling, disputado com pedras de pega direita e regras diferentes, geralmente praticado ao ar livre, nos países alpinos. @pt-pt
definition: Minder om curling, men i stedet for sten er det en plade med lige håndtag. Mest spillede i Centraleuropa omkring Alperne. @dk
definition: 简称冰盘，类似于冰壶，在冰上的目标，不同的有直柄的石头以及不同规则，在阿尔卑斯山周边国家流行 @zh-hans
in scheme: Media Topic
created: 2009-10-22T02:00:00+00:00
modified: 2021-02-18T12:00:00+00:00
broader: curling

artistic cycling
type: Concept
preferred label: Kunstfahren @de
preferred label: Ciclismo artístico @es
preferred label: Konstcykling @se
preferred label: دراجات @ar
preferred label: Cyclisme artistique @fr
preferred label: ciclismo artístico @pt-pt
preferred label: cykelakrobatik @dk
preferred label: 花样自行车 @zh-hans
preferred label: kunstsykling @no-nb
definition: Einzelne oder Mannschaften auf einem oder zwei Fahrrädern in einer Arena. Punkte werden durch eine Jury vergeben @de
definition: Individuell eller lagtävling där de tävlande gör olika trick som bedöms av domare. @se
definition: Individual or teams on one or two bicycles in an arena. Points are awarded by a jury.
definition: Competição, individual ou por equipas, que consiste em fazer manobras e acrobacias em bicicletas especiais, adaptadas para o efeito. Os pontos são atribuídos por um júri. @pt-pt
definition: Competição, individual ou por equipes, que consiste em fazer manobras e acrobacias em bicicletas especiais, adaptadas para o efeito. Os pontos são atribuídos por um júri. @pt-br
definition: Individuel eller holdkonkurrence, hvor deltagerne laver forskellige tricks bedømt af dommere. @dk
definition: 在竞技场上骑一或两辆自行车的个人或团队进行表演。 计分由陪审团颁发 @zh-hans
in scheme: Media Topic
created: 2009-10-22T02:00:00+00:00
modified: 2021-02-18T12:00:00+00:00
broader: cycling

bi-crossing
type: Concept
preferred label: Bi-Cross @de
preferred label: دراجات @ar
preferred label: Hinderbana @se
preferred label: Bicross @fr
preferred label: Bicicross @es
preferred label: bicross @pt-pt
preferred label: cykel forhindringsløb @dk
preferred label: 自行车障碍赛 @zh-hans
preferred label: cross-sykling @no-nb
definition: A race where competitors have to cover a circuit with obstacles as quickly as possible.
definition: Rennen, bei dem die Wettkämpfer eine Strecke mit Hindernissen so schnell wie möglich zurücklegen müssen @de
definition: Cykeltävling där de tävlande ska passera en bana med hinder så fort som möjligt @se
definition: Corrida em que os participantes têm de percorrer de bicicleta um circuito com obstáculos o mais rápido possível. @pt-pt
definition: Cykelkonkurrence, hvor konkurrenterne skal passere et spor med forhindringer så hurtigt som muligt. @dk
definition: 一种比赛，参赛者必须在赛道上尽可能快地越过障碍物 @zh-hans
note: Retired. Use Media Topic cycling + sports facet cyclingtype
in scheme: Media Topic
created: 2009-10-22T02:00:00+00:00
retired: 2017-07-04T12:00:00+00:00
modified: 2021-02-18T12:00:00+00:00
broader: cycling

bmx racing
type: Concept
preferred label: Bmx @fr
preferred label: بي ام اكس @ar
preferred label: BMX @se
preferred label: bmx @dk
preferred label: 小轮车越野赛 @zh-hans
definition: Fahrrad-Rennen in mit Inline-Start und verschiedene Hindernisse über Pisten im Gelände. @de
definition: Bicycle racing in with inline start and various obstacles over off-road circuits.
definition: Cykeltävling med en speciell typ av cykel, en så kallad BMX-cykel, som utövas på en bana liknande en motocrossbana med olika typer av hopp och doserade kurvor. @se
definition: Corrida de bicicleta com partida em linha e vários obstáculos em circuitos todo-o-terreno. @pt-pt
definition: Corrida de bicicleta com partida em linha e vários obstáculos em circuitos fora de estrada. @pt-br
definition: Cykelløb med inline-start og forskellige forhindringer i off-road terræn. @dk
definition: 小轮车在赛道内开始并经历越野赛道上的各种障碍 @zh-hans
in scheme: Media Topic
created: 2009-10-22T02:00:00+00:00
modified: 2021-07-12T12:00:00+00:00
broader: cycling
has facet: bmxfreestyletype
broad match: http://cv.iptc.org/newscodes/subjectcode/15019000

cycle ball
type: Concept
preferred label: Cykelboll @se
preferred label: كرة دراجات @ar
preferred label: Radball @de
preferred label: Bicibol (fútbol en bicicleta) @es
preferred label: Cycle balle @fr
preferred label: ciclobol @pt-pt
preferred label: cykelbold @dk
preferred label: 自行车足球赛 @zh-hans
preferred label: sykkelball @no-nb
definition: Bollsport där de tävlande sitter på cyklar och försöker flytta bollen med cykelns hjul utan att sätta ner fötterna i marken. @se
definition: Competitive team sport using bicycles. One team against another with two persons per team. The aim is for competitors to move the ball using the front and rear wheels without letting their feet touch the ground.
definition: Mannschaftswettbewerb auf Kunsträdern. Ein Radballteam spielt gegen ein anderes, bestehend aus jeweils zwei Spielern. Das Ziel der Wettkämpfer ist den Ball mit den Vorder- und Hinterrädern zu bewegen ohne mit den Füßen den Boden zu berühren @de
definition: Desporto de equipa com bicicletas. O objetivo de cada equipa de dois jogadores é mover a bola usando a roda de trás e da frente sem deixar os pés tocar o chão. @pt-pt
definition: Esporte de equipe com bicicletas. O objetivo de cada equipe de dois jogadores é mover a bola usando a roda de trás e da frente sem deixar os pés tocar o chão. @pt-br
definition: Boldsport, hvor konkurrenterne sidder på cykler og forsøger at bevæge bolden med cyklens hjul uden at sætte fødderne i jorden. @dk
definition: 自行车团体竞技项目。 一只队伍和另一支队伍对抗，每队两人。比赛的目的是在不允许选手脚接触地面的情况下，用前轮和后轮移动球比赛 @zh-hans
in scheme: Media Topic
created: 2009-10-22T02:00:00+00:00
modified: 2021-02-18T12:00:00+00:00
broader: cycling

cycle sprint race
type: Concept
preferred label: Velocidad @es
preferred label: Vitesse @fr
preferred label: سباق السرعة @ar
preferred label: Radrennen Sprint @de
preferred label: Sprint @se
preferred label: velocidade individual @pt-pt
preferred label: cykelsprint @dk
preferred label: 自行车争先赛 @zh-hans
preferred label: sykkelsprint @no-nb
definition: Två tävlande i taget kör två eller tre varv på en bana och tiden tas de sista 200 meterna. @se
definition: Rennen zwischen zwei Radfahrern über zwei oder drei Runden, mit einem gestoppten Sprint über die letzten 200 m @de
definition: Track cycling race between two cyclists over two or three laps, with a timed sprint finish over the last 200m
definition: Corrida entre dois ciclistas em 2 ou 3 voltas à pista, com um *sprint* final cronometrado nos últimos 200m. @pt-pt
definition: To konkurrenter ad gangen kører to eller tre omgange på en cykelbane, og tiden tages de sidste 200 meter. @dk
definition: 赛道自行车比赛。2人骑行2或3圈。最后200米计冲刺时计时决定胜负 @zh-hans
note: Retired. Use Media Topic cycling + sports facet racetype
in scheme: Media Topic
created: 2009-10-22T02:00:00+00:00
retired: 2017-07-04T12:00:00+00:00
modified: 2021-02-18T12:00:00+00:00
broader: cycling

cyclo-cross
type: Concept
preferred label: Ciclocross @es
preferred label: Querfeldein/Cross @de
preferred label: Cykelcross @se
preferred label: Cyclo-cross @fr
preferred label: سايكلوكروس @ar
preferred label: ciclocrosse @pt-pt
preferred label: cyclocross @pt-br
preferred label: cykelcross @dk
preferred label: 自行车越野赛 @zh-hans
preferred label: sykkelcross @no-nb
definition: Ausgetragen auf unterschiedlichen Oberflächen - Erde, Grass, Sand oder Asphalt @de
definition: Staged on various surfaces - earth, grass, sand or tarmac.
definition: Cykeltävling på bana där flera varv körs. Banan ska ha olika typer av terräng och lutning och även ha en betydande del hinder där cyklisten måste bära cykeln. @se
definition: Ciclismo praticado por etapas em várias superfícies (terra, lama, areia e estrada), com obstáculos naturais ou artificiais. @pt-pt
definition: Cykelkonkurrence på bane, hvor der køres flere omgange. Banen skal have forskellige typer terræn og hældning og også have et betydeligt antal forhindringer, hvor cyklisten skal bære cyklen. @dk
definition: 多种路面分段进行的自行车比赛，包括土路、草地、沙路和沥青路面 @zh-hans
note: Retired. Use Media Topic cycling + sports facet cyclingtype
in scheme: Media Topic
created: 2009-10-22T02:00:00+00:00
retired: 2017-07-04T12:00:00+00:00
modified: 2021-02-18T12:00:00+00:00
broader: cycling

individual pursuit (cycling)
type: Concept
preferred label: Poursuite individuelle @fr
preferred label: Persecución individual @es
preferred label: Förföljelselopp, individuellt @se
preferred label: مطاردة فردية @ar
preferred label: Einzelverfolgung (Radsport) @de
preferred label: perseguição individual (ciclismo) @pt-pt
preferred label: individuelt forfølgelsesløb @dk
preferred label: 个人追逐赛 @zh-hans
preferred label: forfølgelsesritt (sykling) @no-nb
preferred label: forfølgingsritt @no-nn
definition: Track cycling event where two cyclists set off from midway down opposite straights and try to make up the gap between them
definition: Tävlande startar på motsatt sida av rundbanan. Om någon hinner ikapp motståndaren är loppet slut, annars vinner bästa tid. @se
definition: Zwei Radfahrer oder Teams starten von zwei Seiten gegenüber und versuchen die Lücke zwischen sich aufzuholen @de
definition: Dois ciclistas partem de pontos médios opostos de uma pista e tentam recuperar a distância entre eles. @pt-pt
definition: Konkurrenterne starter på hver sin side af cykelbanen. Hvis nogen henter modstanderen, er løbet forbi, ellers vinder den bedste tid. @dk
definition: 两名选手各自从对面赛道直道的中间位置出发，努力缩短与对方间距的赛道自行车赛 @zh-hans
note: Retired. Use Media Topic cycling +sports facets racetype + teamsize
in scheme: Media Topic
created: 2009-10-22T02:00:00+00:00
retired: 2017-07-04T12:00:00+00:00
modified: 2021-02-18T12:00:00+00:00
broader: cycling

individual time trial (cycling)
type: Concept
preferred label: Zeitfahren Einzel (Radsport) @de
preferred label: Contre-la-montre individuel @fr
preferred label: Carrera individual contrarrreloj @es
preferred label: فردي حواجز ضد الساعة @ar
preferred label: Termpolopp @se
preferred label: contrarrelógio individual (ciclismo) @pt-pt
preferred label: contra o relógio individual (ciclismo) @pt-br
preferred label: tidskørsel @dk
preferred label: 个人计时赛 @zh-hans
preferred label: temporitt (sykling) @no-nb
preferred label: temporitt @no-nn
definition: En tävlingsform där de deltagande cyklisterna startar med ett visst tidsintervall för att i kamp mot klockan tillryggalägga en sträcka som är kortare än vid linjelopp. Den cyklist som vid målgång förbrukat minst tid blir vinnare. @se
definition: Rennen oder eine Etappe gegen die Uhr, bei dem jeder Fahrer einzeln gestartet wird @de
definition: A race or stage against the clock with each cyclist setting off individually
definition: Corrida ou etapa em que cada ciclista sai individualmente da linha de partida e corre contra o relógio. @pt-pt
definition: Et løb eller etape, hvor hver cyklist starter individuelt eller som hold, mod uret. @dk
definition: 每个骑车人单独计时的比赛或分段赛，根据计时判定胜负 @zh-hans
note: Retired. Use Media Topic cycling + sports facets racetype + teamsize
in scheme: Media Topic
created: 2009-10-22T02:00:00+00:00
retired: 2017-07-04T12:00:00+00:00
modified: 2021-02-18T12:00:00+00:00
broader: cycling

كيرين
type: Concept
preferred label: Keirin
preferred label: keirin @pt-pt
preferred label: 自行车凯林赛 @zh-hans
definition: Sprint zwischen sechs Radfahrern, bei dem ein Tempomacher auf einem Moped das Tempo über die ersten 1400 m beschleunigt. Wenn der Tempomacher die Bahn verlässt, entwickelt sich das Rennen zu einem Endspurt über die letzten 6-700 Meter @de
definition: De tävlande startar bakom en apparat som håller farten och sakta ökar den. Med några hundra meter kvar kör farthållaren undan och loppet avgörs i en spurt. @se
definition: Sprint between six cyclists where a pacemaker on a moped gradually increases the pace over the first 1400m. When the pacemaker leaves the track the race develops into a sprint finish over the final 6-700m.
definition: Corrida de velocidade de 6 ciclistas em pista de velódromo. Os ciclistas seguem atrás de um motociclista que aumenta gradualmente a velocidade nos primeiros 1400 m. Quando ele abandona a pista, ocorre o *sprint* final. @pt-pt
definition: Sprint mellem seks cyklister, hvor en pacer på en knallert gradvist øger tempoet i løbet af de første 1400 meter. Når paceren forlader banen, udvikles løbet til en sprintfinale over den sidste 6-700 meter. @dk
definition: 在前1400米的比赛中，骑在助力车上的领骑者逐渐加快速度，六名骑手竞相在赛道上冲刺争先。 在最后6-700米处，当领骑者离开赛道时，比赛发展成最终冲刺 @zh-hans
note: Retired. Use Media Topic cycling + sports facet cyclingtype
in scheme: Media Topic
created: 2009-10-22T02:00:00+00:00
retired: 2017-07-04T12:00:00+00:00
modified: 2021-02-18T12:00:00+00:00
broader: cycling

Madison race
type: Concept
preferred label: Madison Race @de
preferred label: Madison @se
preferred label: سباق ماديسون @ar
preferred label: Carrera Madison @es
preferred label: Course à l'Américaine @fr
preferred label: madison @pt-pt
preferred label: parløb @dk
preferred label: 双人自行车接力赛 @zh-hans
definition: Punkterennen mit Teams von zwei Radfahrern als Staffel @de
definition: A points race by teams comprising two cyclists in relay-format
definition: Partävling där de två cyklisterna turas om att cykla fort medan den andra vilar cyklande ovanför en markerad linje. Under loppet är det inlagda sprinter som ger bonuspoäng. @se
definition: Corrida de pontos por equipas compostas por 2 ciclistas que se revezam. @pt-pt
definition: Corrida de pontos por equipes compostas por 2 ciclistas que se revezam. @pt-br
definition: Et pointløb af hold bestående af to cyklister. Den ene rytter konkurrerer mod de øvrige deltagere, mens den anden rytter kører langsomt rundt indtil der afløses. @dk
definition: 由两名自行车选手组成的以接力形式进行的积分竞赛，也称麦迪逊赛 @zh-hans
note: Retired. Use Media Topic cycling + sports facet cyclingtype
in scheme: Media Topic
created: 2009-10-22T02:00:00+00:00
retired: 2017-07-04T12:00:00+00:00
modified: 2021-02-18T12:00:00+00:00
broader: cycling

mountain biking
type: Concept
preferred label: دراجات جبلية @ar
preferred label: Mountainbiken @de
preferred label: VTT @fr
preferred label: Bicicleta de montaña @es
preferred label: Mountainbike @se
preferred label: ciclismo de montanha @pt-pt
preferred label: mountainbike @dk
preferred label: 山地自行车赛 @zh-hans
preferred label: stisykling @no-nb
definition: Terrängcykling med speciella cyklar, bygger på uthållighet. @se
definition: Radfahren im Gelände erfordert Ausdauer und speziell angepasste Mountainbikes @de
definition: All-terrain, off-road bicycle riding requiring endurance and specially adapted mountain bikes
definition: Corrida de bicicleta todo-o-terreno que requer resistência e bicicletas de montanha especialmente adaptadas. @pt-pt
definition: Corrida de bicicleta fora de estrada que requer resistência e bicicletas de montanha especialmente adaptadas. @pt-br
definition: Terræn, off-road cykeltur, der kræver udholdenhed og specielt tilpassede mountainbikes. @dk
definition: 使用专门改装的，高耐受力的山地自行车进行的全地形越野自行车赛 @zh-hans
in scheme: Media Topic
created: 2009-10-22T02:00:00+00:00
modified: 2021-02-18T12:00:00+00:00
broader: cycling
has facet: mountainbikingtype
broad match: http://cv.iptc.org/newscodes/subjectcode/15019015

points race (cycling)
type: Concept
preferred label: Poängrace @se
preferred label: Course aux points @fr
preferred label: سباق النقاط @ar
preferred label: Carrera por puntos @es
preferred label: Punkterennen (Radsport) @de
preferred label: corrida por pontos (ciclismo) @pt-pt
preferred label: pointløb @dk
preferred label: 自行车计分赛 @zh-hans
preferred label: poengløp (sykling) @no-nb
preferred label: poengløp sykkel @no-nn
definition: Masstartslopp där cyklisterna samlar poäng i de regelbundna spurterna. Man kan även få poäng genom att varva klungan. @se
definition: Cyclists aim to complete the highest number of laps. Bonus points are picked up in intermediate sprints held every 2500m
definition: Radfahrer die die höchste Anzahl an Runden zu erreichen versuchen. Sonderpunkte sind möglich durch Zwischensprints alle 2500 Meter @de
definition: Os ciclistas tentam completar o maior número de voltas. São atribuídos pontos extra em *sprints* intermédios a cada 2500 m. @pt-pt
definition: Cyklister sigter mod at gennemføre det højeste antal omgange. Bonuspoint samles i mellemliggende sprints, der afholdes hver 2500 meter. @dk
definition: 骑车者的目标是完成最多圈数。 每2500米进行一次中间冲刺，可获得奖励积分 @zh-hans
note: Retired. Use Media Topic cycling + sports facet cyclingtype
in scheme: Media Topic
created: 2009-10-22T02:00:00+00:00
retired: 2017-07-04T12:00:00+00:00
modified: 2021-02-18T12:00:00+00:00
broader: cycling

road cycling
type: Concept
preferred label: Straßenrennen @de
preferred label: جري @ar
preferred label: Course en ligne @fr
preferred label: Landsvägscykling @se
preferred label: Prueba de ruta @es
preferred label: ciclismo de estrada @pt-pt
preferred label: landevejscykling @dk
preferred label: 公路自行车赛 @zh-hans
preferred label: landeveisritt (sykling) @no-nb
preferred label: landevegsritt @no-nn
definition: Road race with all competitors starting en masse.
definition: Straßenrennen bei dem alle Wettkämpfer in der Masse starten @de
definition: Cykeltävling på landsväg med masstart. @se
definition: Corrida de estrada em que os ciclistas partem todos ao mesmo tempo. @pt-pt
definition: Cykelløb på landevej med massestart. @dk
definition: 所有选手同时出发的公路自行车比赛 @zh-hans
note: Retired. Use Media Topic cycling + sports facet cyclingtype
in scheme: Media Topic
created: 2009-10-22T02:00:00+00:00
retired: 2017-07-04T12:00:00+00:00
modified: 2024-07-01T12:00:00+00:00
broader: cycling

cycling staging race
type: Concept
preferred label: Etapplopp @se
preferred label: Course à étapes @fr
preferred label: سباق دراجات على الطريق @ar
preferred label: Etappenrennen @de
preferred label: Carrera por etapas @es
preferred label: corrida por etapas @pt-pt
preferred label: etapeløb @dk
preferred label: 自行车分段赛 @zh-hans
preferred label: etapperitt (sykling) @no-nb
preferred label: etapperitt @no-nn
definition: Cykeltävlingar som avgörs över ett antal etapper under flera dagar. Tiderna adderas från varje dags tävling och den som har lägst tid när alla etapper körts vinner. @se
definition: Race disputed by teams with the classifications determined by the combined times over a day
definition: Rennen, was in Teams stattfindet, die sich qualifizieren über die Kombination der Zeiten eines Tages @de
definition: Corrida disputada por equipas em que as classificações são determinadas pelos resultados combinados de cada dia. @pt-pt
definition: Corrida disputada por equipes em que as classificações são determinadas pelos resultados combinados de cada dia. @pt-br
definition: Cykelkonkurrencer, der afgøres over en række etaper over flere dage. Tiderne tilføjes fra hver dags konkurrence, og den, der har den laveste tid, når alle etaper køres, vinder. @dk
definition: 集体自行车竞技比赛。根据一天之内每队合计完成时间分级计算胜负 @zh-hans
note: Retired. Use Media Topic cycling + sports facet racetype
in scheme: Media Topic
created: 2009-10-22T02:00:00+00:00
retired: 2017-07-04T12:00:00+00:00
modified: 2021-05-05T12:00:00+00:00
broader: cycling

team cycle sprint
type: Concept
preferred label: Sprint Team @de
preferred label: سباق السرعة للفرق @ar
preferred label: Vitesse par équipes @fr
preferred label: Lagsprint @se
preferred label: Velocidad por equipos @es
preferred label: velocidade por equipas @pt-pt
preferred label: velocidade por equipes @pt-br
preferred label: holdsprint @dk
preferred label: 团体竞速赛 @zh-hans
preferred label: lagsprint sykkel @no-nb
definition: Bahnrundenrennen, bei dem zwei Teams gegeneinander antreten, beginnend auf gegenüberliegenden Seiten der Bahn, nach der ersten Runde zieht der erste Fahrer weg, während der zweite Fahrer in die nächste Runde geht, das gleiche in der letzten Runde, so dass der dritte Fahrer das Rennen beendet. Das Team mit der schnellsten Zeit gewinnt. @de
definition: Cykeltävling på bana där lagen åker i en rak formation efter varandra, på vardera sida av velodromen. Varje förare i ett lag åker ett varv längst fram för att sedan köra ut mot sidan. Inför det sista varvet åker den siste föraren i vardera lag ensam in mot sin mållinje. @se
definition: A track race where two teams race against each other, starting on opposite sides of the track, following the first lap the first rider pulls away, leaving the second rider to lead the next lap, who then does the same at the last lap, leaving the third rider to finish the race. The team with the fastest time is the winner.
definition: Corrida de bicicleta em que duas equipas competem uma contra a outra, começando em lados opostos da pista. Após a primeira volta, o primeiro ciclista afasta-se, deixando o segundo ciclista liderar a próxima volta, que então faz o mesmo na última volta, com o terceiro ciclista a terminar a corrida. A equipa com o tempo mais rápido é a vencedora. @pt-pt
definition: Corrida de bicicleta em que duas equipes competem uma contra a outra, começando em lados opostos da pista. Após a primeira volta, o primeiro ciclista se afasta, deixando o segundo ciclista liderar a próxima volta, que então faz o mesmo na última volta, com o terceiro ciclista a terminar a corrida. A equipe com o tempo mais rápido é a vencedora. @pt-br
definition: Et baneløb, hvor to hold kæmper mod hinanden, startende på modsatte sider af banen. Efter den første omgang, trækker den første rytter væk, hvilket efterlader den anden rytter til at føre, der derefter gør det samme på den sidste omgang og forlader den tredje rytter, der afslutter løbet. Holdet med den hurtigste tid er vinderen @dk
definition: 一种赛道比赛，两个队分别从赛道的两边开始相互比赛，第一个车手领骑第一圈后离场，然后让第二个车手领骑接下来的比赛，第二个车手在最后一圈离场，最后由第三个车手完成比赛。时间最快的队获胜 @zh-hans
note: Retired. Use Media Topic cycling + sports facet cyclingtype
in scheme: Media Topic
created: 2009-10-22T02:00:00+00:00
retired: 2017-07-04T12:00:00+00:00
modified: 2021-02-18T12:00:00+00:00
broader: cycling
broad match: http://cv.iptc.org/newscodes/subjectcode/15019000

road cycling team pursuit
type: Concept
preferred label: Förföljelselopp, lag @se
preferred label: Poursuite par équipes @fr
preferred label: Persecución por equipos @es
preferred label: Mannschaftsverfolgung @de
preferred label: سباق المتابعة للفرق @ar
preferred label: perseguição por equipas @pt-pt
preferred label: perseguição por equipes @pt-br
preferred label: holdforfølgelsesløb @dk
preferred label: 团体追逐赛 @zh-hans
preferred label: forfølgesesritt, lag (sykling) @no-nb
preferred label: forfølgingsritt sykkel, lag @no-nn
definition: Tävlande lag startar på motsatt sida av rundbanan. Om något lag hinner ikapp motståndarlaget är loppet slut, annars vinner bästa tid. @se
definition: Bahnrundenrennen, bei der zwei Mannschaften aus der Mitte aus nach unten gegenüber Geraden setzen und versuchen, die Lücke zwischen ihnen zu verringern @de
definition: Track cycle event where two teams set off from midway down opposite straights and try to make up the gap between them
definition: Duas equipas partem de pontos médios opostos de uma pista e tentam recuperar a distância entre elas. @pt-pt
definition: Duas equipes partem de pontos médios opostos de uma pista e tentam recuperar a distância entre elas. @pt-br
definition: Konkurrenterne starter på den modsatte side af den runde bane. Hvis nogen den ene modstanderen, er løbet forbi, ellers vinder den bedste tid. @dk
definition: 两队选手在赛道对面直道的中间位置出发，努力缩短与对方间距的自行车追逐比赛 @zh-hans
note: Retired. Use Media Topic cycling + sports facets racetype + teamsize.
in scheme: Media Topic
created: 2009-10-22T02:00:00+00:00
retired: 2017-07-04T12:00:00+00:00
modified: 2021-02-18T12:00:00+00:00
broader: cycling
broad match: http://cv.iptc.org/newscodes/subjectcode/15019000

team time trial (cycling)
type: Concept
preferred label: Zeitfahren Team (Radsport) @de
preferred label: Contre-la-montre par équipes @fr
preferred label: Contrarreloj por equipos @es
preferred label: سباق ضد الساعة للفرق @ar
preferred label: Lagtempolopp @se
preferred label: contrarrelógio por equipas (ciclismo) @pt-pt
preferred label: contra o relógio por equipes (ciclismo) @pt-br
preferred label: holdtidskørsel @dk
preferred label: 团体计时赛 @zh-hans
preferred label: lagtempo sykkel @no-nb
definition: En tävlingsform där de deltagande lagen startar med ett visst tidsintervall för att i kamp mot klockan tillryggalägga en sträcka som är kortare än vid linjelopp. Det lag som vid målgång förbrukat minst tid blir vinnare. @se
definition: Teams of cyclists race against the clock
definition: Teams von Radfahrer starten gegen die Uhr @de
definition: Equipas de ciclistas saem da linha de partida a intervalos regulares e correm contra o relógio. @pt-pt
definition: Equipes de ciclistas saem da linha de partida a intervalos regulares e correm contra o relógio. @pt-br
definition: Hold af cyklister kæmper mod uret. @dk
definition: 自行车团体计时比赛 @zh-hans
note: Retired. Use Media Topic cycling + sports facets racetype + teamsize.
in scheme: Media Topic
created: 2009-10-22T02:00:00+00:00
retired: 2017-07-04T12:00:00+00:00
modified: 2021-02-18T12:00:00+00:00
broader: cycling
broad match: http://cv.iptc.org/newscodes/subjectcode/15019000

track race (cycling)
type: Concept
preferred label: Bahnradsport (Radsport) @de
preferred label: Ciclismo en pista @es
preferred label: Bancykel @se
preferred label: سباق المضمار @ar
preferred label: Cyclisme sur piste @fr
preferred label: pista (ciclismo) @pt-pt
preferred label: banecykling @dk
preferred label: 赛车场自行车赛 @zh-hans
preferred label: banesykling @no-nb
definition: Cykeltävling på en oval bana som är kraftigt doserad och medger hög fart även i kurvorna. @se
definition: A race staged on a track in a velodrome
definition: Ein Rennen auf einer Strecke in einem Velodrom @de
definition: Corrida de bicicleta em pista de velódromo. @pt-pt
definition: Et løb iscenesat på en bane i en velodrome. @dk
definition: 自行车赛车场赛道上进行的比赛 @zh-hans
note: Retired. Use Media Topic cycling + sports facet cyclingtype
in scheme: Media Topic
created: 2009-10-22T02:00:00+00:00
retired: 2017-07-04T12:00:00+00:00
modified: 2021-02-18T12:00:00+00:00
broader: cycling

bmx freestyle
type: Concept
preferred label: BMX freestyle @se
preferred label: bmx fristil @no-nn
preferred label: BMX Freestyle @fr
preferred label: بي ام اكس @ar
definition: Riders are given a fixed time to perform acrobatics tricks and skills, with tricks scored on multiple aspects including difficulty, originality, execution, height and creativity
definition: Die Fahrer haben eine festgelegte Zeit, um akrobatische Tricks und Fertigkeiten vorzuführen, wobei die Tricks nach verschiedenen Aspekten wie Schwierigkeit, Originalität, Ausführung, Höhe und Kreativität bewertet werden. @de
in scheme: Media Topic
created: 2021-07-12T12:00:00+00:00
modified: 2024-03-28T12:00:00+00:00
broader: cycling

breaking (breakdance)
type: Concept
preferred label: Breaking @se
preferred label: Breakdance @de
definition: Dancing competition featuring an urban dance style that originated in the United States in the 1970s with roots in hip-hop culture and characterised by acrobatic movements, stylised footwork, and the key role played by the DJ and the MC during battles
definition: Dancing competition featuring an urban dance style that originated in the United States in the 1970s with roots in hip-hop culture and characterized by acrobatic movements, stylized footwork, and the key role played by the DJ and the MC during battles
definition: Tävlingsdans med ursprung i breakdance @se
definition: Tanzwettbewerb mit einem urbanen Tanzstil, der in den 1970er Jahren in den Vereinigten Staaten entstand, seine Wurzeln in der Hip-Hop-Kultur hat und durch akrobatische Bewegungen, stilisierte Fußarbeit und die Schlüsselrolle des DJs und des MCs während der Battles gekennzeichnet ist @de
in scheme: Media Topic
created: 2024-05-09T12:00:00+00:00
modified: 2024-05-09T12:00:00+00:00
broader: competitive dancing

platform diving
type: Concept
preferred label: Plattform @de
preferred label: الغطس من لوح ثابت @ar
preferred label: Salto de plataforma @es
preferred label: Plongeon plate-forme @fr
preferred label: Höga hopp @se
preferred label: saltos de plataforma @pt-pt
preferred label: udspring fra platform @dk
preferred label: 跳台跳水 @zh-hans
preferred label: tårnstup @no-nb
preferred label: tårnstuping @no-nn
definition: Divers take off from a high platform
definition: Sprung von einer hohen Plattform @de
definition: Simhopp från hög höjd, vanligen 10 meter. @se
definition: Os atletas saltam para a água de uma plataforma fixa elevada. @pt-pt
definition: Dykkere springer fra en høj platform. @dk
definition: 在高的跳台上进行的跳水项目 @zh-hans
in scheme: Media Topic
created: 2009-10-22T02:00:00+00:00
modified: 2021-02-18T12:00:00+00:00
broader: diving
has facet: platformheight
broad match: http://cv.iptc.org/newscodes/subjectcode/15021000

springboard diving
type: Concept
preferred label: الغطس من لوح متحرك @ar
preferred label: Salto de trampolín @es
preferred label: Sprungbrett @de
preferred label: Svikthopp @se
preferred label: Plongeon tremplin @fr
preferred label: saltos de trampolim @pt-pt
preferred label: udspring fra vippe @dk
preferred label: 跳板跳水 @zh-hans
preferred label: sviktstup @no-nb
preferred label: sviktstuping @no-nn
definition: Sprung von einem hohen Sprungbrett @de
definition: Divers dive from a high springboard.
definition: Simhopp från trampolin, vanligen från 1, 3 eller 5 meters höjd. @se
definition: Os atletas saltam para a água de um trampolim elevado. @pt-pt
definition: Dykkere springer fra vippe. @dk
definition: 在强反弹板上进行的跳水项目 @zh-hans
in scheme: Media Topic
created: 2009-10-22T02:00:00+00:00
modified: 2021-02-18T12:00:00+00:00
broader: diving
has facet: platformheight
broad match: http://cv.iptc.org/newscodes/subjectcode/15021000

synchronised diving
type: Concept
preferred label: Synchronspringen Plattform @de
preferred label: Plongeon synchronisé @fr
preferred label: غطس متزامن @ar
preferred label: Salto sincronizado @es
preferred label: Synkro @se
preferred label: saltos para a água sincronizados @pt-pt
preferred label: saltos ornamentais sincronizados @pt-br
preferred label: synkronudspring @dk
preferred label: 双人跳水 @zh-hans
preferred label: synkronstup @no-nb
preferred label: synchronized diving
preferred label: synkronstuping @no-nn
definition: Zwei Wettkämpfer des gleichen Teams starten gleich oder unterschiedlich hohen Plattformen. Sie werden zusätzlich zu den Standard-Kriterien auch noch in Synchronisation bewertet @de
definition: Two competitors from the same team dive off at the same time from separate platforms or springboards. As well as being judged on the standard criteria they are also awarded marks for synchronisation.
definition: Två tävlande hoppar från varsin plats och försöker göra samma hopp samtidigt. Poäng både för hoppets utförande och synkroniseringen. @se
definition: Dois atletas da mesma equipa saltam simultaneamente para a água de plataformas ou trampolins separados. Além dos critérios padrão, eles também são avaliados pela sincronização. @pt-pt
definition: Dois atletas da mesma equipe saltam simultaneamente para a água de plataformas ou trampolins separados. Além dos critérios padrão, eles também são avaliados pela sincronização. @pt-br
definition: To deltagere springer fra hvert sit sted og forsøger, at lave det samme hop synkront. Point for både udførelse af springet og synkroniseringen. @dk
definition: 来自同一团队的两名参赛者同时从不同的跳台或跳板上跳水。 评分标准除了跳水动作本身，还包括选手之间的同步情况 @zh-hans
definition: Two competitors from the same team dive off at the same time from separate platforms or springboards. As well as being judged on the standard criteria they are also awarded marks for synchronization.
in scheme: Media Topic
created: 2009-10-22T02:00:00+00:00
modified: 2021-02-18T12:00:00+00:00
broader: diving
broad match: http://cv.iptc.org/newscodes/subjectcode/15021004
has facet: platformheight

oval track dog racing
type: Concept
preferred label: Hunderennen Verfolgung @de
preferred label: Carreras de galgos @es
preferred label: Hundkapplöpning @se
preferred label: Course de lévriers @fr
preferred label: مضمار بيضوي @ar
preferred label: pista oval @pt-pt
preferred label: hundevæddeløb @dk
preferred label: 椭圆赛道赛狗 @zh-hans
preferred label: hundeveddeløp @no-nb
definition: Tävlingslopp där hundar jagar en artificiell kanin runt en oval bana. @se
definition: Pursuing an artificial rabbit around an oval track
definition: Verfolgungsrennen hinter einem falschen Hasen auf einem ovalen Rundkurs @de
definition: Corrida de cães perseguindo uma lebre artificial à volta de uma pista oval. @pt-pt
definition: Konkurrenceløb, hvor hunde jager en kunstig kanin omkring en oval bane. @dk
definition: 在椭圆形赛道上追逐人工兔子 @zh-hans
note: Retired. Use Media Topic dog racing+ sports facet dogracingtype
in scheme: Media Topic
created: 2009-10-22T02:00:00+00:00
retired: 2017-07-04T12:00:00+00:00
modified: 2021-02-18T12:00:00+00:00
broader: dog racing

dog sled racing
type: Concept
preferred label: Course de chiens de traîneaux @fr
preferred label: Carreras de perros de trineo @es
preferred label: زلاجات كلاب @ar
preferred label: Schlittenhunderennen @de
preferred label: Draghundsport @se
preferred label: corrida de trenó com cães @pt-pt
preferred label: hundeslædeløb @dk
preferred label: 狗拉雪橇赛 @zh-hans
preferred label: hundekjøring @no-nb
preferred label: hundekøyring @no-nn
definition: Vor einen Schlitten gespannt @de
definition: Race with dogs harnessed to a sled
definition: Tävlingslopp där hundar drar en släde. @se
definition: Corrida de cães atrelados a um trenó. @pt-pt
definition: Konkurrenceløb, hvor hunde trækker en slæde. @dk
definition: 狗拉着雪橇进行的赛跑 @zh-hans
note: Retired. Use Media Topic dog racing+ sports facet dogracingtype
in scheme: Media Topic
created: 2009-10-22T02:00:00+00:00
retired: 2017-07-04T12:00:00+00:00
modified: 2021-02-18T12:00:00+00:00
broader: dog racing

cross-country horse riding
type: Concept
preferred label: سباق الضواحي @ar
preferred label: Cross-country à cheval @fr
preferred label: Terrängritt @se
preferred label: Geländeritt @de
preferred label: Cross-country a caballo @es
preferred label: cross-country @pt-pt
preferred label: terrænridning @dk
preferred label: 越野马术 @zh-hans
preferred label: terrengritt @no-nb
definition: Equestrian event held on a designated circuit in the countryside featuring artificial and natural obstacles.
definition: Pferdesport-Ereignis in einem markierten Gelände im Freien mit natürlichen und künstlichen Hindernissen @de
definition: Hästtävling på en bana i naturen där det finns både naturliga och konstruerade hinder. @se
definition: Prova do concurso completo. Evento equestre realizado em circuito de campo, com obstáculos naturais e artificiais. @pt-pt
definition: Hestevæddeløb på en bane i naturen, hvor der er både naturlige og konstruerede forhindringer. @dk
definition: 在乡村指定赛道上举行的马术比赛，包括人工和天然障碍的回转场地进行的马术比赛 @zh-hans
note: Retired. Use Media Topic equestrianism + sports facet equestriantype.
in scheme: Media Topic
created: 2009-10-22T02:00:00+00:00
retired: 2017-07-04T12:00:00+00:00
modified: 2021-05-05T12:00:00+00:00
broader: equestrian

dressage
type: Concept
preferred label: Dressur @de
preferred label: Dressage @fr
preferred label: Adiestramiento de caballos @es
preferred label: Dressyr @se
preferred label: سباق الترويض @ar
preferred label: adestramento @pt-br
preferred label: dressur @dk
preferred label: 盛装舞步 @zh-hans
preferred label: dressurridning @no-nb
preferred label: dressurriding @no-nn
definition: Der Reiter wird bewertet in einer Reihe von Figuren in drei verschiedenen Gangarten - Schritt, Trab und Gallopp @de
definition: Hästtävling där olika rörelser ska utföras på en bana och sedan bedömas av domare. @se
definition: A rider is judged on a series of moves at three different paces - walk, trot and gallop.
definition: Prova do concurso completo. O cavaleiro é avaliado por uma série de figuras ou movimentos que o cavalo tem de executar em três velocidades: passo, trote e galope. @pt-pt
definition: Hestekonkurrence, hvor forskellige bevægelser skal udføres på en bane og derefter bedømmes af dommere. @dk
definition: 根据骑士在马匹不同速度下的动作进行评判。包括行走，慢跑，快跑 @zh-hans
note: Retired. Use Media Topic equestrianism + sports facet equestriantype.
in scheme: Media Topic
created: 2009-10-22T02:00:00+00:00
retired: 2017-07-04T12:00:00+00:00
modified: 2021-02-18T12:00:00+00:00
broader: equestrian

horse jumping
type: Concept
preferred label: Hästhoppning @se
preferred label: Salto de obstáculos @es
preferred label: Springreiten @de
preferred label: Saut d'obstacles @fr
preferred label: قفز الحواجز @ar
preferred label: saltos @pt-pt
preferred label: ridebanespringning @dk
preferred label: 马术障碍赛 @zh-hans
preferred label: sprangridning @no-nb
preferred label: sprangriding @no-nn
definition: A rider and horse attempt to jump a series of obstacles in an enclosed arena against the clock.
definition: Hästtävling i en arena där det finns ett antal hinder med olika svårighet. Det gäller att klara banan på så kort tid som möjligt, men om det sker rivningar så ger det tidstillägg. @se
definition: Reiter und Pferd versuchen auf Zeit verschiedene Hindernisse zu überspringen in einer geschlossenen Arena @de
definition: Prova do concurso completo. Cavaleiro e cavalo têm de saltar uma série de obstáculos, no menor tempo possível, em área delimitada. @pt-pt
definition: En rytter og hest forsøger at hoppe over en række forhindringer i en lukket arena mod uret. @dk
definition: 骑手在封闭场地内骑马跨越一系列障碍的比赛，按用时定胜负 @zh-hans
note: Retired. Use Media Topic equestrianism + sports facet equestriantype.
in scheme: Media Topic
created: 2009-10-22T02:00:00+00:00
retired: 2017-07-04T12:00:00+00:00
modified: 2021-02-18T12:00:00+00:00
broader: equestrian

three day eventing
type: Concept
preferred label: Vielseitigkeit @de
preferred label: Fälttävlan @se
preferred label: Concours complet @fr
preferred label: فروسية الثلاثة ايام @ar
preferred label: Evento de tres días-completo @es
preferred label: concurso completo de equitação (CCE) @pt-pt
preferred label: military @dk
preferred label: 三日赛 @zh-hans
preferred label: feltritt @no-nb
definition: Kombinationstävling med häst och ryttare. Grenarna är dressyr, fältritt och hoppning. @se
definition: Pferdesport-Ereignis mit drei Disziplinen - Dressur, Geländeritt und Springen @de
definition: Equestrian event involving three disciplines - Dressage, cross-country and show jumping
definition: Evento equestre que envolve três disciplinas: dressage, cross-country e concurso de saltos. @pt-pt
definition: Evento equestre que envolve três disciplinas: adestramento, cross-country e concurso de saltos. @pt-br
definition: Kombinationskonkurrence med hest og rytter. Grenerne er dressur, udholdenhed, og ridebanespring. @dk
definition: 马术比赛。包括3个单项，盛装舞步，越野和障碍赛 @zh-hans
note: Retired. Use Media Topic equestrianism + sports facet equestriantype.
in scheme: Media Topic
created: 2009-10-22T02:00:00+00:00
retired: 2017-07-04T12:00:00+00:00
modified: 2021-02-18T12:00:00+00:00
broader: equestrian

horse driving
type: Concept
preferred label: Attelage @fr
preferred label: القيادة @ar
preferred label: Fahrsport @de
preferred label: Sportkörning @se
preferred label: Atelaje @es
preferred label: atrelagem @pt-pt
preferred label: hestevognskørsel @dk
preferred label: 驾驭马车比赛 @zh-hans
preferred label: travsport @no-nb
definition: Pferdesport Veranstaltungen mit Pferden in Trapez, bei dem einzelne Fahrzeuge einen Kurs fahren @de
definition: Hästtävling där ett ekipage med en eller flera hästar ska ta sig runt en hinderbana i en arena. @se
definition: Equestrian events involving horses being driven in harness, single vehicle around a course.
definition: Eventos equestres em que cavalos atrelados a um veículo são conduzidos por um percurso. @pt-pt
definition: Hestekonkurrence, hvor en ekvipager med en eller flere heste kommer rundt på en forhindringsbane i en arena. @dk
definition: 驾驶配有马具的单匹马车沿赛道进行的比赛 @zh-hans
note: Retired. Use Media Topic equestrianism + sports facet equestriantype.
in scheme: Media Topic
created: 2009-10-22T02:00:00+00:00
retired: 2017-07-04T12:00:00+00:00
modified: 2021-02-18T12:00:00+00:00
broader: equestrian
broad match: http://cv.iptc.org/newscodes/subjectcode/15022000

epee
type: Concept
preferred label: Épée @fr
preferred label: Värja @se
preferred label: Espada @es
preferred label: السيف @ar
preferred label: Degen @de
preferred label: espada @pt-pt
preferred label: kårde @dk
preferred label: 重剑 @zh-hans
preferred label: kårdefekting @no-nb
definition: Category of fencing using a weapon with a triangular cross-section blade and a large bell guard
definition: Kategorie des Fechtens mit einer Waffe, die aus einer dreieckigen Querschnittklinge besteht und einem kleinen Korbschutz (Glocke) besteht @de
definition: Värja är den tyngsta och största av fäktredskapen, bladet är trekantigt och man försöker träffa motståndaren genom att stöta värjan framåt. @se
definition: Categoria de esgrima que usa uma arma com lâmina rígida e triangular, dotada de empunhadura com guarda-mão grande. @pt-pt
definition: Kårde er det tyngste og største af våbene, bladet er trekantet, og du prøver at ramme modstanderen ved at skubbe kården fremad. @dk
definition: 使用具有三角形横截面剑身和大型钟罩护手的击剑类别 @zh-hans
note: Retired. Use Media Topic fencing + sports facet fencingtype.
in scheme: Media Topic
created: 2009-10-22T02:00:00+00:00
retired: 2017-07-04T12:00:00+00:00
modified: 2021-07-12T12:00:00+00:00
broader: fencing

foil
type: Concept
preferred label: Fleuret @fr
preferred label: Florete @es
preferred label: Florett @de
preferred label: سيف الشيش @ar
preferred label: florete @pt-pt
preferred label: fleuret @dk
preferred label: 花剑 @zh-hans
preferred label: florettfekting @no-nb
preferred label: floreittfekting @no-nn
definition: Florett skapades som ett träningsvapen. Strikta regler för hur attacker måste avvärjas innan motattack får ske. @se
definition: Kategorie des Fechtens mit einer Waffe, die aus einer rechteckigen Querschnittklinge besteht und einem kleinen Korbschutz (Glocke) besteht @de
definition: Category of fencing using a weapon with a rectangular cross-section blade and a small bell guard
definition: Categoria de esgrima que usa uma arma com lâmina flexível e quadrangular, dotada de empunhadura com pequeno guarda-mão. @pt-pt
definition: Fleuret blev skabt som et træningsvåben. Strenge regler for, hvordan angreb skal afværges, før et modangreb kan finde sted. @dk
definition: 使用具有矩形横截面剑身和小型钟罩护手的击剑类别 @zh-hans
note: Retired. Use Media Topic fencing + sports facet fencingtype.
in scheme: Media Topic
created: 2009-10-22T02:00:00+00:00
retired: 2017-07-04T12:00:00+00:00
modified: 2021-02-18T12:00:00+00:00
broader: fencing

sabre
type: Concept
preferred label: Sable @es
preferred label: Sabre @fr
preferred label: Säbel @de
preferred label: Sabel @se
preferred label: السيف العربي @ar
preferred label: sabel @dk
preferred label: 佩剑 @zh-hans
preferred label: sabelfekting @no-nb
definition: Eine Fechtwaffe mit einem Handschutz und einer flachen Klinge mit schneidenden und stoßenden Bewegungen @de
definition: A fencing weapon with a flat blade and knuckle guard used with cutting or thrusting moves
definition: En sabel för tävling har inget gemensamt med traditionella bilder av sablar. I fäktningstävling med sabel kan man både stöta och hugga. @se
definition: Categoria de esgrima que usa uma arma com lâmina muito flexível e triangular, ligeiramente curva, dotada de empunhadura com pequeno guarda-mão semicircular. @pt-pt
definition: En sabel til konkurrence har intet til fælles med traditionelle billeder af sabler. I fægtekonkurrence med sabel må du både støde og hugge. @dk
definition: 击剑用器材。剑刃扁平，带指关节保护。用于砍，冲刺用 @zh-hans
note: Retired. Use Media Topic fencing + sports facet fencingtype.
in scheme: Media Topic
created: 2009-10-22T02:00:00+00:00
retired: 2017-07-04T12:00:00+00:00
modified: 2021-02-18T12:00:00+00:00
broader: fencing

ice dance
type: Concept
preferred label: رقص على الجليد @ar
preferred label: Danza en hielo @es
preferred label: Danse sur glace @fr
preferred label: Isdans @se
preferred label: Eistanz @de
preferred label: dança no gelo @pt-pt
preferred label: isdans @dk
preferred label: 冰上舞蹈 @zh-hans
definition: Tredagarstävling där de tävlande gör obligatoriska saker två dagar och frivilligt program tredje dagen. @se
definition: Takes place over three days with, in order, two compulsory dances, the original dance (2min 30sec) and the free dance (4min).
definition: Findet über drei Tage statt in folgender Reihenfolge, zwei obligatorische Tänze, ein origineller Tanz (2,30 min) und ein freier Tanz (4 min) @de
definition: Prova que decorre durante 3 dias, com duas danças obrigatórias, uma dança original (2min e 30s) e uma dança livre (4min). @pt-pt
definition: Tre-dages konkurrence, hvor deltagerne gør obligatoriske ting to dage og frivilligt program den tredje dag. @dk
definition: 三天内完成按顺序完成两项规定舞蹈，短节目（2分钟半）和自由舞蹈（4分钟） @zh-hans
note: Retired. Use Media Topic figure skating + sports facet figureskatetype.
in scheme: Media Topic
created: 2009-10-22T02:00:00+00:00
retired: 2017-07-04T12:00:00+00:00
modified: 2021-02-18T12:00:00+00:00
broader: figure skating

mini golf
type: Concept
preferred label: Mini golf @es
preferred label: Bangolf @se
preferred label: Minigolf @de
preferred label: غولف @ar
preferred label: minigolfe @pt-pt
preferred label: minigolf @dk
preferred label: 迷你高尔夫 @zh-hans
definition: A game where small hard balls must be holed on an artificial course in as few strokes from the club as possible
definition: Spiel bei dem Bälle eingelocht werden in einem speziellen Kurs mit so wenig Versuchen wie möglich @de
definition: Spelas på konstgjorda korta banor med hinder. Spelarna har en klubba liknande puttern i vanlig golf och olika bollar med olika egenskaper. Normalt 18 banor på en runda. @se
definition: Jogo semelhante ao golfe, praticado em campo artificial de menores dimensões. @pt-pt
definition: Spilles på kunstige korte baner med forhindringer. Normalt 18 baner på en runde. @dk
definition: 在一个人工场内，尽量用最少的杆次击一个硬质小球进洞的项目 @zh-hans
in scheme: Media Topic
created: 2009-10-22T02:00:00+00:00
modified: 2021-02-18T12:00:00+00:00
broader: golf

rhythmic gymnastics
type: Concept
preferred label: Rytmisk sportgymnastik @se
preferred label: Rhythmische Gymnastik @de
preferred label: Gimnasia rítmica @es
preferred label: جمباز ايقاعي @ar
preferred label: Gymnastique rythmique @fr
preferred label: rítmica @pt-pt
preferred label: rytmisk gymnastik @dk
preferred label: 艺术体操 @zh-hans
preferred label: rytmisk gymnastikk @no-nb
definition: Eine Mischung aus Tanz und turnerischen Figuren @de
definition: De tävlande utför olika rörelser och bedöms av domare. Både individuellt och i trupp,med fem olika handredskap (band, boll, käglor, rep och tunnband) och fristående (utan redskap). @se
definition: Mixture of dance and gymnastic moves
definition: Modalidade desportiva que alia a dança a movimentos de ginástica. @pt-pt
definition: Modalidade esportiva que alia a dança a movimentos de ginástica. @pt-br
definition: Blanding af dans og gymnastiske træk. @dk
definition: 结合体操和舞蹈动作 @zh-hans
in scheme: Media Topic
created: 2009-10-22T02:00:00+00:00
modified: 2021-02-18T12:00:00+00:00
broader: gymnastics
narrower: ball (rhythmic gymnastics)
narrower: clubs (rhythmic gymnastics)
narrower: hoop (rhythmic gymnastics)
narrower: ribbon (rhythmic gymnastics)
narrower: rope (rhythmic gymnastics)
has facet: rhythmgymtype

trampoline
type: Concept
preferred label: Trampolin @se
preferred label: Trampoline @fr
preferred label: Trampolín @es
preferred label: ترامبولين @ar
preferred label: Trampolin (Rhythmische Gymnastik) @de
preferred label: trampolim @pt-pt
preferred label: trampolin @dk
preferred label: 蹦床 @zh-hans
definition: Wettkämpfer zeigen komplizierte Drehungen und Sprünge während sie auf dem Trampolin springen @de
definition: De tävlande ska hoppa på en en studsmatta och på den utföra tio stycken övningar (trick) i följd. Bedöms av domare. @se
definition: Competitors perform complicated twists and turns whilst bouncing on the trampoline.
definition: Os ginastas executam movimentos e acrobacias saltando sobre um trampolim. @pt-pt
definition: Konkurrenterne hopper på en trampolin og udfører ti på hinanden følgende øvelser (tricks) i rækkefølge. Bedømt af dommere. @dk
definition: 运动员在绷床上蹦跳时做复杂的扭转和翻腾动作 @zh-hans
definition: Competitors perform complicated twists and turns while bouncing on the trampoline.
in scheme: Media Topic
created: 2009-10-22T02:00:00+00:00
modified: 2021-02-18T12:00:00+00:00
broader: gymnastics

artistic gymnastics
type: Concept
preferred label: Artistisk gymnastik @se
preferred label: Kunstturnen @de
preferred label: ginástica artística @pt-pt
preferred label: redskabsgymnastik @dk
preferred label: 竞技体操 @zh-hans
preferred label: turn @no-nb
preferred label: Gymnastique artistique @fr
preferred label: Gimnasia artística @es
preferred label: جمباز فني @ar
definition: Gymnasts perform artistic and acrobatic moves on different apparatus. There are 6 events for men and 4 for women
definition: Turner zeigen artistische und akrobatische Figuren an unterschiedlichen Geräten. Es gibt 6 Disziplinen für Männer und 4 für Frauen. @de
definition: De tävlande utför rörelser på olika redskap och bedöms av domare. @se
definition: Modalidade de ginástica em que os atletas realizam movimentos artísticos e acrobáticos em diferentes aparelhos. Existem 6 disciplinas para homens e 4 disciplinas para mulheres. @pt-pt
definition: Deltagerne udfører bevægelser på forskellige redskaber og bedømmes af dommere. @dk
definition: 体操运动员在不同的器械上表演艺术和杂技动作。 男子有6个项目，女子有4个项目 @zh-hans
in scheme: Media Topic
created: 2014-04-11T12:00:00+00:00
modified: 2021-07-12T12:00:00+00:00
broader: gymnastics
narrower: beam (artistic gymnastics)
narrower: floor exercise (artistic gymnastics)
narrower: horizontal bar (artistic gymnastics)
narrower: parallel bars (artistic gymnastics)
narrower: pommel horse (artistic gymnastics)
narrower: rings (artistic gymnastics)
narrower: uneven bars (artistic gymnastics)
narrower: vault (artistic gymnastics)
has facet: artisticgymtype

ball (rhythmic gymnastics)
type: Concept
preferred label: Ball (Rhythmische Gymnastik) @de
preferred label: كرة @ar
preferred label: Boll @se
preferred label: Ballon @fr
preferred label: Pelota (gimnasia rítmica) @es
preferred label: bola @pt-pt
preferred label: bold @dk
preferred label: 球操（艺术体操） @zh-hans
preferred label: ball (rytmisk gymnastikk) @no-nb
definition: An exercise based on suppleness of the body using a ball.
definition: Eine Übung, die unter Benutzung eines Balles auf Beweglichkeit des Körpers beruht @de
definition: Exercício de ginástica rítmica em que as ginastas realizam uma coreografia no solo usando uma bola. @pt-pt
definition: En øvelse baseret på smidighed af kroppen ved hjælp af en bold. @dk
definition: 一种使用球来体现身体柔性的运动 @zh-hans
in scheme: Media Topic
created: 2009-10-22T02:00:00+00:00
retired: 2015-02-24T12:00:00+00:00
modified: 2021-12-21T12:00:00+00:00
broader: rhythmic gymnastics

beam (artistic gymnastics)
type: Concept
preferred label: Barra de equilibrio fija (gimnasia artística) @es
preferred label: Bom @se
preferred label: Poutre @fr
preferred label: عارضة @ar
preferred label: Schwebebalken (Kunstturnen) @de
preferred label: trave @pt-pt
preferred label: bom @dk
preferred label: 平衡木（竞技体操） @zh-hans
preferred label: bom (turn) @no-nb
definition: Gymnasts perform leaps and flips from the much feared balance beam just 10 cm wide.
definition: Turner zeigt Sprünge und Drehungen auf dem meist gefürchteten Schwebebalken mit 10 cm Breite @de
definition: Prova feminina em que as ginastas executam uma série de movimentos e saltos em cima de uma trave fixa de 10 cm de largura a 1.20m do chão. @pt-pt
definition: Gymnaster udfører spring og rotation fra en balancebom, der kun er 10 centimeter bred. @dk
definition: 体操运动员在一个仅仅只有10厘米宽的平衡木上跳跃和翻转 @zh-hans
in scheme: Media Topic
created: 2009-10-22T02:00:00+00:00
retired: 2015-02-24T12:00:00+00:00
modified: 2021-12-21T12:00:00+00:00
broader: artistic gymnastics

clubs (rhythmic gymnastics)
type: Concept
preferred label: Clavas (gimnasia rítmica) @es
preferred label: Käglor @se
preferred label: نوادي @ar
preferred label: Massues @fr
preferred label: Keulen (Rhythmische Gymnastik) @de
preferred label: maças @pt-pt
preferred label: køller @dk
preferred label: 棒操（艺术体操） @zh-hans
preferred label: køller (rytmisk gymnastikk) @no-nb
definition: Dance and gymnastic moves whilst juggling clubs.
definition: Tanz und gymnastische Figuren mit langen kreuzenden Keulen @de
definition: Exercício de ginástica rítmica em que as ginastas realizam uma coreografia no solo usando maças. @pt-pt
definition: Dans og gymnastikbevægelser mens gymnasten jonglerer med køller på gulv. @dk
definition: 在作体操和舞蹈时，杂耍式地作抛接棒动作 @zh-hans
definition: Dance and gymnastic moves while juggling clubs.
in scheme: Media Topic
created: 2009-10-22T02:00:00+00:00
retired: 2015-02-24T12:00:00+00:00
modified: 2021-12-21T12:00:00+00:00
broader: rhythmic gymnastics

floor exercise (artistic gymnastics)
type: Concept
preferred label: حركات ارضية @ar
preferred label: Fristående @se
preferred label: Sol @fr
preferred label: Ejercicios en el suelo (gimnasia artística) @es
preferred label: Bodenturnen (Kunstturnen) @de
preferred label: solo @pt-pt
preferred label: gulvøvelse @dk
preferred label: 自由体操（竞技体操） @zh-hans
preferred label: frittstående (turn) @no-nb
preferred label: frittståande (turn) @no-nn
definition: A gymnastics floor exercise on a 12m/sq matt.
definition: Eine gymnastische Bodenübung auf einer 12 m Matte @de
definition: Exercício de ginástica no solo, em tapete de 12m x 12m. @pt-pt
definition: Exercício de ginástica no solo, em estrado de 12m x 12m. @pt-br
definition: En gymnastikgulvøvelse på en defineret firkantet bane. @dk
definition: 运动员在12米见方的垫上表演体操动作 @zh-hans
in scheme: Media Topic
created: 2009-10-22T02:00:00+00:00
retired: 2015-02-24T12:00:00+00:00
modified: 2021-12-21T12:00:00+00:00
broader: artistic gymnastics

hoop (rhythmic gymnastics)
type: Concept
preferred label: Cerceau @fr
preferred label: Reifen (Rhythmische Gymnastik) @de
preferred label: Aro (gimnasia rítmica) @es
preferred label: اطار @ar
preferred label: Tunnband @se
preferred label: arco @pt-pt
preferred label: tøndebånd @dk
preferred label: 圈操（艺术体操） @zh-hans
preferred label: ringer (rytmisk gymnastikk) @no-nb
preferred label: ringar (rytmisk gymnastikk) @no-nn
definition: Ein Reifen wird lange gerollt und geworfen in einer Tanzperformance @de
definition: A hoop is rolled and thrown whilst performing a dance routine.
definition: Exercício de ginástica rítmica em que as ginastas rolam e atiram um arco enquanto realizam uma coreografia. @pt-pt
definition: En ring rulles og kastes, mens gymnasten udfører en danserutine. @dk
definition: 边舞边展示对圈环的环绕和抛接等动作 @zh-hans
definition: A hoop is rolled and thrown while performing a dance routine.
in scheme: Media Topic
created: 2009-10-22T02:00:00+00:00
retired: 2015-02-24T12:00:00+00:00
modified: 2021-12-21T12:00:00+00:00
broader: rhythmic gymnastics

horizontal bar (artistic gymnastics)
type: Concept
preferred label: Barre fixe @fr
preferred label: Räck @se
preferred label: عقلة @ar
preferred label: Barra fija (gimnasia artística) @es
preferred label: Reck (Kunstturnen) @de
preferred label: barra @pt-pt
preferred label: reck @dk
preferred label: 单杠（竞技体操） @zh-hans
preferred label: svingstang (turn) @no-nb
preferred label: svingstong (turn) @no-nn
definition: Turner dreht, schwingt und zeigt Pirouetten an dem horizontalen Reck @de
definition: Gymnasts turn, spin and perform pirouettes around the horizontal bar.
definition: Prova masculina em que os ginastas executam uma sequência de movimentos giratórios e acrobacias suspenso de uma barra horizontal fixa. @pt-pt
definition: Gymnaster svinger, springer og udfører piruetter omkring den vandrette bjælke. @dk
definition: 运动员在单杆上展示翻转、回旋和转体等体操动作 @zh-hans
in scheme: Media Topic
created: 2009-10-22T02:00:00+00:00
retired: 2015-02-24T12:00:00+00:00
modified: 2021-12-21T12:00:00+00:00
broader: artistic gymnastics

parallel bars (artistic gymnastics)
type: Concept
preferred label: Barren (Kunstturnen) @de
preferred label: Barras paralelas (gimnasia artística) @es
preferred label: Barres parallèles @fr
preferred label: المتوازي @ar
preferred label: Barr, herrar @se
preferred label: barras paralelas @pt-pt
preferred label: barre @dk
preferred label: 双杠（竞技体操） @zh-hans
preferred label: skranke, herrer (turn) @no-nb
preferred label: skranke, herrar (turn) @no-nn
definition: Gymnasts swing and turn with guile and grace around the parallel bars.
definition: Turner schwingt und kreist mit Leichtigkeit und Grazie an den parallelen Barren @de
definition: Prova masculina em que os ginastas executam uma sequência de movimentos ao longo de duas barras dispostas paralelamente à mesma altura. @pt-pt
definition: Gymnaster svinger, springer og udfører piruetter omkring de parallelle bjælker. @dk
definition: 运动员在双杆上巧妙而优雅地展示悬吊和翻转 @zh-hans
in scheme: Media Topic
created: 2009-10-22T02:00:00+00:00
retired: 2015-02-24T12:00:00+00:00
modified: 2021-12-21T12:00:00+00:00
broader: artistic gymnastics

pommel horse (artistic gymnastics)
type: Concept
preferred label: Potro con arcos (gimnasia artística) @es
preferred label: Cheval d'arçon @fr
preferred label: Seitpferd (Kunstturnen) @de
preferred label: حصان المقابض @ar
preferred label: Bygelhäst @se
preferred label: cavalo de arções @pt-pt
preferred label: cavalo com alças @pt-br
preferred label: bensving @dk
preferred label: 鞍马（竞技体操） @zh-hans
preferred label: bøylehest (turn) @no-nb
definition: Turner zeigen einen nicht unterbrochenen Schwung über ein Pferd mit Handgriffen unter Einsatz von Balance und Kraft @de
definition: Gymnasts perform an uninterrupted swing motion over a handled horse using balance and strength
definition: Prova masculina em que os ginastas executam uma sequência ininterrupta de movimentos, balançando o corpo sobre um cavalo de arções, combinando equilíbrio e força. @pt-pt
definition: Prova masculina em que os ginastas executam uma sequência ininterrupta de movimentos, balançando o corpo sobre um cavalo com alças, combinando equilíbrio e força. @pt-br
definition: Gymnast udfører en uafbrudt svingbevægelse med benene over en *hest* ved hjælp af balance og styrke. @dk
definition: 运动员在马鞍马上通过平衡和力量做不间断的摆越和转体动作 @zh-hans
in scheme: Media Topic
created: 2009-10-22T02:00:00+00:00
retired: 2015-02-24T12:00:00+00:00
modified: 2021-12-21T12:00:00+00:00
broader: artistic gymnastics

ribbon (rhythmic gymnastics)
type: Concept
preferred label: Bänder (Rhythmische Gymnastik) @de
preferred label: Ruban @fr
preferred label: Cinta (gimnasia rítmica) @es
preferred label: الشريط @ar
preferred label: Band @se
preferred label: fita @pt-pt
preferred label: vimpel @dk
preferred label: 带操（艺术体操） @zh-hans
preferred label: vimpel (rytmisk gymnastikk) @no-nb
definition: Gymnasts work through a pre-arranged routine whilst manipulating a spectacular length of ribbon.
definition: Turner arbeiten mit spektakulären, langen Bändern eine vorbereitete Bewegungsfolge ab @de
definition: Exercício de ginástica rítmica em que as ginastas realizam uma coreografia no solo usando uma fita. @pt-pt
definition: Gymnasten udfører øvelser i kast og dans med vimpel . @dk
definition: 根据预先编排的动作舞动长度惊人的缎带 @zh-hans
definition: Gymnasts work through a pre-arranged routine while manipulating a spectacular length of ribbon.
in scheme: Media Topic
created: 2009-10-22T02:00:00+00:00
retired: 2015-02-24T12:00:00+00:00
modified: 2021-12-21T12:00:00+00:00
broader: rhythmic gymnastics

rope (rhythmic gymnastics)
type: Concept
preferred label: Seil (Rhythmische Gymnastik) @de
preferred label: Cuerda (gimnasia rítmica) @es
preferred label: Corde @fr
preferred label: Rep @se
preferred label: الحبل @ar
preferred label: corda @pt-pt
preferred label: tov @dk
preferred label: 绳操（艺术体操） @zh-hans
preferred label: tau (rytmisk gymnastikk) @no-nb
definition: Sprünge und Figuren werden gezeigt durch die Bewegung eines Seiles @de
definition: Jump and figure movements are performed while a rope is manipulated.
definition: Exercício de ginástica rítmica em que as ginastas realizam uma coreografia no solo usando uma corda. @pt-pt
definition: Gymnasten udfører øvelser i kast og dans med tov (sjippetov). @dk
definition: 舞动绳子同时表演跳跃和舞蹈动作 @zh-hans
in scheme: Media Topic
created: 2009-10-22T02:00:00+00:00
retired: 2015-02-24T12:00:00+00:00
modified: 2021-12-21T12:00:00+00:00
broader: rhythmic gymnastics

rings (artistic gymnastics)
type: Concept
preferred label: Ringar @se
preferred label: Anillas (gimnasia artística) @es
preferred label: الحلق @ar
preferred label: Ringe (Kunstturnen) @de
preferred label: Anneaux @fr
preferred label: argolas @pt-pt
preferred label: ringe @dk
preferred label: 吊环（竞技体操） @zh-hans
preferred label: ringer (turn) @no-nb
preferred label: ringar (turn) @no-nn
definition: Turner zeigt Figuren mit Balance und Kraft an den schwingenden Ringen @de
definition: Gymnasts perform feats of balance and strength from two suspended rings.
definition: Prova masculina em que os ginastas demonstram a sua capacidade de força e equilíbrio executando movimentos e acrobacias suspensos de duas argolas paralelas. @pt-pt
definition: Prova masculina em que os ginastas demonstram sua capacidade de força e equilíbrio executando movimentos e acrobacias suspensos de duas argolas paralelas. @pt-br
definition: Gymnast udfører balance og styrke fra to ophængte ringe. @dk
definition: 运动员在两个悬挂的环上展示平衡和力量技巧 @zh-hans
in scheme: Media Topic
created: 2009-10-22T02:00:00+00:00
retired: 2015-02-24T12:00:00+00:00
modified: 2021-12-21T12:00:00+00:00
broader: artistic gymnastics

uneven bars (artistic gymnastics)
type: Concept
preferred label: Barras asimétricas (gimnasia artística) @es
preferred label: Stufenbarren (Kunstturnen) @de
preferred label: Barres asymétriques @fr
preferred label: Barr, damer @se
preferred label: متوازي مختلف الاضلاع @ar
preferred label: barras assimétricas @pt-pt
preferred label: forskudt barre @dk
preferred label: 高低杠（竞技体操） @zh-hans
preferred label: skranke, kvinner (turn) @no-nb
definition: Gymnasts run through an airborne routine swinging around and between the uneven bars.
definition: Turner zeigt eine routinierte Schwungfolge zwischen und um die ungleichen Barren herum @de
definition: Prova feminina em que as ginastas executam uma sequência de movimentos ao longo de e entre duas barras dispostas paralelamente a alturas diferentes. @pt-pt
definition: Forskudt barre er en øvelse i redskabsgymnastik for kvinder. Redskabet forskudt barre består af to stænger i et stativophæng med ståltrådsforankring. @dk
definition: 运动员在高低杠上或者高低杠之间腾空摆动翻转 @zh-hans
in scheme: Media Topic
created: 2009-10-22T02:00:00+00:00
retired: 2015-02-24T12:00:00+00:00
modified: 2021-12-21T12:00:00+00:00
broader: artistic gymnastics

vault (artistic gymnastics)
type: Concept
preferred label: Saut de cheval @fr
preferred label: Hopp @se
preferred label: Salto con apoyo (gimnasia artística) @es
preferred label: منصة القفز @ar
preferred label: Pferdsprung (Kunstturnen) @de
preferred label: salto de cavalo @pt-pt
preferred label: salto @pt-br
preferred label: spring over hest @dk
preferred label: 跳马（竞技体操） @zh-hans
preferred label: hopp @no-nb
definition: Gymnasts propel themselves by jumping on a trampoline after running quickly down a 25m lane
definition: Turner bringt sich selbst in die Luft durch Abspringen von einem Brett nach einem schellen Lauf von 25 Metern @de
definition: Os ginastas ganham impulso saltando sobre um trampolim e uma espécie de mesa após corrida acelerada em pista de 25m. @pt-pt
definition: Deltageren løber hen mod *hesten*, hvor han eller hun med hjælp fra en springplade sætter af med fødderne, slår an mod hesten og derefter lander på den anden side af hesten efter at have udført en eller flere akrobatiske vendinger i luften. @dk
definition: 运动员通过25米长的跑道助跑后再踏上跳板腾空跳跃 @zh-hans
in scheme: Media Topic
created: 2009-10-22T02:00:00+00:00
retired: 2015-02-24T12:00:00+00:00
modified: 2021-12-21T12:00:00+00:00
broader: artistic gymnastics

flat racing
type: Concept
preferred label: Galopprennen @de
preferred label: Flat racing @se
preferred label: سباق الارض المسطحة @ar
preferred label: Course de plat @fr
preferred label: Carrera llana @es
preferred label: galopløb @dk
preferred label: 无障碍赛马 @zh-hans
preferred label: galopp @no-nb
definition: A horse race over a flat course.
definition: Pferderennen in einem flachen Gelände @de
definition: Hästtävlingar på platt mark utan hinder där loppen kan vara olika längd från 400 meter till flera kilometer. @se
definition: Corrida de cavalos em pista plana sem obstáculos. @pt-pt
definition: Ridesportskonkurrence med rytter på hest. Hesten skal galoppere. @dk
definition: 无障碍平地赛马 @zh-hans
note: Retired. Use Media Topic horse racing + sports facet equestriantype.
in scheme: Media Topic
created: 2009-10-22T02:00:00+00:00
retired: 2017-07-04T12:00:00+00:00
modified: 2021-02-18T12:00:00+00:00
broader: horse racing

harness racing
type: Concept
preferred label: Course sous harnais @fr
preferred label: سباق الخيل لجر العربة @ar
preferred label: Carrera de arnés @es
preferred label: Trav @se
preferred label: Trabrennen @de
preferred label: corridas de cavalos @pt-pt
preferred label: travløb @dk
preferred label: 轻驾马车赛 @zh-hans
preferred label: travløp @no-nb
definition: Hästtävlingar med människan i en liten vagn bakom hästen. Hästen får inte galoppera. @se
definition: Horses hitched to a jockeyed buggy race round a flat course. Can be performed at a trotting gait or a pacing gait.
definition: Pferdewagenrennen mit Jockey im Trab auf einer flachen Bahn. @de
definition: Corridas de cavalos montados. @pt-pt
definition: Hestevæddeløb med en mand/kvinde i en sulky (lille vogn) bag hesten. Hesten må ikke galoppere. @dk
definition: 绕平地的轻型驾马车比赛，可以是慢跑或固定节奏的跑态 @zh-hans
note: Retired. Use Media Topic horse racing + sports facet equestriantype.
in scheme: Media Topic
created: 2009-10-22T02:00:00+00:00
retired: 2017-07-04T12:00:00+00:00
modified: 2021-02-18T12:00:00+00:00
broader: horse racing

steeple chase
type: Concept
preferred label: Steeplechase @se
preferred label: Hindernissrennen @de
preferred label: Course d'obstacles @fr
preferred label: موانع @ar
preferred label: Carrera de obstáculos @es
preferred label: corrida de obstáculos @pt-pt
preferred label: hesteforhindringsløb @dk
preferred label: 马术障碍赛 @zh-hans
preferred label: hinderløp @no-nb
definition: A mounted horse race over at least eight classic obstacles, four of which must be different, such as the water jump, spruce fences, mud walls etc.
definition: Hästtävling där ryttare och hästar och ska över åtta hinder, varav minst fyra ska vara olika. @se
definition: Rennen mit Pferd und Reiter über acht Hindernisse, wovon vier unterschiedlich sein müssen, wie Sprung über Wasser, Sprossenzäune, Schlammwände etc. @de
definition: Corrida de cavalo montado com pelo menos 8 obstáculos clássicos, quatro dos quais são diferentes, como salto sobre água, cerca, vala, etc. @pt-pt
definition: Corrida de cavalo montado com pelo menos 8 obstáculos clássicos, quatro dos quais são diferentes, como salto sobre água, cerca, vala etc. @pt-br
definition: Hestevæddeløb, hvor ryttere på heste skal krydse otte forhindringer, hvoraf mindst fire skal være forskellige. @dk
definition: 骑马比赛，设有8个经典的障碍。其中4个必须不同，包括跳水池，木栅栏，泥墙等 @zh-hans
note: Retired. Use Media Topic horse racing + sports facet equestriantype.
in scheme: Media Topic
created: 2009-10-22T02:00:00+00:00
retired: 2017-07-04T12:00:00+00:00
modified: 2021-02-18T12:00:00+00:00
broader: horse racing

sledge hockey
type: Concept
preferred label: هوكي ذوي الاحتياجات الخاصة @ar
preferred label: Kälkhockey @se
preferred label: Hockey sur luge @fr
preferred label: Eisschlittenhockey @de
preferred label: Hockey en trineo @es
preferred label: hóquei em trenó @pt-pt
preferred label: slædehockey @dk
preferred label: 雪橇冰球 @zh-hans
preferred label: kjelkehockey @no-nb
definition: Ähnlich wie Eishockey, aber auf kleinen Schlitten. Die Wettkämpfer bewegen sich mit Hilfe der Arme fort @de
definition: Like ice hockey but instead of skates small sledges are used. Competitors move by pushing with the arms
definition: Lagidrott som liknar ishockey, men spelarna sitter på en liten kälke och tar sig fram med kraft från armarna. @se
definition: Modalidade semelhante ao hóquei no gelo mas praticada com pequenos trenós que os patinadores empurram com os braços. @pt-pt
definition: Holdsport, der ligner ishockey, men spillerne sidder på en lille slæde og bevæger sig fremad med kraft fra armene. @dk
definition: 类似冰球。但不穿冰鞋而是用小雪橇。队员靠手推动雪橇移动 @zh-hans
in scheme: Media Topic
created: 2009-10-22T02:00:00+00:00
modified: 2021-02-18T12:00:00+00:00
broader: ice hockey

judo
type: Concept
preferred label: جودو @ar
preferred label: Judo @de
preferred label: judô @pt-br
preferred label: 柔道 @zh-hans
definition: Eine verteidigende Kampfortart @de
definition: A defensive martial art.
definition: Judo har utvecklats från jujutsu men har inga sparkar och slag utan är mer en försvarsteknik med kast och balans. @se
definition: Arte marcial defensiva. @pt-pt
definition: Judo blev udviklet fra jujutsu, men har ingen spark og slag. Det er mere en forsvarsteknik med kast og balance. @dk
definition: 防卫性武术 @zh-hans
change note: Change Note 2015-08-27: broader term changed
in scheme: Media Topic
created: 2009-10-22T02:00:00+00:00
modified: 2021-02-18T12:00:00+00:00
broader: martial arts
narrower: extra lightweight (judo)
narrower: half-heavyweight (judo)
narrower: half-lightweight (judo)
narrower: half-middleweight (judo)
narrower: heavyweight (judo)
narrower: lightweight (judo)
narrower: middleweight (judo)
has facet: weightclasstype

extra lightweight (judo)
type: Concept
preferred label: Peso extra liviano (judo) @es
preferred label: Extra Leichtgewicht (Judo) @de
preferred label: Extra lättvikt, (Judo) @se
preferred label: الوزن الخفيف (جودو) @ar
preferred label: Super-légers (judo) @fr
preferred label: peso-extraleve (judo) @pt-pt
preferred label: peso-extraleve (judô) @pt-br
preferred label: ekstra-letvægt @dk
preferred label: 轻量级柔道 @zh-hans
preferred label: lett fjærvekt @no-nb
preferred label: lett fjørvekt @no-nn
definition: Up to 60kg for men and 48kg for women.
definition: Bis zu 60 kg bei Männern und 48 kg bei Frauen @de
definition: Categoria até 60kg para homens e até 48kg para mulheres. @pt-pt
definition: Op til 60 kg for mænd og 48 kg for kvinder. @dk
definition: 选手体重分别最高不超过60公斤（男子）和48公斤（女子） @zh-hans
in scheme: Media Topic
created: 2009-10-22T02:00:00+00:00
retired: 2015-02-24T12:00:00+00:00
modified: 2021-12-21T12:00:00+00:00
broader: judo

half-heavyweight (judo)
type: Concept
preferred label: Halv tungvikt, (Judo) @se
preferred label: Mi-lourds (judo) @fr
preferred label: Peso mediopesado (judo) @es
preferred label: الوزن نصف الثقيل @ar
preferred label: Halb-Schwergewicht (Judo) @de
preferred label: peso-meio-pesado (judo) @pt-pt
preferred label: peso-meio-pesado (judô) @pt-br
preferred label: halv-sværvægt @dk
preferred label: 次重量级柔道 @zh-hans
preferred label: lett tungvekt @no-nb
definition: Up to 100kg for men and 78kg for women.
definition: Bis zu 100 kg bei Männern und 78 kg bei Frauen @de
definition: Categoria até 100kg para homens e até 78kg para mulheres. @pt-pt
definition: Op til 100 kg for mænd og 78 kg for kvinder. @dk
definition: 选手体重分别最高不超过100公斤（男子）和78公斤（女子） @zh-hans
in scheme: Media Topic
created: 2009-10-22T02:00:00+00:00
retired: 2015-02-24T12:00:00+00:00
modified: 2021-12-21T12:00:00+00:00
broader: judo

half-lightweight (judo)
type: Concept
preferred label: Peso medio liviano (judo) @es
preferred label: Mi-légers (judo) @fr
preferred label: Halb-Leichtgewicht (Judo) @de
preferred label: الوزن نصف الخفيف @ar
preferred label: Halv lättvikt, (Judo) @se
preferred label: peso-meio-leve (judo) @pt-pt
preferred label: peso-meio-leve (judô) @pt-br
preferred label: halv-letvægt @dk
preferred label: 次轻量级柔道 @zh-hans
preferred label: fjærvekt @no-nb
preferred label: fjørvekt @no-nn
definition: Bis zu 73 kg bei Männern und 57 kg bei Frauen @de
definition: Up to 73kg for men and 57kg for women.
definition: Categoria até 73kg para homens e até 57kg para mulheres. @pt-pt
definition: Op til 73 kg for mænd og 57 kg for kvinder. @dk
definition: 选手体重分别最高不超过男子73公斤（男子）和57公斤（女子） @zh-hans
in scheme: Media Topic
created: 2009-10-22T02:00:00+00:00
retired: 2015-02-24T12:00:00+00:00
modified: 2021-12-21T12:00:00+00:00
broader: judo

half-middleweight (judo)
type: Concept
preferred label: Halb-Mittelgewicht (Judo) @de
preferred label: Halv mellanvikt, (Judo) @se
preferred label: Mi-moyens (judo) @fr
preferred label: Peso medio mediano (judo) @es
preferred label: الوزن نصف المتوسط @ar
preferred label: peso-meio-médio (judo) @pt-pt
preferred label: peso-meio-médio (judô) @pt-br
preferred label: halv-mellemvægt @dk
preferred label: 次中量级柔道 @zh-hans
preferred label: weltervekt @no-nb
definition: Up to 81kg for men and 63kg for women
definition: Bis zu 81 kg bei Männern und 63 kg bei Frauen @de
definition: Categoria até 81kg para homens e até 63kg para mulheres. @pt-pt
definition: Op til 81 kg for mænd og 63 kg for kvinder. @dk
definition: 选手体重分别最高不超过不超过男子81公斤（男子）和女子63公斤（女子） @zh-hans
in scheme: Media Topic
created: 2009-10-22T02:00:00+00:00
retired: 2015-02-24T12:00:00+00:00
modified: 2021-12-21T12:00:00+00:00
broader: judo

heavyweight (judo)
type: Concept
preferred label: Tungvikt, (Judo) @se
preferred label: Peso pesado (judo) @es
preferred label: Schwergewicht (Judo) @de
preferred label: Lourds (judo) @fr
preferred label: الوزن الثقيل (جودو) @ar
preferred label: peso-pesado (judo) @pt-pt
preferred label: peso-pesado (judô) @pt-br
preferred label: sværvægt @dk
preferred label: 重量级柔道 @zh-hans
preferred label: tungvekt @no-nb
definition: Gewöhnlich über 100 kg bei Männern und über 78 kg bei Frauen @de
definition: Open but usually over 100kg for men and over 78kg for women
definition: Categoria aberta, geralmente acima de 100kg para homens e acima de 78kg para mulheres. @pt-pt
definition: Åben, men normalt over 100 kg for mænd og over 78 kg for kvinder. @dk
definition: 选手体重不限，但通常男子100公斤以上，女子78公斤以上 @zh-hans
in scheme: Media Topic
created: 2009-10-22T02:00:00+00:00
retired: 2015-02-24T12:00:00+00:00
modified: 2021-12-21T12:00:00+00:00
broader: judo

lightweight (judo)
type: Concept
preferred label: Légers (judo) @fr
preferred label: Lättvikt, (Judo) @se
preferred label: Leichtgewicht (Judo) @de
preferred label: Peso ligero (judo) @es
preferred label: الوزن الخفيف (جودو) @ar
preferred label: peso-leve (judo) @pt-pt
preferred label: peso-leve (judô) @pt-br
preferred label: letvægt @dk
preferred label: 轻量级柔道 @zh-hans
preferred label: lettvekt @no-nb
definition: Bis zu 66kg bei Männern und 52kg bei Frauen @de
definition: Up to 66kg for men and 52kg for women.
definition: Categoria até 66kg para homens e até 52kg para mulheres. @pt-pt
definition: Op til 66 kg for mænd og 52 kg for kvinder. @dk
definition: 选手体重分别最高不超过男子最高66公斤（男子）和52公斤（女子） @zh-hans
in scheme: Media Topic
created: 2009-10-22T02:00:00+00:00
retired: 2015-02-24T12:00:00+00:00
modified: 2021-12-21T12:00:00+00:00
broader: judo

middleweight (judo)
type: Concept
preferred label: Mittelgewicht (Judo) @de
preferred label: الوزن المتوسط (جودو) @ar
preferred label: Mellanvikt @se
preferred label: Moyens (judo) @fr
preferred label: Peso mediano (judo) @es
preferred label: peso-médio (judo) @pt-pt
preferred label: peso-médio (judô) @pt-br
preferred label: mellemvægt @dk
preferred label: 中量级柔道 @zh-hans
preferred label: mellomvekt @no-nb
definition: Up to 90kg for men and 70kg for women.
definition: Bis zu 90kg bei Männern und 70kg bei Frauen @de
definition: Categoria até 90kg para homens e até 70kg para mulheres. @pt-pt
definition: Op til 90 kg for mænd og 70 kg for kvinder. @dk
definition: 选手体重分别最高不超过最高男子90公斤（男子）和70公斤（女子） @zh-hans
in scheme: Media Topic
created: 2009-10-22T02:00:00+00:00
retired: 2015-02-24T12:00:00+00:00
modified: 2021-12-21T12:00:00+00:00
broader: judo

jukendo
type: Concept
preferred label: جوكندو @ar
preferred label: Jukendo @se
preferred label: 铳剑道 @zh-hans
definition: Japanische traditionelle Kampfsportart mit einem Holzgewehr. 'Juken' bedeutet Gewehr oder Waffe mit Bajonett. (Programm des Nationalen Sportfestivals in Japan) @de
definition: Japanese traditional martial art using a model rifle made of wood. 'Juken' means a rifle or gun with blade (bayonet)
definition: Traditionell japansk stridskonst där vapnet utgörs av en modell av ett bajonettförsett gevär. @se
definition: Arte marcial tradicional japonesa que usa uma baioneta em madeira. @pt-pt
definition: Traditionel japansk kampsport, hvor våbnet er en model af en bajonetmonteret riffel. @dk
definition: 使用带木制刀铳枪的日本传统武术。铳剑的意思就是有刺刀的铳或枪 @zh-hans
change note: Change Note 2015-08-27: broader term changed
in scheme: Media Topic
created: 2009-10-22T02:00:00+00:00
modified: 2021-02-18T12:00:00+00:00
broader: martial arts

K1 (kayaking)
type: Concept
preferred label: K1 (kayak) @es
preferred label: K1 (Kajak) @de
preferred label: K1 @se
preferred label: فردي @ar
preferred label: K1 (kajak) @dk
preferred label: 单人皮艇 @zh-hans
preferred label: K1 (padling) @no-nb
definition: Ein geschlossenes Boot, worin der Wettkämpfer in einem festen Sitz sitzt und ein Doppelpaddel benutzt @de
definition: An enclosed boat with the competitor sitting on a fixed seat for one person using a double bladed paddle
definition: Caiaque de 1 lugar (embarcação fechada para uma pessoa sentada em assento fixo que rema com pagaia dupla). @pt-pt
definition: Caiaque de 1 lugar (embarcação fechada para uma pessoa sentada em assento fixo que rema com remo de duas pás). @pt-br
definition: Sejlads i kajak til én person, hvor deltageren sidder med ben og fødder fremad og bruger en padle med blade i begge ender. @dk
definition: 单个选手坐在皮艇固定的座位上。使用双叶浆 @zh-hans
in scheme: Media Topic
created: 2009-10-22T02:00:00+00:00
retired: 2015-02-24T12:00:00+00:00
modified: 2021-12-21T12:00:00+00:00
broader: kayaking

K2 (kayaking)
type: Concept
preferred label: K2 (kayak) @fr
preferred label: K2 (Kajak) @de
preferred label: زوجي @ar
preferred label: K2 @se
preferred label: K2 (kajak) @dk
preferred label: 双人皮艇 @zh-hans
preferred label: K2 (padling) @no-nb
definition: An enclosed boat with the competitor sitting on a fixed seat for two people using double bladed paddles
definition: Ein geschlossenes Boot, worin zwei Wettkämpfer in festen Sitzen sitzen und Doppelpaddel benutzen @de
definition: Caiaque de 2 lugares (embarcação fechada para duas pessoas sentadas em assento fixo que remam com pagaia dupla). @pt-pt
definition: Caiaque de 2 lugares (embarcação fechada para duas pessoas sentadas em assento fixo que remam com remo de duas pás). @pt-br
definition: Sejlads i kajak til to person, hvor deltageren sidder med ben og fødder fremad og bruger en padle med blade i begge ender. @dk
definition: 两个选手选手坐在皮艇固定的座位上。使用双叶浆 @zh-hans
in scheme: Media Topic
created: 2009-10-22T02:00:00+00:00
retired: 2015-02-24T12:00:00+00:00
modified: 2021-12-21T12:00:00+00:00
broader: kayaking

K4 (kayaking)
type: Concept
preferred label: K4 @se
preferred label: K4 (kayak) @es
preferred label: رباعي @ar
preferred label: K4 (Kajak) @de
preferred label: K4 (kajak) @dk
preferred label: 四人皮艇 @zh-hans
preferred label: K4 (padling) @no-nb
definition: An enclosed boat with the competitor sitting on a fixed seat for four people using double bladed paddles
definition: Ein geschlossenes Boot, worin vier Wettkämpfer in festen Sitzen sitzen und Doppelpaddel benutzen @de
definition: Caiaque de 4 lugares (embarcação fechada para quatro pessoas sentadas em assento fixo que remam com pagaia dupla). @pt-pt
definition: Caiaque de 4 lugares (embarcação fechada para quatro pessoas sentadas em assento fixo que remam com remo de duas pás). @pt-br
definition: Sejlads i kajak til fire person, hvor deltageren sidder med ben og fødder fremad og bruger en padle med blade i begge ender. @dk
definition: 四个选手坐在皮艇固定的座位上。使用双叶浆 @zh-hans
in scheme: Media Topic
created: 2009-10-22T02:00:00+00:00
retired: 2015-02-24T12:00:00+00:00
modified: 2021-12-21T12:00:00+00:00
broader: kayaking

karate
type: Concept
preferred label: Karaté @fr
preferred label: Karate @es
preferred label: كاراتيه @ar
preferred label: caraté @pt-pt
preferred label: caratê @pt-br
preferred label: 空手道 @zh-hans
definition: Eine Kampfsportart bei der Hiebe, Schläge, Tritte und Würfe genutzt werden um einen Angreifer abzuwehren @de
definition: A martial art where chops, punches, kicks and throws are used to defeat an opponent.
definition: Stridskonst ursprungligen från Okinawa, där främst slag och sparkar används för att besegra en motståndare. @se
definition: Arte marcial que usa golpes de mãos e pés para derrubar o adversário. @pt-pt
definition: Kampsport oprindeligt fra Okinawa, hvor hovedsageligt slag og spark bruges til at besejre en modstander. @dk
definition: 武术。砍，击，踢，摔等动作都可使用 @zh-hans
change note: Change Note 2015-08-27: broader term changed
in scheme: Media Topic
created: 2009-10-22T02:00:00+00:00
modified: 2021-02-18T12:00:00+00:00
broader: martial arts

kendo
type: Concept
preferred label: كندو @ar
preferred label: Kendo @de
preferred label: 剑道 @zh-hans
definition: Traditionelle japanische Kampfsportart mit einem Bambusschwert, auch Japanisches Fechten genannt @de
definition: Japanese traditional martial art using a bamboo sword, sometimes called Japanese fencing
definition: Japansk stridskonst där vapnet är ett *svärd* av bambu. @se
definition: Arte marcial tradicional japonesa que usa uma espada de bambu. @pt-pt
definition: Japansk kampsport, hvor våbnet er et sværd af bambus. @dk
definition: 日本传统武术，使用竹剑。有时也叫日本击剑 @zh-hans
change note: Change Note 2015-08-27: broader term changed
in scheme: Media Topic
created: 2009-10-22T02:00:00+00:00
modified: 2021-03-15T12:00:00+00:00
broader: martial arts

kyudo
type: Concept
preferred label: Japanskt bågskytte @se
preferred label: Kyudo @fr
preferred label: كيودو @ar
preferred label: Kyodo @de
preferred label: Kiudo @es
preferred label: 弓道 @zh-hans
definition: Japanische traditionelle Kampfsportart mit einem Bambusbogen und Pfeilen, manchmal auch japanisches Bogenschießen genannt @de
definition: Japanese traditional martial art using a bamboo bow and arrows, sometimes called Japanese archery
definition: Japansk stridskonst med en pilbåge gjord av bambu. @se
definition: Arte marcial tradicional japonesa que usa um arco de bambu e flechas. @pt-pt
definition: Japansk kampsport med en bue lavet af bambus. @dk
definition: 日本传统武术，使用竹制的弓和箭。有时也叫日本射箭项目 @zh-hans
definition: Japansk kamsport med pil og boge av bambus. @no-nn
definition: Japansk kamsport som involverer en pil-og-bue av bambus. @no-nb
change note: Change Note 2015-08-27: broader term changed
in scheme: Media Topic
created: 2009-10-22T02:00:00+00:00
modified: 2021-02-18T12:00:00+00:00
broader: martial arts

endurance race
type: Concept
preferred label: سباق التحمل @ar
preferred label: Course d'endurance @fr
preferred label: Carrera de resistencia @es
preferred label: Ausdauer @de
preferred label: Endurance @se
preferred label: resistência @pt-pt
preferred label: langdistanceløb @dk
preferred label: 耐力赛 @zh-hans
definition: Rennen mit einem oder mehreren Fahrern über eine lange und bestimmte Distanz und Zeit @de
definition: Motorburet uthållighetslopp över lång distans eller tid. @se
definition: Races for one or more drivers over a long and set distance or time
definition: Corrida de longa distância para piloto e copiloto, em carros especialmente preparados para testar a resistência. @pt-pt
definition: Motorløb som udholdenhedsløb over lang afstand eller tid. @dk
definition: 单个或多个驾驶员的通过一个很长的设定距离或时间赛车 @zh-hans
note: Retired. Use Media Topic motor car racing + sports facet motorcarracingtype
in scheme: Media Topic
created: 2009-10-22T02:00:00+00:00
retired: 2017-07-04T12:00:00+00:00
modified: 2021-02-18T12:00:00+00:00
broader: motor car racing

فورمولا3000
type: Concept
preferred label: F3000
preferred label: Fórmula 3000 @es
preferred label: F3000赛车 @zh-hans
preferred label: formel 3000 @no-nb
definition: Mit weniger starken Motoren als bei der Formel 1, fahren ausgewählte Konstrukteur-Teams über verschiedene Runden weltweit Geschwindigkeitsrennen im Einzel- und Teamwettbewerb über eine Saison @de
definition: Fungerar som F1 men med mindre starka motorer. @se
definition: Using less powerful motors than the Formula One, designated construction teams race over varied circuits the world over in speed races for individual and team honours over a season.
definition: Corrida de velocidade de monolugares, com motores menos potentes que os de F1. Os pilotos competem individualmente e por equipas em vários circuitos mundiais, segundo especificações da Federação Internacional do Automóvel (FIA). @pt-pt
definition: Corrida de velocidade de monopostos, com motores menos potentes que os de F1. Os pilotos competem individualmente e por equipes em vários circuitos mundiais, segundo especificações da Federação Internacional do Automóvel (FIA). @pt-br
definition: Fungerer som formel 1, men med mindre kraftfulde motorer. @dk
definition: 发动机马力比一级方程式低。每个赛季，专门的参赛队在各地不同的赛道上比赛，按个人和团队计名次 @zh-hans
definition: Using less powerful motors than the Formula One, designated construction teams race over varied circuits the world over in speed races for individual and team honors over a season.
note: Retired. Use Media Topic motor car racing + sports facet motorcarracingtype
in scheme: Media Topic
created: 2009-10-22T02:00:00+00:00
retired: 2017-07-04T12:00:00+00:00
modified: 2021-02-18T12:00:00+00:00
broader: motor car racing

Formula One
type: Concept
preferred label: Formel 1 @de
preferred label: فورمولا @ar
preferred label: F1 @se
preferred label: Fórmula uno (f1) @es
preferred label: Fórmula 1 @pt-pt
preferred label: formel 1 @dk
preferred label: 一级方程式赛车 @zh-hans
definition: Single cockpit car racing where 20 or so competitors race head to head over varied circuits around the world to win Grand Prix points in an individual and constructors championship
definition: Motortävling med bilar med de största motorerna. Cirka 20 bilar per lopp. Startposition erhålls genom bra träningstider dagarna före loppet. Både en individuell tävling och en lagtävling. @se
definition: Einzelfahrer Autorennen bei dem 20 oder mehr Wettkämpfer ein Kopf-an-Kopf-Rennen über verschiedene Runden weltweit, um Grand Prix Punkte zu gewinnen in einem Einzel- und Konstrukteur-Wettbewerb @de
definition: Corrida de velocidade de monolugares em que 20 ou mais pilotos competem lado a lado em vários circuitos mundiais para ganhar pontos em cada Grande Prémio, do campeonato individual e de construtores. @pt-pt
definition: Corrida de velocidade de monopostos em que 20 ou mais pilotos competem lado a lado em vários circuitos mundiais para ganhar pontos em cada Grande Prêmio, do campeonato individual e de construtores. @pt-br
definition: Motorkonkurrence for biler med de største motorer. Cirka 20 biler pr. løb. Startposition opnås gennem gode træningstider dagene før løbet. Både en individuel konkurrence og en holdkonkurrence. @dk
definition: 单驾驶舱赛车比赛，20人左右参赛选手在全球各地赛道上比赛，获得大奖赛积分。可按个人和团队积分确定冠军 @zh-hans
note: Retired. Use Media Topic motor car racing + sports facet motorcarracingtype
in scheme: Media Topic
created: 2009-10-22T02:00:00+00:00
retired: 2017-07-04T12:00:00+00:00
modified: 2021-02-18T12:00:00+00:00
broader: motor car racing

Indy Racing
type: Concept
preferred label: انديكار @ar
preferred label: Fórmula indy @es
preferred label: Formule Indy @fr
preferred label: Indy @de
preferred label: Fórmula Indy @pt-pt
preferred label: indyracing @dk
preferred label: 印地赛车 @zh-hans
preferred label: Indycar @no-nb
preferred label: indycar @no-nn
definition: North American top range professional league speed racing over circuits.
definition: Nordamerikanische professionelle Topliga der Geschwindigkeitsrennen über Runden @de
definition: Nordamerikansk motsvarighet till F1. Loppen går på ovaler i höga hastigheter. @se
definition: Corrida de velocidade de monolugares da liga profissional norte-americana de corridas de velocidade. @pt-pt
definition: Corrida de velocidade de monopostos da liga profissional norte-americana de corridas de velocidade. @pt-br
definition: Nordamerikansk ækvivalent til formel 1. Løbet går på ovale baner i høje hastigheder. @dk
definition: 北美顶级赛道职业赛车联盟车赛 @zh-hans
note: Retired. Use Media Topic motor car racing + sports facet motorcarracingtype
in scheme: Media Topic
created: 2009-10-22T02:00:00+00:00
retired: 2017-07-04T12:00:00+00:00
modified: 2021-02-18T12:00:00+00:00
broader: motor car racing

motor car rallycross
type: Concept
preferred label: Rallycross @se
preferred label: سيارات مسافات طويلة @ar
preferred label: Crossrallye @de
preferred label: ralicrosse @pt-pt
preferred label: rallycross @pt-br
preferred label: 汽车越野拉力赛 @zh-hans
definition: Motortävlingar med bilar som ser mer ut som vanliga bilar. Tävlingen sker på grusbanor med nivåskillnader. @se
definition: Stage races over dirt tracks
definition: Rennen im Stadion über schmutzige Straßen @de
definition: Corridas de rali por etapas em circuitos de terra. @pt-pt
definition: Motorløb med biler, der ligner mere almindelige biler. Konkurrencen finder sted på grusbaner med niveauforskelle. @dk
definition: 分段土路赛车 @zh-hans
note: Retired. Use Media Topic motor car racing + sports facet motorcarracingtype
in scheme: Media Topic
created: 2009-10-22T02:00:00+00:00
retired: 2017-07-04T12:00:00+00:00
modified: 2021-02-18T12:00:00+00:00
broader: motor car racing

motor car rallying
type: Concept
preferred label: Rallye automobile @fr
preferred label: Rallye @de
preferred label: Rally @se
preferred label: سباق سيارات @ar
preferred label: Rally de autos @es
preferred label: rali @pt-pt
preferred label: rally @dk
preferred label: 汽车拉力赛 @zh-hans
definition: A season of endurance races over closed circuits including dirt tracks, roads and even snowy conditions featuring specials using adapted road cars with a driver and co-pilot.
definition: Rally körs med bilar som har förare och kartläsare, på allmäna men avstängda vägar. Varje tävling har flera etapper och underlaget varierar beroende på plats och årstid. Deltävlingarna räknas ihop till ett mästerskap. @se
definition: Ein Saison von Ausdauerrennen über geschlossene Pisten auf dreckigen Straßen und auch unter Schneebedingungen, mit Hilfe von speziellen Straßenfahrzeugens mit einem Fahrer und einem Co-Pilot @de
definition: Corridas de resistência, disputadas em circuitos delimitados que incluem caminhos de terra e estradas, usando carros especialmente adaptados com piloto e copiloto. @pt-pt
definition: Rally køres af biler, der har chauffører og kortlæsere i bilen, på offentlige, men lukkede veje. Hver konkurrence har flere etaper, og grundlaget varierer afhængigt af placering og sæson. @dk
definition: 全赛季耐力赛车比赛。场地包括封闭赛道的土路，公路，雪地路况的路段。使用专门改装过的汽车，主副驾驶 @zh-hans
note: Retired. Use Media Topic motor car racing + sports facet motorcarracingtype
in scheme: Media Topic
created: 2009-10-22T02:00:00+00:00
retired: 2017-07-04T12:00:00+00:00
modified: 2021-02-18T12:00:00+00:00
broader: motor car racing

motorcycle endurance
type: Concept
preferred label: Carrera de resistencia de motos @es
preferred label: Endurance, mc @se
preferred label: سباق تحمل للدراجات النارية @ar
preferred label: Ausdauer @de
preferred label: Course d'endurance moto @fr
preferred label: resistência @pt-pt
preferred label: motorcykel langdistanceløb @dk
preferred label: 摩托车耐力赛 @zh-hans
preferred label: motorsykkel endurance @no-nb
definition: Motortävling där uthållighet och taktik med depåstopp är mer avgörande än farten. Ofta väldigt långa lopp så lagen byter förare vid olika intervall. @se
definition: Straßenrennen mit Belastung und Ausdauer @de
definition: A road race of consistency and endurance
definition: Corrida de estrada de resistência e regularidade. @pt-pt
definition: Motorcykelløb, hvor udholdenhed og taktik med pit-stop er mere afgørende end hastighed. Ofte meget lange løb, så holdene skifter kørere med forskellige intervaller. @dk
definition: 公路稳定性和耐力摩托车赛 @zh-hans
note: Retired. Use Media Topicmotorcycling+ sports facet motorcyclingtype.
in scheme: Media Topic
created: 2009-10-22T02:00:00+00:00
retired: 2017-07-04T12:00:00+00:00
modified: 2021-02-18T12:00:00+00:00
broader: motorcycling

enduro
type: Concept
preferred label: Enduro @fr
preferred label: سباق الطرق الوعرة @ar
preferred label: 耐力赛 @zh-hans
definition: Uthållighetstävling på motorcykel, ofta med svår terräng. @se
definition: Geschwindigkeitsrennen, Ausdauer und Regeln über verschiedene Oberflächen, z.B durch den Wald und auf schmutzigen Straßen @de
definition: A race of speed, endurance and regularity over varied surfaces such as through forests and on dirt tracks
definition: Corrida de velocidade, resistência e regularidade sobre várias superfícies como florestas e estradas de terra. @pt-pt
definition: Udholdenhedsløb på motorcykel, ofte på vanskeligt terræn. @dk
definition: 在不同路面包括森林、土路等进行的速度、耐力和规范方面比拼的赛车 @zh-hans
note: Retired. Use Media Topic motorcycling+ sports facet motorcyclingtype
in scheme: Media Topic
created: 2009-10-22T02:00:00+00:00
retired: 2017-07-04T12:00:00+00:00
modified: 2021-02-18T12:00:00+00:00
broader: motorcycling

grass-track
type: Concept
preferred label: Grasstrack @se
preferred label: Course sur herbe @fr
preferred label: مضمار عشبي @ar
preferred label: Grasbahn @de
preferred label: Carrera de motos sobre césped @es
preferred label: græsbane @dk
preferred label: 草地赛 @zh-hans
preferred label: grasstrack @no-nb
definition: Påminner om speedway men sker på gräsbanor. @se
definition: A race competed on turf
definition: Rennen, was auf Gras ausgetragen wird @de
definition: Corrida de motos em pista relvada. @pt-pt
definition: Corrida de motos em pista de grama. @pt-br
definition: Minder om speedway men finder sted på græsbaner. @dk
definition: 草地比赛 @zh-hans
note: Retired. Use Media Topicmotorcycling+ sports facet motorcyclingtype
in scheme: Media Topic
created: 2009-10-22T02:00:00+00:00
retired: 2017-07-04T12:00:00+00:00
modified: 2021-02-18T12:00:00+00:00
broader: motorcycling

moto-ball
type: Concept
preferred label: Motoball @de
preferred label: Moto-ball @fr
preferred label: كرة الدراجات النارية @ar
preferred label: Motorcykelpolo @se
preferred label: motoball @pt-pt
preferred label: motorbold @dk
preferred label: 摩托足球赛 @zh-hans
definition: Mannschaftssport bei dem die Fahrer mit einem Ball spielen @de
definition: Liknande fotboll, men utespelarna åker motorcykel. Målvakterna har ingen motorcykel. @se
definition: Team sport where drivers play a ball
definition: Desporto de equipa em que os pilotos jogam bola. @pt-pt
definition: Esporte de equipe em que os pilotos jogam bola. @pt-br
definition: Ligner fodbold, hvor de spillerne kører på en motorcykel udendørs. Målmanden har ingen motorcykel. @dk
definition: 球员骑在摩托车上进行集体球类运动 @zh-hans
note: Retired. Use Media Topic motorcycling+ sports facet racetype.
in scheme: Media Topic
created: 2009-10-22T02:00:00+00:00
retired: 2017-07-04T12:00:00+00:00
modified: 2021-02-18T12:00:00+00:00
broader: motorcycling

moto-cross
type: Concept
preferred label: Motocross @se
preferred label: موتوكروس @ar
preferred label: motocrosse @pt-pt
preferred label: motocross @pt-br
preferred label: motorcross @dk
preferred label: 摩托车越野赛 @zh-hans
definition: Raced over dirt tracks featuring severe mounds
definition: Motorcykeltävling runt en bana med grus och kraftiga hopp. @se
definition: Rennen über schmutzige Straßen und enge Dämme @de
definition: Corrida de motos em piso de terra com grandes desníveis. @pt-pt
definition: Motorcykelløb på en bane med grus og store hop. @dk
definition: 设置了高难土堆的土路上进行的摩托车比赛 @zh-hans
note: Retired. Use Media Topic motorcycling+ sports facet racetype.
in scheme: Media Topic
created: 2009-10-22T02:00:00+00:00
retired: 2017-07-04T12:00:00+00:00
modified: 2021-02-18T12:00:00+00:00
broader: motorcycling

motoGP
type: Concept
preferred label: 1000 cm3 @es
preferred label: MotoGP @de
preferred label: الجائزة الكبرى لسباق الدراجات النارية @ar
preferred label: Roadracing @se
preferred label: motorcykel grand prix @dk
preferred label: 世界摩托车大奖赛 @zh-hans
preferred label: roadracing @no-nb
definition: Hubraumklasse 1000 Kubikzentimeter @de
definition: Capacity class 1000ccm
definition: Motorcykeltävling på asfaltsbana, ofta samma banor som används för motsvarande biltävlingar. @se
definition: Categoria de 1000cc. @pt-pt
definition: Motorcykelløb på asfaltbane, ofte de samme spor, der bruges til tilsvarende billøb. @dk
definition: 排量1000CC的摩托车赛 @zh-hans
note: Retired. Use Media Topic motorcycling+ sports facet racetype.
in scheme: Media Topic
created: 2009-10-22T02:00:00+00:00
retired: 2017-07-04T12:00:00+00:00
modified: 2021-02-18T12:00:00+00:00
broader: motorcycling

motorcycle rallying
type: Concept
preferred label: رالي @ar
preferred label: Motorcykelrally @se
preferred label: Rallye @de
preferred label: Rally de motos @es
preferred label: rali de motos @pt-pt
preferred label: motorcykel rally @dk
preferred label: 公路摩托车赛 @zh-hans
preferred label: motorsykkelrally @no-nb
definition: Rennen über reguläre Straßen @de
definition: Races run over regular roads
definition: Ta sig på motorcykel till olika punkter, i Sverige ofta som en kortege och inte så mycket tävling. @se
definition: Corridas de motos em estrada. @pt-pt
definition: Motorcykelløb på almindelige veje. @dk
definition: 公路摩托车赛 @zh-hans
note: Retired. Use Media Topicmotorcycling+ sports facet motorcyclingtype
in scheme: Media Topic
created: 2009-10-22T02:00:00+00:00
retired: 2017-07-04T12:00:00+00:00
modified: 2021-02-18T12:00:00+00:00
broader: motorcycling

side-cars
type: Concept
preferred label: Sidvagn @se
preferred label: Sidecars @es
preferred label: دراجة بمقعد جانبي @ar
preferred label: Beiwagen @de
preferred label: Side-Car @fr
preferred label: sidecar @pt-pt
preferred label: sidevognscross @dk
preferred label: 三轮摩托车赛 @zh-hans
preferred label: sidevogner @no-nb
definition: Motorcykeltävling där motorcykeln har en sidvagn monterad och en passagerare hjälper till att hålla balans. @se
definition: Of different engine sizes but attached to a side car featuring a passenger
definition: Mit verschiedenen Motorenstärken aber an der Seite mit einer Sitzmöglichkeit für einen Beifahrer @de
definition: Categoria de veículos com diferentes tamanhos de motor, mas com a característica comum de ter um pequeno carro fixo do lado, para transporte de outro passageiro. @pt-pt
definition: Motorcykelkonkurrence, hvor motorcyklen har en sidevogn monteret og en passager hjælper med, at holde balance. @dk
definition: 配载不同规格发动机的载人三轮摩托车赛 @zh-hans
note: Retired. Use Media Topic motorcycling+ sports facet racetype.
in scheme: Media Topic
created: 2009-10-22T02:00:00+00:00
retired: 2017-07-04T12:00:00+00:00
modified: 2021-05-05T12:00:00+00:00
broader: motorcycling

speedway
type: Concept
preferred label: Speedway @es
preferred label: مضمار @ar
preferred label: 摩托车跑道赛 @zh-hans
definition: Rennen mit bis zu sechs Fahrern in einem flachen ovalen Kurs. Speedway Motorräder haben nur einen Gang und keine Bremsen @de
definition: Motorcykeltävling på en oval bana med normalt fyra tävlande per heat. En tävling består av flera heat där varje åkare är med i några av heaten. Det tävlas både individuellt och i lag. Motorcyklarna har bara en växel och ingen broms. @se
definition: Race involving up to six riders competing over a flat oval track. Speedway motorcycles use only one gear and have no brakes
definition: Corrida com até seis pilotos que competem em pista oval plana. As motos têm apenas uma mudança e não têm travões. @pt-pt
definition: Corrida com até seis pilotos que competem em pista oval plana. As motos têm apenas uma marcha e não têm freios. @pt-br
definition: Motorcykelkonkurrence på en oval bane med normalt fire konkurrenter pr. løb. En konkurrence består af flere heats, hvor hver rytter er inkluderet i nogle heats. De konkurrerer både individuelt og i hold. Motorcyklerne har kun et gear og ingen bremse. @dk
definition: 最多6个骑手参赛。在平整的椭圆形赛道上比赛。本赛事摩托车只有一个档，不带刹车 @zh-hans
note: Retired. Use Media Topicmotorcycling+ sports facet motorcyclingtype
in scheme: Media Topic
created: 2009-10-22T02:00:00+00:00
retired: 2017-07-04T12:00:00+00:00
modified: 2021-02-18T12:00:00+00:00
broader: motorcycling

motorcycling trial
type: Concept
preferred label: Trial @fr
preferred label: Trial (moto) @es
preferred label: دراجات نارية قفز الحواجز @ar
preferred label: trial @pt-pt
preferred label: motorcykel terrænløb @dk
preferred label: 摩托车技术赛 @zh-hans
definition: Motorcykeltävling över avancerade hinder där snabbast tid vinner och där fotisättningar ger tidstillägg. @se
definition: Rennen mit Belastung und Ausdauer durch unterschiedliches Gelände @de
definition: A race of consistency and endurance over varied terrain
definition: Corrida de resistência e regularidade, realizada em percursos acidentados, e em que os pilotos devem ultrapassar vários obstáculos, naturais ou artificiais. @pt-pt
definition: Et løb af konsistens og udholdenhed over varieret terræn. @dk
definition: 在不同地形进行比试稳定性和耐力的摩托车赛 @zh-hans
note: Retired. Use Media Topic motorcycling+ sports facet racetype.
in scheme: Media Topic
created: 2009-10-22T02:00:00+00:00
retired: 2017-07-04T12:00:00+00:00
modified: 2021-02-18T12:00:00+00:00
broader: motorcycling

naginata
type: Concept
preferred label: Naginata @de
preferred label: ناغيناتا @ar
preferred label: 薙刀 @zh-hans
definition: Japansk stridskonst där vapnet är en stång med en vass klinga i änden. @se
definition: Japanese traditional martial art using a pole sword made of wood. 'Naginata' means a spear with a curved blade
definition: Japanische traditionelle Kampfsportart mit einem Holzschwert. 'Naginata' bedeutet Speer mit einem gebogenen Blatt @de
definition: Arte marcial tradicional japonesa que usa uma espada curva de madeira. @pt-pt
definition: Japansk kampsport, hvor våbnet er en stang med et skarpt blad i enden. @dk
definition: 日本传统武术，使用木制棍剑。木剑意思是带弯刃的矛 @zh-hans
change note: Change Note 2015-08-27: broader term changed
in scheme: Media Topic
created: 2009-10-22T02:00:00+00:00
modified: 2021-02-18T12:00:00+00:00
broader: martial arts

ski orienteering
type: Concept
preferred label: Course d'orientation à skis @fr
preferred label: تزلج على الثلج @ar
preferred label: Skidorientering @se
preferred label: Orientación en esquí @es
preferred label: Ski Orientierung @de
preferred label: orientação em esqui @pt-pt
preferred label: skiorientering @dk
preferred label: 定向滑雪 @zh-hans
definition: Einzelzeitrennen auf Skiern über eine mit Fackeln markierte Strecke, die der Wettkämpfer mithilfe von Kompass und Karte in einer bestimmten Reihenfolge finden muss @de
definition: An individual ski time-trial over a route marked out by beacons, that the competitor has to search out and find in a specific order. The contestant makes his way with the help of a compass and map
definition: Fungerar som orientering på barmark med den skillnaden att de tävlande har skidor på fötterna. Med hjälp av karta och kompass ska åkaren hitta fram till ett antal kontroller. @se
definition: Corrida individual de esqui contrarrelógio em percurso assinalado por marcas. O atleta, que prossegue com a ajuda de bússola e mapa, tem que procurar e encontrar as marcas segundo determinada ordem. @pt-pt
definition: Corrida individual de esqui contra o relógio em percurso assinalado por marcas. O atleta, que prossegue com a ajuda de bússola e mapa, tem que procurar e encontrar as marcas segundo determinada ordem. @pt-br
definition: Orienteringsløb hvor konkurrenterne har ski på fødderne. Ved hjælp af et kort og kompas finder skiløberen et antal poster. @dk
definition: 计时滑雪比赛，路线由标志划出。选手必须按特定顺序找到标志。可以使用指南针和地图 @zh-hans
in scheme: Media Topic
created: 2009-10-22T02:00:00+00:00
modified: 2021-02-18T12:00:00+00:00
broader: orienteering

bareback bronc
type: Concept
preferred label: Bareback (rodéo) @fr
preferred label: بدون سرج @ar
preferred label: Sadellös inridning av hästar @se
preferred label: Bareback @de
preferred label: bareback @pt-pt
preferred label: 牧人竞技 @zh-hans
preferred label: innridning av hest uten sal @no-nb
preferred label: innriding av hest utan sal @no-nn
definition: Rodeo discipline
definition: Rodeo Disziplin @de
definition: Ridning på en sadellös häst, som försöker kasta av ryttaren, från början skapad för att hästar måste ridas in av den yrkesutövande cowboyen. @se
definition: Disciplina de rodeio. @pt-pt
definition: Rider på en sadelløs hest, som forsøger at kaste rytteren af. Disciplinen er oprindeligt skabt til heste, der skulle rides til af den professionelle cowboy. @dk
definition: 驯服野马，野牛的比赛 @zh-hans
definition: Rodeo-gren. @no-nb
in scheme: Media Topic
created: 2009-10-22T02:00:00+00:00
modified: 2021-07-12T12:00:00+00:00
broader: rodeo

barrel racing
type: Concept
preferred label: سباق البراميل @ar
preferred label: Barrel racing @es
preferred label: Barrel Racing @de
preferred label: Barrel racing (rodéo) @fr
preferred label: 绕桶赛 @zh-hans
preferred label: tønneløp @no-nb
definition: Tävling där ryttaren rider sin häst på en bana på tid. @se
definition: Rodeo discipline
definition: Rodeo Disziplin @de
definition: Disciplina de rodeio. @pt-pt
definition: Konkurrence, hvor rytteren rider sin hest på en bane på tid. @dk
definition: 一种牛仔竞技比赛 @zh-hans
definition: Rodeo-gren. @no-nb
in scheme: Media Topic
created: 2009-10-22T02:00:00+00:00
modified: 2021-07-12T12:00:00+00:00
broader: rodeo

bull riding
type: Concept
preferred label: ركوب الثيران @ar
preferred label: Bullenreiten @de
preferred label: Rodeo de toros @es
preferred label: Tjurridning @se
preferred label: Bull riding (rodéo) @fr
preferred label: 驯牛 @zh-hans
preferred label: okseridning @no-nb
preferred label: okseriding @no-nn
definition: Rodeo discipline
definition: Tävling där ryttaren rider på en tjur. @se
definition: Rodeo Disziplin @de
definition: Disciplina de rodeio. @pt-pt
definition: Konkurrence, hvor rytteren rider på en tyr. @dk
definition: 一种牛仔竞技比赛 @zh-hans
definition: Rodeo-gren. @no-nb
in scheme: Media Topic
created: 2009-10-22T02:00:00+00:00
modified: 2021-07-12T12:00:00+00:00
broader: rodeo

bulldogging
type: Concept
preferred label: Steer wrestling @se
preferred label: Bulldogging (rodéo) @fr
preferred label: Bulldogging @de
preferred label: صراع الثيران @ar
preferred label: Bulldogging (rodeo) @es
preferred label: 摔牛 @zh-hans
preferred label: oksebryting @no-nb
definition: Rodeo discipline
definition: Tävling där ryttaren hoppar från sin häst och brottar ned en ungtjur genom att ta tag i dess horn. @se
definition: Rodeo Disziplin @de
definition: Disciplina de rodeio. @pt-pt
definition: Konkurrence, hvor rytteren hopper af sin hest og kæmper mod en ung tyr ved, at gribe dets horn. @dk
definition: 一种牛仔竞技比赛 @zh-hans
definition: Rodeo-gren. @no-nb
in scheme: Media Topic
created: 2009-10-22T02:00:00+00:00
modified: 2021-07-12T12:00:00+00:00
broader: rodeo

calf roping
type: Concept
preferred label: Calf roping (rodeo) @es
preferred label: Lasso (kalvar) @se
preferred label: روديو ربط العجل @ar
preferred label: Calf Roping @de
preferred label: Calf roping (rodéo) @fr
preferred label: 套牛犊 @zh-hans
preferred label: lasso (kalv) @no-nb
definition: Infångning av kalvar med hjälp av en lasso, från början skapad för att fånga in kalvar för märkning och dylikt. @se
definition: Rodeo discipline
definition: Rodeo Disziplin @de
definition: Disciplina de rodeio. @pt-pt
definition: At fange kalve ved hjælp af en lasso, oprindeligt skabt til at fange kalve til mærkning og lignende. @dk
definition: 一种牛仔竞技比赛 @zh-hans
definition: Rodeo-gren. @no-nb
in scheme: Media Topic
created: 2009-10-22T02:00:00+00:00
modified: 2021-07-12T12:00:00+00:00
broader: rodeo

goat roping
type: Concept
preferred label: Goat roping (rodéo) @fr
preferred label: Goat Roping @de
preferred label: Lasso (getter) @se
preferred label: Goat roping (rodeo) @es
preferred label: روديو ربط الماعز @ar
preferred label: 套山羊 @zh-hans
preferred label: lasso (geit) @no-nb
definition: Rodeo discipline
definition: Rodeo Disziplin @de
definition: Infångning av getter med hjälp av en lasso, från början skapad för att fånga in getter för märkning och dylikt. @se
definition: Disciplina de rodeio. @pt-pt
definition: At fange geder ved hjælp af en lasso, oprindeligt skabt til at fange geder til mærkning og lignende. @dk
definition: 一种牛仔竞技比赛 @zh-hans
definition: Rodeo-gren. @no-nb
in scheme: Media Topic
created: 2009-10-22T02:00:00+00:00
modified: 2021-07-12T12:00:00+00:00
broader: rodeo

saddle bronc
type: Concept
preferred label: روديو سادل برونك @ar
preferred label: Inridning (med sadel) av hästar @se
preferred label: Saddle Bronc @de
preferred label: Saddle bronc @es
preferred label: Saddle bronc (rodéo) @fr
preferred label: 骑有鞍野马 @zh-hans
preferred label: innridning av hest med sal @no-nb
preferred label: innriding av hest med sal @no-nn
definition: Ridning på en sadelförsedd häst, som försöker kasta av ryttaren, från början skapad för att hästar måste ridas in av den yrkesutövande cowboyen. @se
definition: Rodeo Disziplin @de
definition: Rodeo discipline
definition: Disciplina de rodeio. @pt-pt
definition: At ride på hest med sadel, som forsøger at kaste rytteren af. Oprindeligt skabt til heste, der skal rides af den professionelle cowboy. @dk
definition: 一种牛仔竞技比赛 @zh-hans
definition: Rodeo-gren. @no-nb
in scheme: Media Topic
created: 2009-10-22T02:00:00+00:00
modified: 2021-07-12T12:00:00+00:00
broader: rodeo

roller hockey
type: Concept
preferred label: Roller hockey @fr
preferred label: هوكي @ar
preferred label: Inlinehockey @se
preferred label: Hockey sobre patines @es
preferred label: Rollerhockey @de
preferred label: hóquei em patins @pt-pt
preferred label: rulleskøjtehockey @dk
preferred label: 轮滑曲棍球（冰上曲棍球） @zh-hans
preferred label: rulleskøytehockey @no-nb
definition: Team sport similar to ice hockey, executed on 4 wheel roller skates with sticks and a ball
definition: Själva spelet är som ishockey men de tävlande har rullskridskor (inlines) och underlaget är inte is. @se
definition: Mannschaftssport ähnlich dem Eishockey, gespielt auf vierrädrigen Rollschuhen mit Schlägern und einem Ball @de
definition: Desporto de equipa semelhante ao hóquei no gelo, executado sobre patins de 4 rodas, com tacos e uma bola. @pt-pt
definition: Esporte de equipe semelhante ao hóquei no gelo, executado sobre patins de 4 rodas, com tacos e uma bola. @pt-br
definition: Selve spillet er som ishockey, men konkurrenterne har rulleskøjter (inliners) på og underlaget er ikke is. @dk
definition: 类似冰球的集体运动。穿四轮轮滑，使用球棍击球 @zh-hans
in scheme: Media Topic
created: 2009-10-22T02:00:00+00:00
modified: 2021-02-18T12:00:00+00:00
broader: roller sports

coxed four
type: Concept
preferred label: تجديف رباعي بالدفة @ar
preferred label: Quatre barré (aviron) @fr
preferred label: Fyra med styrman @se
preferred label: Cuatro con timonel (remo) @es
preferred label: Vierer @de
preferred label: quatro com timoneiro @pt-pt
preferred label: firer med styrmand @dk
preferred label: 四人单桨有舵赛艇比赛 @zh-hans
preferred label: firer med styrmann @no-nb
preferred label: firar med styrmann @no-nn
definition: Four person boats with just one oar each and with a team mate to give directions
definition: Boot für vier Personen und einem Ruder für jeden mit Steuermann @de
definition: Barco de quatro pessoas com apenas um remo cada uma e com um companheiro de equipa para dar instruções. @pt-pt
definition: Barco de quatro pessoas com apenas um remo cada uma e com um companheiro de equipe para dar instruções. @pt-br
definition: Firepersoners både med kun een åre til hver person og med en styrmand til at sætte kursen. @dk
definition: 四人单桨有舵赛艇比赛，有一人掌控方向 @zh-hans
in scheme: Media Topic
created: 2009-10-22T02:00:00+00:00
retired: 2015-02-24T12:00:00+00:00
modified: 2021-12-21T12:00:00+00:00
broader: rowing
broad match: http://cv.iptc.org/newscodes/subjectcode/15047000

coxed pair
type: Concept
preferred label: Par con timonel (remo) @es
preferred label: Zweier @de
preferred label: تجديف زوجي بالدفة @ar
preferred label: Deux barré (aviron) @fr
preferred label: Tvåa med styrman @se
preferred label: dois com timoneiro @pt-pt
preferred label: toer med styrmand @dk
preferred label: 双人单桨有舵赛艇比赛 @zh-hans
preferred label: toer med styrmann @no-nb
preferred label: toar med styrmann @no-nn
definition: Boot für zwei Personen mit einem Ruder für jeden und mit Steuermann @de
definition: Two person boats with just one oar each and with a team mate to give directions
definition: Barco de duas pessoas com apenas um remo cada uma e com um companheiro de equipa para dar instruções. @pt-pt
definition: Barco de duas pessoas com apenas um remo cada uma e com um companheiro de equipe para dar instruções. @pt-br
definition: Topersoners både med kun een åre til hver person og med en styrmand til at sætte kursen. @dk
definition: 双人人单桨有舵赛艇比赛，有一人掌控方向 @zh-hans
in scheme: Media Topic
created: 2009-10-22T02:00:00+00:00
retired: 2015-02-24T12:00:00+00:00
modified: 2021-12-21T12:00:00+00:00
broader: rowing
broad match: http://cv.iptc.org/newscodes/subjectcode/15047000

coxless four
type: Concept
preferred label: Quatre sans barreur (aviron) @fr
preferred label: تجديف رباعي بلا دفة @ar
preferred label: Fyra utan styrman @se
preferred label: Cuatro sin timonel (remo) @es
preferred label: Vierer ohne Steuermann @de
preferred label: quatro sem timoneiro @pt-pt
preferred label: firer uden styrmand @dk
preferred label: 四人单桨无舵赛艇比赛 @zh-hans
preferred label: firer uten styrmann @no-nb
preferred label: firar utan styrmann @no-nn
definition: Four person boats with just one oar each and without a team mate to give directions
definition: Boot für vier Personen und einem Ruder für jeden ohne Steuermann @de
definition: Barco de quatro pessoas com apenas um remo cada uma e sem companheiro de equipa para dar instruções. @pt-pt
definition: Barco de quatro pessoas com apenas um remo cada uma e sem companheiro de equipe para dar instruções. @pt-br
definition: Firepersoners både med kun een åre til hver person og uden en styrmand til at sætte kursen. @dk
definition: 四人单桨无舵赛艇比赛，无人掌控方向 @zh-hans
in scheme: Media Topic
created: 2009-10-22T02:00:00+00:00
retired: 2015-02-24T12:00:00+00:00
modified: 2021-12-21T12:00:00+00:00
broader: rowing

coxless pair
type: Concept
preferred label: Zweier ohne Steuermann @de
preferred label: تجديف زوجي بلا دفة @ar
preferred label: Tvåa utan styrman @se
preferred label: Deux sans barreur (aviron) @fr
preferred label: Par sin timonel (remo) @es
preferred label: dois sem timoneiro @pt-pt
preferred label: toer uden styrmand @dk
preferred label: 双人单桨无舵赛艇比赛 @zh-hans
preferred label: toer uten styrmann @no-nb
preferred label: toar utan styrmann @no-nn
definition: Two person boats with just one oar each and without a team mate to give directions
definition: Boot für zwei Personen mit einem Ruder für jeden und ohne Steuermann @de
definition: Barco de duas pessoas com apenas um remo cada uma e sem companheiro de equipa para dar instruções. @pt-pt
definition: Barco de duas pessoas com apenas um remo cada uma e sem companheiro de equipe para dar instruções. @pt-br
definition: Topersoners både med kun een åre til hver person og uden en styrmand til at sætte kursen. @dk
definition: 双人人单桨无舵赛艇比赛，无人掌控方向 @zh-hans
in scheme: Media Topic
created: 2009-10-22T02:00:00+00:00
retired: 2015-02-24T12:00:00+00:00
modified: 2021-12-21T12:00:00+00:00
broader: rowing

double sculls
type: Concept
preferred label: Doppelzweier @de
preferred label: Deux de couple (aviron) @fr
preferred label: تجديف زوجي @ar
preferred label: Dubbelsculler @se
preferred label: Scull double (remo) @es
preferred label: dobbeltsculler @dk
preferred label: 双人双桨赛艇 @zh-hans
definition: Two person boats with two oars each
definition: Boot für zwei Personen mit je zwei Rudern @de
definition: Barco de duas pessoas com dois remos cada uma. @pt-pt
definition: Topersoners båd med to årer hver. @dk
definition: 双人，每人双桨赛艇比赛 @zh-hans
in scheme: Media Topic
created: 2009-10-22T02:00:00+00:00
retired: 2015-02-24T12:00:00+00:00
modified: 2021-12-21T12:00:00+00:00
broader: rowing

coxed eight
type: Concept
preferred label: تجديف ثماني بالدفة @ar
preferred label: Åttamanna @se
preferred label: Huit (aviron) @fr
preferred label: Achter @de
preferred label: Ocho con timonel (remo) @es
preferred label: oito com timoneiro @pt-pt
preferred label: otter med styrmand @dk
preferred label: 八人单桨有舵赛艇比赛 @zh-hans
preferred label: åtter med styrmann @no-nb
preferred label: åttar med styrmann @no-nn
definition: Eight person boats with just one oar each and with a team mate to give directions
definition: Boot für acht Personen und einem Ruder pro Person mit Steuermann @de
definition: Barco de oito pessoas com apenas um remo cada uma e com um companheiro de equipa para dar instruções. @pt-pt
definition: Barco de oito pessoas com apenas um remo cada uma e com um companheiro de equipe para dar instruções. @pt-br
definition: Otte-personers både med kun een åre til hver person og med en styrmand til at sætte kursen. @dk
definition: 八人单桨有舵赛艇比赛，有一人掌控方向 @zh-hans
in scheme: Media Topic
created: 2009-10-22T02:00:00+00:00
retired: 2015-02-24T12:00:00+00:00
modified: 2021-12-21T12:00:00+00:00
broader: rowing
broad match: http://cv.iptc.org/newscodes/subjectcode/15047006

quadruple sculls
type: Concept
preferred label: تجديف رباعي @ar
preferred label: Doppelvierer @de
preferred label: Fyrsculler @se
preferred label: Scull cuádruple (remo) @es
preferred label: Quatre de couple (aviron) @fr
preferred label: dobbeltfirer @dk
preferred label: 四人双桨赛艇 @zh-hans
preferred label: dobbeltfirar @no-nn
definition: Four person boats with two oars each and without a team mate to give directions
definition: Boot für vier Personen mit je zwei Rudern und ohne den Steuermann @de
definition: Barco de quatro pessoas com dois remos cada uma e sem companheiro de equipa para dar instruções. @pt-pt
definition: Barco de quatro pessoas com dois remos cada uma e sem companheiro de equipe para dar instruções. @pt-br
definition: Firepersoners båd med to årer hver uden styrmand. @dk
definition: 四人，每人双桨，无人掌控方向 @zh-hans
in scheme: Media Topic
created: 2009-10-22T02:00:00+00:00
retired: 2015-02-24T12:00:00+00:00
modified: 2021-12-21T12:00:00+00:00
broader: rowing

single sculls
type: Concept
preferred label: Singelsculler @se
preferred label: Einer @de
preferred label: Scull individual (remo) @es
preferred label: تجديف فردي @ar
preferred label: Skiff (aviron) @fr
preferred label: skiff @pt-pt
preferred label: singlesculler @dk
preferred label: 单人双桨赛艇 @zh-hans
definition: Boot für eine Person mit zwei Rudern @de
definition: Single person boats with two oars
definition: Barco de uma pessoa com dois remos. @pt-pt
definition: Enpersons båd med to årer hver uden styrmand. @dk
definition: 单人双桨赛艇 @zh-hans
in scheme: Media Topic
created: 2009-10-22T02:00:00+00:00
retired: 2015-02-24T12:00:00+00:00
modified: 2021-12-21T12:00:00+00:00
broader: rowing

rugby league
type: Concept
preferred label: Rugby League @se
preferred label: Rugby a 13 @es
preferred label: Rugby à XIII @fr
preferred label: Rugbyliga @de
preferred label: دوري الركبي @ar
preferred label: râguebi de 13 @pt-pt
preferred label: rúgbi de 13 @pt-br
preferred label: rugby league (13-mands rugby) @dk
preferred label: 英式橄榄球联盟赛 @zh-hans
preferred label: 13-mannsrugby @no-nb
definition: A type of rugby where two teams of 13 compete on a pitch by running with and passing an oval ball. Points are scored by touching down the ball behind the goal line or kicking it between goal posts. Governed by Rugby League International Federation.
definition: Variant av rugby där två 13-mannalag spelar på en bana där de passar och springer med en oval boll. Poäng får lagen genom att placera bollen i motståndarnas målzon eller sparka den mellan målstolparna. @se
definition: Zwei Teams mit je 13 Spielern kämpfen um Punktabstand, indem sie Versuche und Strafpunkte bekommen durch Rennen und werfen eines ovalen Balles, der hinter der Torlinie den Boden berühren muss oder zwischen zwei Torpfosten geschossen wird in einem harten körperlichen Wettkampf @de
definition: Jogo de bola em campo relvado opondo duas equipas de 13 jogadores, que tentam marcar ensaios e penalidades correndo e passando uma bola oval com as mãos e os pés. @pt-pt
definition: Jogo de bola em campo gramado opondo duas equipes de 13 jogadores, que tentam marcar ensaios e penalidades correndo e passando uma bola oval com as mãos e os pés. @pt-br
definition: En type rugby, hvor to hold af 13 konkurrerer på en bane ved, at løbe med og kaste en oval bold. Point scores ved at føre bolden bag mållinjen eller sparke den mellem målstolperne. Styret af Rugby League International Føderation. @dk
definition: 一种橄榄球比赛。两个队，每队13人。可以带球跑、传。带球过对方球门线后触地或踢球于对方门柱内得分。由国际橄榄球联盟组织管理 @zh-hans
change note: 2016-04-05: Broader concept changed, definition slightly modified.
in scheme: Media Topic
created: 2009-10-22T02:00:00+00:00
modified: 2021-07-12T12:00:00+00:00
broader: rugby

rugby union
type: Concept
preferred label: اتحاد الركبي @ar
preferred label: Rugby Union @de
preferred label: Rugby à XV @fr
preferred label: Rugby a XV @es
preferred label: râguebi de 15 @pt-pt
preferred label: rúgbi de 15 @pt-br
preferred label: rugby union (15-mands rugby) @dk
preferred label: 联合会式橄榄球 @zh-hans
preferred label: 15-mannsrugby @no-nb
definition: Variant av rugby där två 15-mannalag spelar på en bana där de passar och springer med en oval boll. Poäng får lagen genom att placera bollen i motståndarnas målzon eller sparka den mellan målstolparna. @se
definition: Zwei Teams mit je 15 Spielern kämpfen um Punktabstand, indem sie Versuche und Strafpunkte bekommen durch Rennen und werfen eines ovalen Balles, der hinter der Torlinie den Boden berühren muss oder zwischen zwei Torpfosten geschossen wird in einem harten körperlichen Wettkampf @de
definition: A type of rugby where two teams of 15 compete on a pitch by running with and passing an oval ball. Points are scored by touching down the ball behind the goal line or kicking it between goal posts. Governed by the World Rugby organization.
definition: Jogo de bola em campo relvado opondo duas equipas de 15 jogadores, que tentam marcar ensaios e penalidades correndo e passando uma bola oval com as mãos e os pés. @pt-pt
definition: Jogo de bola em campo gramado opondo duas equipes de 15 jogadores, que tentam marcar ensaios e penalidades correndo e passando uma bola oval com as mãos e os pés. @pt-br
definition: En type rugby, hvor to hold af 15 konkurrerer på en bane ved, at løbe med og kaste en oval bold. Point scores ved at føre bolden bag mållinjen eller sparke den mellem målstolperne. Styret af Rugby League International Federation. @dk
definition: 一种橄榄球比赛。两个队，每队15人。可以带球跑、传。带球过对方球门线后触地或踢球于对方门柱内得分。由世界橄榄球联合会组织管理 @zh-hans
definition: Rugby union @no-nn
change note: 2016-04-05: Broader concept changed, definition slightly modified.
in scheme: Media Topic
created: 2009-10-22T02:00:00+00:00
modified: 2021-02-18T12:00:00+00:00
broader: rugby

rugby sevens
type: Concept
preferred label: Sjumannarugby @se
preferred label: Rugby 7 @de
preferred label: Rugby à VII @fr
preferred label: سباعيات الرغبي @ar
preferred label: râguebi de 7 @pt-pt
preferred label: rúgbi de 7 @pt-br
preferred label: rugby sevens (7-mands rugby) @dk
preferred label: 七人制橄榄球 @zh-hans
preferred label: 7-mannsrugby @no-nb
definition: A type of rugby union where two teams of 7 compete on a pitch by running with and passing an oval ball. Points are scored by touching down the ball behind the goal line or kicking it between goal posts. Governed by the World Rugby organization.
definition: Variant av rugby där två sjumannalag spelar på en bana där de passar och springer med en oval boll. Poäng får lagen genom att placera bollen i motståndarnas målzon eller sparka den mellan målstolparna. @se
definition: Ein lustigere und aufregendere Variante, bei der zwei Teams mit je 7 Spielern um Punktabstand kämpfen, indem sie Versuche und Strafpunkte bekommen durch Rennen und werfen eines ovalen Balles, der hinter der Torlinie den Boden berühren muss oder zwischen zwei Torpfosten geschossen wird in einem harten körperlichen Wettkampf @de
definition: Jogo de bola em campo relvado opondo duas equipas de 7 jogadores, que tentam marcar ensaios e penalidades correndo e passando uma bola oval com as mãos e os pés. @pt-pt
definition: Jogo de bola em campo gramado opondo duas equipes de 7 jogadores, que tentam marcar ensaios e penalidades correndo e passando uma bola oval com as mãos e os pés. @pt-br
definition: En type rugby, hvor to hold af 7 konkurrerer på en bane ved, at løbe med og kaste en oval bold. Point scores ved at føre bolden bag mållinjen eller sparke den mellem målstolperne. Styret af Rugby League International Føderation. @dk
definition: 一种橄榄球比赛。两个队，每队7人。可以带球跑、传。带球过对方球门线后触地或踢球于对方门柱内得分。由世界橄榄球组织管理 @zh-hans
change note: 2016-04-05: Broader concept changed, definition slightly modified.
in scheme: Media Topic
created: 2009-10-22T02:00:00+00:00
modified: 2021-07-12T12:00:00+00:00
broader: rugby

multihull
type: Concept
preferred label: Multicoques @fr
preferred label: Katamaran och trimaran @se
preferred label: Multicasco @es
preferred label: Mehrmaster @de
preferred label: مالتيهال @ar
preferred label: multicasco @pt-pt
preferred label: 多体船 @zh-hans
preferred label: flerskrogsbåter @no-nb
preferred label: fleirskrogbåtar @no-nn
definition: Boot mit mehreren Masten @de
definition: Sailing boats with multiple hulls
definition: Tävlingar med segelbåtar med flera skrov. @se
definition: Embarcação de vários cascos. @pt-pt
definition: Sejlbåde med flere skrog. @dk
definition: 多体帆船 @zh-hans
note: Retired. Use Media Topic sailing + sports facet sailingtype.
in scheme: Media Topic
created: 2009-10-22T02:00:00+00:00
retired: 2017-07-04T12:00:00+00:00
modified: 2021-05-05T12:00:00+00:00
broader: sailing

dinghy
type: Concept
preferred label: Dinghy @de
preferred label: دينغي @ar
preferred label: Dériveur @fr
preferred label: Jolle @se
preferred label: Vela ligera @es
preferred label: jolle @dk
preferred label: 舢板 @zh-hans
definition: Boot mit einem Mast ohne festen Kiel @de
definition: Single hulled vessel without a fixed keel
definition: Tävlingar med en typ av segelbåt med centerbord i stället för fast köl. @se
definition: Embarcação de casco simples sem quilha fixa. @pt-pt
definition: Konkurrencer med en sejlbåd med midterbord i stedet for fast køl. @dk
definition: 无固定龙骨单体船 @zh-hans
note: Retired. Use Media Topic sailing + sports facet sailingtype.
in scheme: Media Topic
created: 2009-10-22T02:00:00+00:00
retired: 2017-07-04T12:00:00+00:00
modified: 2021-02-18T12:00:00+00:00
broader: sailing
broad match: http://cv.iptc.org/newscodes/subjectcode/15050013

keelboat
type: Concept
preferred label: Kölbåt @se
preferred label: Quillard @fr
preferred label: قارب شراعي @ar
preferred label: Kielboot @de
preferred label: Quilla @es
preferred label: kølbåd @dk
preferred label: 龙骨船 @zh-hans
preferred label: kjølbåt @no-nb
definition: Boot mit einem Mast mit festem Kiel @de
definition: Tävlingar med en typ av segelbåt där kölen helt består av eller innehåller ballast. @se
definition: Single hulled vessel with a fixed keel
definition: Embarcação de casco simples com quilha fixa. @pt-pt
definition: Enkelt skrog med fast køl. @dk
definition: 固定龙骨单体船 @zh-hans
note: Retired. Use Media Topic sailing + sports facet sailingtype.
in scheme: Media Topic
created: 2009-10-22T02:00:00+00:00
retired: 2017-07-04T12:00:00+00:00
modified: 2021-05-05T12:00:00+00:00
broader: sailing
broad match: http://cv.iptc.org/newscodes/subjectcode/15050013

sailing regatta
type: Concept
preferred label: Regata @es
preferred label: Regatta @de
preferred label: Régate @fr
preferred label: سباق زوارق @ar
preferred label: regata à vela @pt-pt
preferred label: regata a vela @pt-br
preferred label: regattasejlads @dk
preferred label: 帆船赛 @zh-hans
preferred label: regatta @no-nb
definition: Segel Ereignis @de
definition: Sailing event
definition: En enstaka eller en serie segeltävlingar. @se
definition: Evento com embarcação dotada de vela. @pt-pt
definition: En enkelt eller en række sejlads-konkurrencer. @dk
definition: 帆船赛事 @zh-hans
note: Retired. Use Media Topic sailing + sports facet sailingtype.
in scheme: Media Topic
created: 2009-10-22T02:00:00+00:00
retired: 2017-07-04T12:00:00+00:00
modified: 2021-05-05T12:00:00+00:00
broader: sailing
broad match: http://cv.iptc.org/newscodes/subjectcode/15050000

ocean sailing
type: Concept
preferred label: Meersegeln @de
preferred label: Regata transatlántica @es
preferred label: Course transatlantique @fr
preferred label: سباق قوارب في المحيط @ar
preferred label: Havskappsegling @se
preferred label: regata oceânica @pt-pt
preferred label: oceansejllads @dk
preferred label: 远洋航行赛 @zh-hans
preferred label: hav-regatta @no-nb
preferred label: havregatta @no-nn
definition: Segeln auf offener See als Teil eines Rennens @de
definition: Segeltävlingar över en eller flera oceaner. @se
definition: Sailing vessels across oceans as part of a competitive race.
definition: Corrida de embarcações à volta do mundo através dos oceanos. @pt-pt
definition: Konkurrencer med sejlskibe over eet eller flere oceaner. @dk
definition: 跨大洋航海比赛 @zh-hans
note: Retired. Use Media Topic sailing + sports facet sailingtype.
in scheme: Media Topic
created: 2009-10-22T02:00:00+00:00
retired: 2017-07-04T12:00:00+00:00
modified: 2021-05-05T12:00:00+00:00
broader: sailing
broad match: http://cv.iptc.org/newscodes/subjectcode/15050000

round the world race
type: Concept
preferred label: سباق قوارب حول العالم @ar
preferred label: Course autour du monde @fr
preferred label: Rund um die Welt @de
preferred label: Världsomsegling @se
preferred label: Carrera alrededor del mundo @es
preferred label: corrida de volta ao mundo @pt-pt
preferred label: verdensomsejling @dk
preferred label: 环球帆船赛 @zh-hans
preferred label: verden rundt-regatta @no-nb
preferred label: verda rundt-regatta @no-nn
definition: Sailing vessels around the world as a race
definition: Segeltävlingar runt jorden. @se
definition: Segeln rund um die Welt als Teil eines Rennens @de
definition: Corrida de embarcações em mar aberto à volta do mundo. @pt-pt
definition: Sejlkonkurrencer rundt om jorden. @dk
definition: 帆船作为比赛项目绕地球环海航行 @zh-hans
note: Retired. Use Media Topic sailing + sports facet sailingtype.
in scheme: Media Topic
created: 2009-10-22T02:00:00+00:00
retired: 2017-07-04T12:00:00+00:00
modified: 2021-05-05T12:00:00+00:00
broader: sailing

solo ocean sailing
type: Concept
preferred label: Ensamsegling @se
preferred label: Regata en solitario @es
preferred label: Meersegeln Solo @de
preferred label: سباق قوارب منفرد في المحيط @ar
preferred label: Course en solitaire @fr
preferred label: regata em solitário @pt-pt
preferred label: solo oceansejlads @dk
preferred label: 单人远洋航行 @zh-hans
preferred label: solo-seilas @no-nb
preferred label: solosegling @no-nn
definition: Segeln als Einzelperson auf offener See als Teil eines Rennens @de
definition: Sailing oceans as an individual, as part of a race.
definition: Segeltävlingar där seglaren måste vara ensam. @se
definition: Corrida de embarcações com um só tripulante à volta do mundo através dos oceanos. @pt-pt
definition: Sejlkonkurrencer, hvor sejleren skal være alene. @dk
definition: 单人远洋航行赛 @zh-hans
note: Retired. Use Media Topic sailing + sports facet sailingtype.
in scheme: Media Topic
created: 2009-10-22T02:00:00+00:00
retired: 2017-07-04T12:00:00+00:00
modified: 2021-05-05T12:00:00+00:00
broader: sailing
broad match: http://cv.iptc.org/newscodes/subjectcode/15050000

non-stop solo race
type: Concept
preferred label: Non-Stop Solo @de
preferred label: سباق قوارب منفرد @ar
preferred label: Ensamsegling jorden runt @se
preferred label: Course autour du monde sans escale en solitaire @fr
preferred label: Vuelta al mundo en solitario sin escalas @es
preferred label: non-stop em solitário @pt-pt
preferred label: non-stop solo løb @dk
preferred label: 单人不间断环球航海 @zh-hans
preferred label: non-stop solo-regatta @no-nb
preferred label: nonstop soloregatta @no-nn
definition: Races either clockwise or anti clockwise around the globe without stopping at any ports between start and finish of race.
definition: Segeltävlingar runt jorden där seglaren måste vara ensam och inte får lägga till i någon hamn på vägen. @se
definition: Rennen gegen oder im Uhrzeigersinn einmal um die Welt ohne Stopp zwischen Start und Ziel des Rennens @de
definition: Corrida à volta do mundo feita no sentido dos ponteiros do relógio ou no sentido contrário e sem parar em qualquer porto entre o início e o fim da corrida. @pt-pt
definition: Corrida à volta do mundo feita no sentido horário ou anti-horário e sem parar em qualquer porto entre o início e o fim da corrida. @pt-br
definition: Sejlkonkurrence rundt om jorden, hvor sejleren skal være alene og ikke have tilladelse til at lægge til i nogen havn på vejen. @dk
definition: 顺时针或逆时针绕地球环海航行，不在起航站和终航站之间的任何港口停留 @zh-hans
note: Retired. Use Media Topic sailing + sports facet sailingtype.
in scheme: Media Topic
created: 2009-10-22T02:00:00+00:00
retired: 2017-07-04T12:00:00+00:00
modified: 2021-02-18T12:00:00+00:00
broader: sailing
broad match: http://cv.iptc.org/newscodes/subjectcode/15050012

pistol shooting
type: Concept
preferred label: Tir au pistolet @fr
preferred label: Pistola @es
preferred label: Pistole @de
preferred label: رماية مسدس @ar
preferred label: Pistol @se
preferred label: pistola @pt-pt
preferred label: pistolskydning @dk
preferred label: 手枪射击 @zh-hans
preferred label: 25 meter pistol @no-nb
definition: Shooting event using a pistol
definition: En sportskyttegren där man använder en pistol. @se
definition: Schießwettkampf mit Pistole @de
definition: Prova de tiro com pistola. @pt-pt
definition: En skydedisciplin, hvor man anvender pistol. @dk
definition: 使用手枪的射击活动 @zh-hans
note: Retired. Use Media Topic sport shooting + sports facet shootingtype.
in scheme: Media Topic
created: 2009-10-22T02:00:00+00:00
retired: 2017-07-04T12:00:00+00:00
modified: 2021-02-18T12:00:00+00:00
broader: sport shooting
broad match: http://cv.iptc.org/newscodes/subjectcode/15051001

rifle shooting
type: Concept
preferred label: Gewehr @de
preferred label: Tir à la carabine @fr
preferred label: Carabina @es
preferred label: Gevär @se
preferred label: رماية بندقية @ar
preferred label: carabina @pt-pt
preferred label: riffelskydning @dk
preferred label: 步枪射击 @zh-hans
preferred label: geværskyting @no-nb
definition: Shooting event using a rifle
definition: En sportskyttegren där man använder ett gevär. @se
definition: Schießwettkampf mit Gewehr @de
definition: Prova de tiro com carabina. @pt-pt
definition: En skydedisciplin, hvor man anvender en riffel. @dk
definition: 使用步枪的射击活动 @zh-hans
note: Retired. Use Media Topic sport shooting + sports facet shootingtype.
in scheme: Media Topic
created: 2009-10-22T02:00:00+00:00
retired: 2017-07-04T12:00:00+00:00
modified: 2021-05-05T12:00:00+00:00
broader: sport shooting
broad match: http://cv.iptc.org/newscodes/subjectcode/15051002

running target shooting
type: Concept
preferred label: Tir à la cible mobile @fr
preferred label: Laufende Scheibe @de
preferred label: Running target @se
preferred label: رماية هدف متحرك @ar
preferred label: Blanco en movimiento @es
preferred label: alvo móvel @pt-pt
preferred label: skydning efter bevægeligt mål @dk
preferred label: 跑靶射击 @zh-hans
preferred label: løpende blink @no-nb
preferred label: løpande blink @no-nn
definition: En sportskyttegren för luftpistol med rörliga mål på olika långa målbanor och med olika långa visningstider. @se
definition: Shooting event with an airgun and a target that moves sideways
definition: Schießwettkampf mit einem Luftgewehr und einer Scheibe, die sich seitwärts bewegt @de
definition: Prova de tiro com uma arma ar comprimido e um alvo que se move para os lados. @pt-pt
definition: Prova de tiro com uma arma de pressão e um alvo que se move para os lados. @pt-br
definition: En skydedisciplin, med luftpistol mod bevægelige mål på forskellige lange målbaner og på tid. @dk
definition: 用气枪射击的比赛。目标相对于射手左右移动 @zh-hans
note: Retired. Use Media Topic sport shooting + sports facet shootingtype.
in scheme: Media Topic
created: 2009-10-22T02:00:00+00:00
retired: 2017-07-04T12:00:00+00:00
modified: 2021-05-05T12:00:00+00:00
broader: sport shooting
broad match: http://cv.iptc.org/newscodes/subjectcode/15051003

shotgun shooting
type: Concept
preferred label: Schnellfeuerpistole @de
preferred label: رماية ببندقية الصيد @ar
preferred label: Hagelgevär @se
preferred label: Escopeta @es
preferred label: Tir au fusil @fr
preferred label: espingarda @pt-pt
preferred label: skeetskydning @dk
preferred label: 猎枪射击 @zh-hans
preferred label: hagleskyting @no-nb
definition: En sportskyttegren där man använder ett hagelgevär. @se
definition: Shooting event using a shotgun
definition: Schießwettkampf mit einer Schnellfeuerpistole @de
definition: Prova de tiro com espingarda. @pt-pt
definition: En skydedisciplin, hvor man anvender haglgevær. @dk
definition: 使用猎枪的射击活动 @zh-hans
note: Retired. Use Media Topic sport shooting + sports facet shootingtype.
in scheme: Media Topic
created: 2009-10-22T02:00:00+00:00
retired: 2017-07-04T12:00:00+00:00
modified: 2021-05-05T12:00:00+00:00
broader: sport shooting
broad match: http://cv.iptc.org/newscodes/subjectcode/15051004

clay pigeon shooting
type: Concept
preferred label: رماية الصحن الطائر @ar
preferred label: Blancos de la arcilla @es
preferred label: Sportpistole @de
preferred label: Tir aux plateaux d'argile @fr
preferred label: Lerduveskytte @se
preferred label: tiro ao prato @pt-pt
preferred label: flugtskydning @dk
preferred label: 飞碟射击 @zh-hans
preferred label: leirdueskyting @no-nb
definition: En sportskyttegren för hagelgevär mot lerduvor, som kastats ut av en maskin eller för hand i disciplinerna skeet, trap och sporting. @se
definition: Schießwettkampf bei dem auf fliegende Scheiben gezielt wird @de
definition: Shooting event which involves shooting at special flying targets, known as clay pigeons or clay targets
definition: Prova de tiro em que o atirador dispara contra alvos lançados ao ar, conhecidos como pratos. @pt-pt
definition: En skydedisciplin, der involverer skydning mod specielle flyvende mål, kendt som lerduer eller lermål. @dk
definition: 射击特殊的飞行目标。目标被称为黏土鸽子或蝶形飞靶 @zh-hans
note: Retired. Use Media Topic sport shooting + sports facet shootingtype.
in scheme: Media Topic
created: 2009-10-22T02:00:00+00:00
retired: 2017-07-04T12:00:00+00:00
modified: 2021-05-05T12:00:00+00:00
broader: sport shooting
broad match: http://cv.iptc.org/newscodes/subjectcode/15051005

alpine skiing
type: Concept
preferred label: Alpint @se
preferred label: Ski alpin @fr
preferred label: تزلج @ar
preferred label: Esquí alpino @es
preferred label: esqui alpino @pt-pt
preferred label: alpint skiløb @dk
preferred label: 高山滑雪 @zh-hans
preferred label: alpint @no-nb
definition: Racing downhill on snow-covered slopes using alpine techniques and equipment. The slopes contain intermediate gates which are spaced according to the discipline involved.
definition: Abfahrtsschnelllauf auf schneebedeckten Pisten. Die Hänge haben verschiedene Tore, deren Abstand abhängig ist von der jeweiligen Disziplin @de
definition: Tävling nedför snöklädda backar genom att använda alpin teknik och utrustning. Backarna har markerade portar som är utplacerade olika beroende på vilken sorts utförsåkning det gäller. @se
definition: Esquiar por uma encosta abaixo, em pistas cobertas de neve, usando técnicas e equipamento alpinos. As pistas têm pórticos espaçados de acordo com a disciplina envolvida. @pt-pt
definition: Skiløb i snedækket skrående bjergterræn ved hjælp af alpin teknik og udstyr. Pisterne har markerede porte, der er anbragt forskelligt afhængigt af typen skiløb. @dk
definition: 使用高山滑雪技术和设备从山坡雪道滑下。雪道上根据项目不同设置必须通过的门 @zh-hans
in scheme: Media Topic
created: 2009-10-22T02:00:00+00:00
modified: 2021-02-18T12:00:00+00:00
broader: skiing
has facet: alpineskiingtype

freestyle skiing
type: Concept
preferred label: Esquí estilo libre @es
preferred label: Freestyle Ski @de
preferred label: تزلج حر @ar
preferred label: Ski acrobatique @fr
preferred label: Freestyle @se
preferred label: esqui estilo livre @pt-pt
preferred label: freestyle skiløb @dk
preferred label: 自由式滑雪 @zh-hans
preferred label: fristil @no-nb
definition: Alternativ form av skidtävling i alpin miljö. De tävlande åker puckelpist, gör konstnärliga hopp eller genomför konstnärliga rörelser på väg nedför backen. Kombination av tid och domarpoäng. @se
definition: Wettkämpfer zeigen eine Reihe von atemberaubenden akrobatischen Sätzen mit vorbereiteten Sprüngen. Kombiniert mit Trickski, Schanzenspringen und Skiballett @de
definition: Skiing competitions which, in contrast to alpine skiing, incorporate acrobatic moves and jumps. Events include aerials, halfpipe, slopestyle, ski cross, moguls and big air.
definition: Os esquiadores realizam uma série de figuras acrobáticas após saltar de uma rampa. Mistura de *moguls* (bossas ou lombas na pista), saltos e balé em esqui. @pt-pt
definition: Alternativ form for skiløb i alpint miljø. Konkurrenterne kører på pukkelpister, foretager kunstneriske spring eller udfører kunstneriske bevægelser på vej ned ad bakken. Kombination af tid og dommerpoint. @dk
definition: 滑雪者起跳后表演惊险的技巧动作。可以组合雪上技巧，跳跃和雪上芭蕾等动作 @zh-hans
in scheme: Media Topic
created: 2009-10-22T02:00:00+00:00
modified: 2022-02-03T12:00:00+00:00
broader: skiing
has facet: freestyleskiingtype

grass skiing
type: Concept
preferred label: Grässkidåkning @se
preferred label: Ski sur herbe @fr
preferred label: تزلج على العشب @ar
preferred label: Grasski @de
preferred label: Esquí sobre césped @es
preferred label: esqui na relva @pt-pt
preferred label: esqui na grama @pt-br
preferred label: skiløb på græs @dk
preferred label: 滑草 @zh-hans
preferred label: gresski @no-nb
preferred label: grasski @no-nn
definition: Alpiner Skirennsport mit Rollskiern auf Graspisten @de
definition: Alpine skiing on roller skis and grass
definition: Alpin skidåkning med rullskidor på gräs. @se
definition: Esqui alpino em patins com rodas sobre relva. @pt-pt
definition: Esqui alpino em patins com rodas sobre grama. @pt-br
definition: Alpint skiløb med rulleski på græs. @dk
definition: 使用轮滑从高处草地上下滑 @zh-hans
in scheme: Media Topic
created: 2009-10-22T02:00:00+00:00
modified: 2021-02-18T12:00:00+00:00
broader: skiing

Nordic skiing
type: Concept
preferred label: Längdåkning, nordisk @se
preferred label: Ski nordique @fr
preferred label: تزلج شمالي @ar
preferred label: Ski nordisch @de
preferred label: Esquí nórdico @es
preferred label: esqui nórdico @pt-pt
preferred label: nordisk disciplin @dk
preferred label: 北欧滑雪 @zh-hans
preferred label: nordiske grener @no-nb
preferred label: nordiske greiner @no-nn
definition: Practiced in relatively-flat, snowy countryside and based on power and endurance.
definition: Skidåkning i preparerade spår av varierande distans genom olika terränger. @se
definition: Findet in eher flachem, schneebedeckten Gelände statt und basiert auf Kraft und Ausdauer. @de
definition: Modalidade de esqui praticada na natureza e baseado na força e na resistência. Há eventos clássicos e de estilo livre, com largada coletiva ou individual. @pt-pt
definition: Skiløb i præparerede stier i forskellige afstande gennem forskellige terræn. @dk
definition: 在相对平整有雪的野外进行的越野滑雪比赛，比拼耐力和体力 @zh-hans
in scheme: Media Topic
created: 2009-10-22T02:00:00+00:00
retired: 2019-08-01T12:00:00+00:00
modified: 2021-02-18T12:00:00+00:00
broader: skiing
has facet: nordicskiingtype

ski jumping
type: Concept
preferred label: Saut à skis @fr
preferred label: قفز تزلجي @ar
preferred label: Skispringen @de
preferred label: Backhoppning @se
preferred label: Salto con esquí @es
preferred label: saltos de esqui @pt-pt
preferred label: skihop @dk
preferred label: 跳台滑雪 @zh-hans
preferred label: skihopp @no-nb
definition: De tävlande åker nedför en ramp med speciella skidor på fötterna. De hoppar ut över en kant och försöker flyga så långt och kontrollerat som möjligt. Resultatet är en kombination av längd och domarsiffror. @se
definition: Wettkämpfer gleiten auf Skiern eine schneebedeckte Rampe herunter und versuchen so weit wie möglich zu fliegen. Bewertet wird die Distanz, der Flugstil und die Landung @de
definition: Competitors descend a snow covered elevated ramp on skis and try to fly off it as far as possible, receiving marks for distance, style of flight and landing
definition: Os esquiadores ganham velocidade descendo uma rampa coberta de neve e saltam o mais longe possível, sendo avaliados pela distância coberta, pelo estilo de voo e pela qualidade da receção. @pt-pt
definition: Os esquiadores ganham velocidade descendo uma rampa coberta de neve e saltam o mais longe possível, sendo avaliados pela distância coberta, pelo estilo de voo e pela qualidade da recepção. @pt-br
definition: Konkurrenter kører ned ad en snedækket forhøjet rampe på ski og forsøger at hoppe væk fra den så langt som muligt og modtager point for afstand, flyvemåde og landing. @dk
definition: 选手使用滑雪板从雪坡上滑下，尽量飞远。根据飞行距离、姿势和落地得分 @zh-hans
in scheme: Media Topic
created: 2009-10-22T02:00:00+00:00
modified: 2021-02-18T12:00:00+00:00
broader: skiing

cross-country skiing
type: Concept
preferred label: تزلج ريفي @ar
preferred label: Ski de fond @fr
preferred label: Skilanglauf @de
preferred label: Esquí de fondo @es
preferred label: Längdåkning @se
preferred label: esqui de fundo @pt-pt
preferred label: langrend @dk
preferred label: 越野滑雪 @zh-hans
preferred label: langrenn @no-nb
definition: Tävlingar med relativt smala skidor med eller utan valla. Loppen är av olika längd och i olika banprofiler, ibland som klassisk stil och ibland i fri stil. Finns även en sprintvariant med kval och sedan utslagsheat. Vissa lopp kan gå som stafett. @se
definition: Nordic ski race competed in relatively-flat, snowy countryside on narrow skis.
definition: Wettrennen Ski nordisch im eher flachen, schneebedeckten Gelände auf schmalen Skis @de
definition: Modalidade de esqui praticada na natureza, em terreno relativamente plano e coberto de neve, com esquis estreitos. @pt-pt
definition: Nordisk skiløb hvor der konkurreres i relativt fladt, snedækket landskab på smalle ski. @dk
definition: 使用比较窄的滑雪板在比较平整的野外场所的滑雪比赛 @zh-hans
note: Was retired but reinstated in August 2019
in scheme: Media Topic
created: 2014-01-17T12:00:00+00:00
modified: 2021-02-18T12:00:00+00:00
broader: skiing

Nordic combined
type: Concept
preferred label: Nordische Kombination @de
preferred label: Nordisk kombination @se
preferred label: Combiné nordique @fr
preferred label: Combinada nórdica @es
preferred label: تزلج مركب @ar
preferred label: combinado nórdico @pt-pt
preferred label: nordisk kombineret @dk
preferred label: 北欧两项 @zh-hans
preferred label: kombinert @no-nb
definition: En kombination där de tävlande dels åker längdskidor och dels tävlar i backhoppning. @se
definition: Competition combining cross-country skiing and ski jumping
definition: Wettkampf der Skilanglauf und Skispringen kombiniert @de
definition: Competição de dois dias que combina saltos de esqui e esqui de fundo. @pt-pt
definition: En kombination, hvor skiløberne både konkurrerer i langrend og skihop. @dk
definition: 组合了越野滑雪和跳台滑雪的比赛 @zh-hans
note: Was retired but reinstated in August 2019
in scheme: Media Topic
created: 2014-01-20T12:00:00+00:00
modified: 2021-02-18T12:00:00+00:00
broader: skiing

Telemark skiing
type: Concept
preferred label: Telemark @se
preferred label: telemark @pt-pt
preferred label: Telemark skiløb @dk
preferred label: 特里马滑雪 @zh-hans
preferred label: telemarkkjøring @no-nb
preferred label: Telemark-Skifahren @de
preferred label: Télémark (ski) @fr
preferred label: Telemark (esquí) @es
preferred label: تيليمارك (تزلج) @ar
preferred label: telemarkkøyring @no-nn
definition: Norsk idrott där man använder bindningar där pjäxan endast sitter fast på skidan vid tårna och åker utför. @se
definition: Races combining downhill and cross-country skiing events with unique Telemark techniques and equipment.
definition: Modalidade de esqui que combina corridas de esqui de descida livre e de fundo com técnicas e equipamentos exclusivos, como o calcanhar solto do esqui. @pt-pt
definition: Løb, der kombinerer alpint og langrendsskiløb med unikke Telemarks teknikker og udstyr. @dk
definition: 高山和越野滑雪的组合的滑雪比赛。使用大回转技术和设备。又称屈膝旋转法滑雪 @zh-hans
definition: Rennen, bei denen Abfahrts- und Skilanglaufrennen mit einzigartigen Telemark-Techniken und -Ausrüstungen kombiniert werden. @de
in scheme: Media Topic
created: 2014-11-07T12:00:00+00:00
modified: 2021-07-12T12:00:00+00:00
broader: skiing

ski mountaineering
type: Concept
preferred label: randonee @no-nb
preferred label: Skidalpinism @se
preferred label: Skiwandern @de
definition: A winter sport that combines skiing and mountaineering that involves climbing mountains on skis or by foot and then skiing down
definition: En skidsport där utövarna bestiger berg med skidor, för att sedan åka utför. @se
definition: Ein Wintersport, der Skifahren und Bergsteigen kombiniert und bei dem man mit Skiern oder zu Fuß Berge besteigt und anschließend mit Skiern wieder hinunterfährt. @de
in scheme: Media Topic
created: 2025-03-31T12:00:00+00:00
modified: 2025-03-31T12:00:00+00:00
broader: skiing

futsal
type: Concept
definition: A football-based game played indoors on a hard court with five players per team
definition: A soccer-based game played indoors on a hard court with five players per team
in scheme: Media Topic
created: 2025-10-09T12:00:00+00:00
modified: 2025-10-09T12:00:00+00:00
broader: football

beach soccer
type: Concept
definition: A football-based game played on sand with five players per team
definition: A soccer-based game played on sand with five players per team
in scheme: Media Topic
created: 2025-10-09T12:00:00+00:00
modified: 2026-07-09T12:00:00+00:00
broader: football

backstroke
type: Concept
preferred label: Ryggsim @se
preferred label: Dos @fr
preferred label: Espalda (natación) @es
preferred label: Rückenschwimmen @de
preferred label: سباحة الظهر @ar
preferred label: costas @pt-pt
preferred label: rygcrawl @dk
preferred label: 仰泳 @zh-hans
preferred label: ryggsvømming @no-nb
preferred label: ryggsymjing @no-nn
definition: Schwimmstil auf dem Rücken liegend, Beine bewegen sich in schlagender Bewegung, während die Arme den Schwimmer nach vorne treiben @de
definition: Swimming style, on the back, legs move in flapping motion whilst arms propel the swimmer forward
definition: Estilo de natação em que o nadador, de costas para o fundo, bate as pernas e gira os braços para trás para progredir. @pt-pt
definition: Estilo de nado em que o nadador, de costas para o fundo, bate as pernas e gira os braços para trás para progredir. @pt-br
definition: Svømmedisciplin på ryggen, hvor benene bevæger sig i flappende bevægelse, mens armene driver svømmeren fremad. @dk
definition: 一种泳姿。仰躺在水上。泳者靠腿摆动和手击水推动向前游 @zh-hans
definition: Swimming style, on the back, legs move in flapping motion while arms propel the swimmer forward
in scheme: Media Topic
created: 2009-10-22T02:00:00+00:00
retired: 2015-02-24T12:00:00+00:00
modified: 2021-12-21T12:00:00+00:00
broader: swimming
broad match: http://cv.iptc.org/newscodes/subjectcode/15062000

breaststroke
type: Concept
preferred label: Brasse @fr
preferred label: Brustschwimmen @de
preferred label: Braza (natación) @es
preferred label: Bröstsim @se
preferred label: سباحة الصدر @ar
preferred label: bruços @pt-pt
preferred label: peito @pt-br
preferred label: brystsvømning @dk
preferred label: 蛙泳 @zh-hans
preferred label: brystsvømming @no-nb
preferred label: brystsymjing @no-nn
definition: Swimming style , on the front, effecting forward and outward push movements with the arms and backward and outward pushes with the legs
definition: Schwimmstil, auf dem Bauch liegend sich vorwärts und außerhalb mit den Armen und rückwärts mit den Beinen bewegend @de
definition: Estilo de natação em que o nadador, de barriga para o fundo, realiza movimentos para a frente e para fora com os braços e para trás e para fora com as pernas. @pt-pt
definition: Estilo de nado em que o nadador, de barriga para o fundo, realiza movimentos para a frente e para fora com os braços e para trás e para fora com as pernas. @pt-br
definition: Svømmedisciplin på maven, hvor man kommer frem ved bevægelser udad og bagud med armene, mens benene skubbes udad og bagud. @dk
definition: 一种泳姿。双臂往前和往外划水，腿向后和向外夹水 @zh-hans
in scheme: Media Topic
created: 2009-10-22T02:00:00+00:00
retired: 2015-02-24T12:00:00+00:00
modified: 2021-12-21T12:00:00+00:00
broader: swimming
broad match: http://cv.iptc.org/newscodes/subjectcode/15062000

butterfly swimming
type: Concept
preferred label: Mariposa (natación) @es
preferred label: فراشة @ar
preferred label: Schmetterling @de
preferred label: Papillon @fr
preferred label: Fjärilssim @se
preferred label: mariposa @pt-pt
preferred label: borboleta @pt-br
preferred label: butterfly @dk
preferred label: 蝶泳 @zh-hans
definition: Swimming style , swum on the front with the shoulders remaining parallel to the water both arms moving in simultaneous windmill fashion, the legs remain together and are moved in a flapping motion. The most physical of all styles.
definition: Schwimmstil in Bauchlage, bei dem beide Schultern parallel zum Wasser bleiben und die Arme sich simultan in Schmetterlingsform bewegen. Die Beine werden zusammengehalten und flossenartig bewegt. Der kraftaufwendigste aller Schwimmstile @de
definition: Estilo de natação em que o nadador mantém os ombros paralelos à água e projeta os braços para fora, como um moinho, com batimentos simultâneos das pernas, que permanecem juntas. É a prova de natação mais exigente. @pt-pt
definition: Estilo de nado em que o nadador mantém os ombros paralelos à água e projeta os braços para fora, como um moinho, com batimentos simultâneos das pernas, que permanecem juntas. É a prova de natação mais exigente. @pt-br
definition: Svømmedisciplin, på maven hvor skuldrene forbliver parallelle med vandet og begge arme bevæger sig samtidigt over hovedet som en vindmølle. Benene forbliver sammen og bevæges i en klappende bevægelse op og ned. Den mest fysiske af alle stilarter. @dk
definition: 一种泳姿。肩部出水与水面平行。双臂像风车一样同时划出水面，两腿并拢上下摆动。最耗体力的一种泳姿 @zh-hans
in scheme: Media Topic
created: 2009-10-22T02:00:00+00:00
retired: 2015-02-24T12:00:00+00:00
modified: 2021-12-21T12:00:00+00:00
broader: swimming
broad match: http://cv.iptc.org/newscodes/subjectcode/15062000

freestyle swimming
type: Concept
preferred label: Libre (natación) @es
preferred label: حرة @ar
preferred label: Freistil @de
preferred label: Frisim @se
preferred label: Nage libre @fr
preferred label: livres @pt-pt
preferred label: livre @pt-br
preferred label: freestyle (fri stil) @dk
preferred label: 自由泳 @zh-hans
preferred label: frisvømming @no-nb
preferred label: frisymjing @no-nn
definition: Any swimming style may be employed, though front crawl is universally employed
definition: Wettkämpfer schwimmen egal in welchem Stil, wobei meist das Kraulschwimmen bevorzugt wird @de
definition: Prova em que o nadador pode escolher qualquer estilo, embora o crawl seja o estilo mais usado. @pt-pt
definition: Enhver svømmedisciplin kan anvendes i den frie stil, selvom crawl er universelt anvendt. @dk
definition: 任何泳姿都可自由的应用，尽管多数人选择前冲式 @zh-hans
in scheme: Media Topic
created: 2009-10-22T02:00:00+00:00
retired: 2015-02-24T12:00:00+00:00
modified: 2021-12-21T12:00:00+00:00
broader: swimming

medley swimming
type: Concept
preferred label: Combinados (natación) @es
preferred label: اربع سباحات @ar
preferred label: Medley @se
preferred label: 4 nages @fr
preferred label: Lagen @de
preferred label: estilos @pt-pt
preferred label: medley @pt-br
preferred label: 混合泳 @zh-hans
definition: A combination of four different swimming styles in one race
definition: Eine Kombination von vier verschiedenen Schwimmstilen in einem Rennen @de
definition: Prova que combina os quatro estilos de natação numa só corrida. @pt-pt
definition: Prova que combina os quatro estilos de nado em uma só corrida. @pt-br
definition: En kombination af fire forskellige svømmetyper i et løb. @dk
definition: 四种泳姿组合在一起的游泳比赛 @zh-hans
in scheme: Media Topic
created: 2009-10-22T02:00:00+00:00
retired: 2015-02-24T12:00:00+00:00
modified: 2021-12-21T12:00:00+00:00
broader: swimming
broad match: http://cv.iptc.org/newscodes/subjectcode/15062000

marathon swimming
type: Concept
preferred label: Öppet vatten @se
preferred label: Langstrecke @de
preferred label: Marathon de natation @fr
preferred label: ماراثون سباحة @ar
preferred label: Maratón de natación @es
preferred label: maratona aquática @pt-pt
preferred label: åbent vand @dk
preferred label: 马拉松游泳 @zh-hans
preferred label: maratonsvømming @no-nb
preferred label: maratonsymjing @no-nn
definition: A long distance open water swimming
definition: Schwimmen einer Langstrecke im offenen Wasser @de
definition: Simtävling i öppet vatten. @se
definition: Prova de natação de grandes distâncias em águas abertas. @pt-pt
definition: Langdistancesvømning i åbent vand. @dk
definition: 在开放水面上的长距离游泳比赛 @zh-hans
note: Retired in 2017 in favour of sports facet, but then un-retired in 2021 so all top-level Olympics sports have a valid Media Topics term.
in scheme: Media Topic
created: 2009-10-22T02:00:00+00:00
modified: 2021-07-12T12:00:00+00:00
broader: swimming
broad match: http://cv.iptc.org/newscodes/subjectcode/15062000

relay freestyle swimming
type: Concept
preferred label: Staffel Freistil @de
preferred label: Kappsim, fritt @se
preferred label: سباحة حرة تتابع @ar
preferred label: Relais nage libre @fr
preferred label: Relevo libre (natación) @es
preferred label: livres estafetas @pt-pt
preferred label: revezamento livre @pt-br
preferred label: freestyle stafet @dk
preferred label: 自由泳接力赛 @zh-hans
preferred label: stafett frisvømming @no-nb
preferred label: stafett frisymjing @no-nn
definition: Team of swimmers swim a relay in the swimming style of their choice
definition: Staffelteam Wettbewerb in einem frei gewählten Schwimmstil @de
definition: Uma equipa de nadadores faz uma prova de estafeta no estilo de natação à escolha de cada nadador. @pt-pt
definition: Uma equipe de nadadores faz uma prova de estafeta no estilo de nado à escolha de cada nadador. @pt-br
definition: Hold af svømmere, som svømmer en stafet i en svømmestil efter eget valg. @dk
definition: 泳者按选择的泳姿进行游泳的接力赛 @zh-hans
in scheme: Media Topic
created: 2009-10-22T02:00:00+00:00
retired: 2015-02-24T12:00:00+00:00
modified: 2021-12-21T12:00:00+00:00
broader: swimming
broad match: http://cv.iptc.org/newscodes/subjectcode/15062000

relay medley swimming
type: Concept
preferred label: Relevo combinado (natación) @es
preferred label: اربع سباحات تتابع @ar
preferred label: Kappsim, medley @se
preferred label: Staffel Lagen @de
preferred label: Relais 4 nages @fr
preferred label: estilos estafetas @pt-pt
preferred label: revezamento medley @pt-br
preferred label: medley stafet @dk
preferred label: 混合泳接力赛 @zh-hans
preferred label: medleystafett @no-nb
definition: Staffelteam Wettbewerb mit vier kombinierten Schwimmstilen @de
definition: Team relay race involving a combination of four different swimming styles
definition: Prova de estafeta em que uma equipa de nadadores faz uma combinação de quatro estilos diferentes de natação. @pt-pt
definition: Prova de revezamento em que uma equipe de nadadores faz uma combinação de quatro estilos diferentes de nado. @pt-br
definition: Holdstafetløb, der involverer en kombination af fire forskellige svømmestile. @dk
definition: 集体游泳接力赛，包括四种不同泳姿的组合 @zh-hans
in scheme: Media Topic
created: 2009-10-22T02:00:00+00:00
retired: 2015-02-24T12:00:00+00:00
modified: 2021-12-21T12:00:00+00:00
broader: swimming
broad match: http://cv.iptc.org/newscodes/subjectcode/15062000

short course swimming
type: Concept
preferred label: Kort bana @se
preferred label: سباحة مسافة قصيرة @ar
preferred label: Petit bassin @fr
preferred label: Kurzbahnen (Schwimmen) @de
preferred label: Piscina corta @es
preferred label: piscina curta @pt-pt
preferred label: kortbane @dk
preferred label: 短池游泳 @zh-hans
preferred label: kortbanesvømming @no-nb
preferred label: kortbanesymjing @no-nn
definition: Races competed in a 25m length pool
definition: Rennen, die in einem 25m langen Pool ausgetragen werden @de
definition: Corridas realizadas em piscina de 25m de comprimento. @pt-pt
definition: Svømmekonkurrence på en 25 meter lang kortbane. @dk
definition: 在25米长的泳池进行的游泳比赛 @zh-hans
in scheme: Media Topic
created: 2009-10-22T02:00:00+00:00
retired: 2015-02-24T12:00:00+00:00
modified: 2021-12-21T12:00:00+00:00
broader: swimming
broad match: http://cv.iptc.org/newscodes/subjectcode/15062000

synchronised free routine
type: Concept
preferred label: Natation synchronisée programme libre @fr
preferred label: سباحة حرة متزامنة @ar
preferred label: Rutina libre sincronizada @es
preferred label: Fria programmet @se
preferred label: Synchronschwimmen frei @de
preferred label: sincronizada livre @pt-pt
preferred label: synkronsvømning fri rutine @dk
preferred label: 自选动作（花样游泳） @zh-hans
preferred label: synkronsvømming friprogram @no-nb
preferred label: synchronized free routine
preferred label: synkronsymjing friprogram @no-nn
definition: Musiksimning där utövaren genomför rörelser till musik och får poäng av domare. Programmet är inte förutbestämt. @se
definition: In der freien Disziplin sind die Bewegungen, die Musik und die Reihenfolge nicht vorgegeben @de
definition: In the free programme, music, movements and their order of execution are not restricted.
definition: No programa livre, música, movimentos e sua ordem de execução não são predeterminados. @pt-pt
definition: Musiksvømning, hvor kunstneren udfører bevægelser til musik i fri stil og får point fra dommerne. Programmet er ikke forudbestemt. @dk
definition: 在音乐，动作和编排顺序方面不受限制 @zh-hans
definition: In the free program, music, movements and their order of execution are not restricted.
change note: 2016-04-05: Broader concept changed.
in scheme: Media Topic
created: 2009-10-22T02:00:00+00:00
modified: 2021-02-18T12:00:00+00:00
broader: artistic swimming

synchronised technical routine
type: Concept
preferred label: Synchronschwimmen Disziplin @de
preferred label: Rutina técnica sincronizada @es
preferred label: سباحة متزامنة @ar
preferred label: Tekniska programmet @se
preferred label: Natation synchronisée programme technique @fr
preferred label: sincronizada @pt-pt
preferred label: synkronsvømning teknisk rutine @dk
preferred label: 规定动作（花样游泳） @zh-hans
preferred label: synkronsvømming teknisk program @no-nb
preferred label: synchronized technical routine
preferred label: synkronsymjing teknisk program @no-nn
definition: Figursimning där utövaren ska genomföra en specifik serie rörelser och får poäng av domare. @se
definition: Wettkämpfer erhalten Punkte von einer zehnköpfigen Jury für synchrone artistische Formen und Bewegungen im Wasser. In der technischen Disziplin müssen die Schwimmer eine Rangfolge von speziellen Bewegungen einhalten @de
definition: Contestants obtain points from 10 sitting judges by executing certain synchronised artistic shapes and movements in the water. In the technical programme, competitors must execute a range of specific moves in a given order.
definition: Prova em que os nadadores executam determinados movimentos sincronizados e artísticos na água, sendo avaliados por 10 juízes. No programa técnico, os nadadores devem executar uma série de figuras específicas segundo determinada ordem. @pt-pt
definition: Os nadadores executam determinados movimentos sincronizados e artísticos na água, sendo avaliados por 10 juízes. No programa técnico, os nadadores devem executar uma série de figuras específicas segundo determinada ordem. @pt-br
definition: Figursvømning, hvor kunstneren skal udføre en bestemt række bevægelser og modtage point fra dommerne. @dk
definition: 十名裁判根据选手在水中的动作的协调程度和艺术效果对运动员打分。在技术编排上，运动员必须按序完成规定的动作 @zh-hans
definition: Contestants obtain points from 10 sitting judges by executing certain synchronized artistic shapes and movements in the water. In the technical program, competitors must execute a range of specific moves in a given order.
change note: 2016-04-05: Broader concept changed
in scheme: Media Topic
created: 2009-10-22T02:00:00+00:00
modified: 2021-02-18T12:00:00+00:00
broader: artistic swimming

Taekwondo
type: Concept
preferred label: تايكواندو @ar
preferred label: Taekwon-Do
preferred label: taekwondo @pt-pt
preferred label: 跆拳道 @zh-hans
definition: Kampfsportart, ursprünglich aus Korea @de
definition: A martial art of Korean origin
definition: Kampsport med koreanskt ursprung. De tävlande ska med sparkar och slag träffa speciellt markerade platser på motståndaren. Slag och sparkar mot huvudet är förbjudet. @se
definition: Arte marcial de origem coreana. @pt-pt
definition: Kampsport med koreansk oprindelse. Deltagerne vil med spark og slag slå særligt markerede steder på modstanderen. Det er forbudt at slå og sparke på hovedet. @dk
definition: 源于韩国的武术运动 @zh-hans
change note: Change Note 2015-08-27: broader term changed
in scheme: Media Topic
created: 2009-10-22T02:00:00+00:00
modified: 2021-02-18T12:00:00+00:00
broader: martial arts

beach volleyball
type: Concept
preferred label: كرة طائرة شاطئية @ar
preferred label: Beachvolleyball @de
preferred label: Vóley playa @es
preferred label: Beachvolleyboll @se
preferred label: Beach volley @fr
preferred label: voleibol de praia @pt-pt
preferred label: vôlei de praia @pt-br
preferred label: beachvolley @dk
preferred label: 沙滩排球 @zh-hans
preferred label: sandvolleyball @no-nb
definition: Zwei Teams mit je zwei Spielern spielen auf einem Sandfeld. Anders als beim Volleyball werden nur dann Punkte gemacht, wenn ein Team einen Satz gewinnt oder einen Fehler macht. Der Sanduntergrund macht das Spiel anstrengender als Volleyball @de
definition: Two teams of two players compete on a sand court. Unlike indoor volleyball, points are scored only when the serving team wins a rally or forces an error. The sand surface makes it more physically demanding than volleyball
definition: Själva spelet är som volleyboll, men spelas på sand med två personer i varje lag. @se
definition: Jogo de bola que opõe duas equipas de 2 jogadores ao ar livre, em campo de areia dividido ao meio por rede. A areia torna esta modalidade mais difícil do que o vólei de interior. @pt-pt
definition: Jogo de bola que opõe duas equipes de 2 jogadores ao ar livre, em campo de areia dividido ao meio por rede. A areia torna esta modalidade mais difícil do que o vôlei de interior. @pt-br
definition: Selve spillet er som volleyball, men spilles på sand med to personer på hvert hold. @dk
definition: 集体球类运动。每队两人，在室外沙地球场比赛。与室内排球不同的是，只有发球方赢得回合或对方失误才可以得分。运动员在沙地球场比室内排球体力消耗量更大 @zh-hans
in scheme: Media Topic
created: 2009-10-22T02:00:00+00:00
modified: 2021-02-18T12:00:00+00:00
broader: volleyball

clean and jerk (weightlifting)
type: Concept
preferred label: Dos tiempos (halterofilia) @es
preferred label: نتر @ar
preferred label: Épaulé-jeté @fr
preferred label: Clean und Jerk (Gewichtheben) @de
preferred label: Stöt @se
preferred label: arremesso @pt-pt
preferred label: stød @dk
preferred label: 挺举 @zh-hans
preferred label: støt (vektløfting) @no-nb
preferred label: støyt (vektløfting) @no-nn
definition: Die Stange wird zu den Schultern gehoben, dann über den Kopf und dort gehalten während die Beine gestreckt werden @de
definition: En variant av tyngdlyftning där man först lyfter till skulderhöjd och sedan stöter upp till raka armar och står kvar med raka ben. @se
definition: The bar is first lifted to the shoulders and then jerk it above the head and keep it there while maintaining straight legs
definition: A barra de pesos é primeiro levantada até aos ombros e só depois arremessada acima da cabeça, posição que o atleta deve manter durante alguns segundos com as pernas esticadas. @pt-pt
definition: A barra de pesos é primeiro levantada até os ombros e só depois arremessada acima da cabeça, posição que o atleta deve manter durante alguns segundos com as pernas esticadas. @pt-br
definition: Stangen løftes først op på skuldrene og løftes derefter over hovedet og holdes der i strakte arme, mens du holder benene stille. @dk
definition: 杠铃首先被提起到肩上。然后举过头顶，保持在头顶并保持双腿直立 @zh-hans
note: Retired. Use Media Topic weightlifting+ sports facet weightliftingtype.
in scheme: Media Topic
created: 2009-10-22T02:00:00+00:00
retired: 2017-07-04T12:00:00+00:00
modified: 2021-07-12T12:00:00+00:00
broader: weightlifting and powerlifting

powerlifting
type: Concept
preferred label: Powerlifting @es
preferred label: اثقال القوة @ar
preferred label: Force athlétique @fr
preferred label: Styrkelyft @se
preferred label: Kraftdreikampf @de
preferred label: levantamento de peso @pt-pt
preferred label: levantamento de peso básico @pt-br
preferred label: styrkeløft @dk
preferred label: 力量举重 @zh-hans
definition: A strength test where competitors lift as heavy a weight as possible
definition: Kräftemessen, bei dem die Wettkämpfer ein Gewicht so schwer wie möglich heben @de
definition: Påminner om traditionell tyngdlyftning men här tävlar man i stället i knäböj, bänkpress och marklyft. De tävlande har tre försök per gren. Högsta vikt per gren räknas. @se
definition: Teste de força em que os atletas tentam levantar o máximo de peso possível. @pt-pt
definition: En styrketest, hvor konkurrenter løfter en så tung vægt som muligt. @dk
definition: 参赛者尽量举起最大重量 @zh-hans
note: Retired. Use Media Topic weightlifting+ sports facet weightliftingtype.
in scheme: Media Topic
created: 2009-10-22T02:00:00+00:00
retired: 2017-07-04T12:00:00+00:00
modified: 2021-02-18T12:00:00+00:00
broader: weightlifting and powerlifting

snatch (weightlifting)
type: Concept
preferred label: Arrachée @fr
preferred label: Arranque (halterofilia) @es
preferred label: Reißen (Gewichtheben) @de
preferred label: خطف @ar
preferred label: Ryck @se
preferred label: arranque @pt-pt
preferred label: arranco @pt-br
preferred label: træk @dk
preferred label: 抓举 @zh-hans
preferred label: rykk (vektløfting) @no-nb
definition: The bar must be lifted from floor to above the head in one movement
definition: En variant av tynglyftning där lyftet ska ske från marken till sträckta armar i en rörelse. @se
definition: Die Stange muss vom Boden über den Kopf in einem Zug gehoben werden @de
definition: A barra de pesos deve ser levantada do solo até acima da cabeça com um só movimento. @pt-pt
definition: Stangen løftes fra gulvet til over hovedet i én bevægelse. @dk
definition: 杠铃必须一次性从地面举过头顶 @zh-hans
note: Retired. Use Media Topicweightlifting+ sports facet weightliftingtype.
in scheme: Media Topic
created: 2009-10-22T02:00:00+00:00
retired: 2017-07-04T12:00:00+00:00
modified: 2021-07-12T12:00:00+00:00
broader: weightlifting and powerlifting

freestyle wrestling
type: Concept
preferred label: Lutte libre @fr
preferred label: Lucha libre @es
preferred label: مصارعة حرة @ar
preferred label: Freistil Ringen @de
preferred label: Fristil @se
preferred label: estilo livre @pt-pt
preferred label: fristilsbrydning @dk
preferred label: 自由式摔跤 @zh-hans
preferred label: fristil-bryting @no-nb
definition: Stil bei dem auch das Festhalten der Beine erlaubt ist, d.h. Angriffe auf den ganzen Körper @de
definition: A style where leg holds are allowed
definition: En variant av brottning där benen kan användas. @se
definition: Estilo de luta onde é permitido agarrar com as pernas. @pt-pt
definition: En variant af brydning, hvor benene kan bruges. @dk
definition: 可以用腿绊倒对方的摔跤 @zh-hans
in scheme: Media Topic
created: 2009-10-22T02:00:00+00:00
modified: 2021-02-18T12:00:00+00:00
broader: wrestling

greco-roman
type: Concept
preferred label: Griechisch-Römisch @de
preferred label: Lucha grecorromana @es
preferred label: مصارعة يونانية رومانية @ar
preferred label: Lutte gréco-romaine @fr
preferred label: Grekisk-romersk stil @se
preferred label: greco-romana @pt-pt
preferred label: græsk-romersk brydning @dk
preferred label: 古典式摔跤 @zh-hans
preferred label: gresk-romersk stil @no-nb
definition: En variant av brottning där man bara får ta grepp mellan midjan och huvudet. @se
definition: A style where the only holds allowed are those between the head and the belt
definition: Ein Stil bei dem nur Angriffe zwischen Kopf und Gürtellinie erlaubt sind @de
definition: Estilo de luta onde só é permitido agarrar entre a cintura e a cabeça. @pt-pt
definition: En variant af brydning, hvor man kun kan tage greb mellem talje og hoved. @dk
definition: 只能抓腰带和头之间部位 @zh-hans
in scheme: Media Topic
created: 2009-10-22T02:00:00+00:00
modified: 2021-02-18T12:00:00+00:00
broader: wrestling

Swiss wrestling
type: Concept
preferred label: Lucha suiza @es
preferred label: Schweizer Ringen @de
preferred label: Lutte suisse @fr
preferred label: مصارعة سويسرية @ar
preferred label: Schwingen @se
preferred label: luta suíça @pt-pt
preferred label: schweizisk brydning @dk
preferred label: 瑞士式摔跤 @zh-hans
preferred label: sveitsisk bryting @no-nb
definition: Traditional Swiss sport similar to wrestling with specific rules
definition: Traditionelle Schweizer Sportart, ähnlich dem Ringen mit speziellen Regeln @de
definition: En schweizisk variant av brottning. @se
definition: Desporto tradicional suíço, semelhante à luta livre, mas com regras específicas. @pt-pt
definition: Esporte tradicional suíço, semelhante à luta livre, mas com regras específicas. @pt-br
definition: En schweizisk variant af brydning. @dk
definition: 传统瑞士摔跤与普通摔跤相似，只是规则不同 @zh-hans
in scheme: Media Topic
created: 2009-10-22T02:00:00+00:00
modified: 2021-02-18T12:00:00+00:00
broader: wrestling

wushu
type: Concept
preferred label: Wushu @es
preferred label: ووشو @ar
preferred label: 武术 @zh-hans
definition: Grundsätzliche chinesische traditionelle Kampfkunst @de
definition: Kinesisk traditionell stridskonst. @se
definition: Chinese traditional martial art
definition: Arte marcial tradicional chinesa. @pt-pt
definition: Kinesisk traditionel kampsport. @dk
definition: 中国传统武术 @zh-hans
change note: Change Note 2015-08-27: broader term changed
in scheme: Media Topic
created: 2009-10-22T02:00:00+00:00
modified: 2021-02-18T12:00:00+00:00
broader: martial arts

drug abuse in sport
type: Concept
preferred label: Dopning @se
preferred label: Doping @de
preferred label: Dopage @fr
preferred label: Dopaje @es
preferred label: الاساءة في استخدام المنشطات @ar
preferred label: dopagem @pt-pt
preferred label: doping @dk
preferred label: 滥用违禁药物 @zh-hans
definition: Using drugs to improve competitiveness in sports
definition: Olovlig användning av läkemedel för att öka prestationsförmågan inom en idrott. @se
definition: Medikamente werden genommen um die Wettbewerbsfähigkeit im Sport zu verbessern @de
definition: Utilização de substâncias proibidas para aumentar a competitividade no desporto. @pt-pt
definition: Utilização de substâncias proibidas para aumentar a competitividade no esporte. @pt-br
definition: Ulovlig brug af stoffer for at øge præstationen i en sportsgren. @dk
definition: 在体育运动中滥用药品提高竞争能力 @zh-hans
change note: Retired. Use medtop:20001104: drug use in sport instead
in scheme: Media Topic
created: 2009-10-22T02:00:00+00:00
retired: 2022-09-23T12:00:00+00:00
modified: 2022-09-23T12:00:00+00:00
broader: drug use in sport
broad match: http://cv.iptc.org/newscodes/subjectcode/15000000

drug testing in sport
type: Concept
preferred label: تحليل منشطات @ar
preferred label: Controles de dopaje @es
preferred label: Contrôle antidopage @fr
preferred label: Drogentest @de
preferred label: Dopningskontroll @se
preferred label: teste antidoping @pt-pt
preferred label: exame antidoping @pt-br
preferred label: dopingtest @dk
preferred label: 药物检测 @zh-hans
definition: Means and ways to check the use of drugs in sports
definition: Medel för att undersöka användning av lovliga och olovliga läkemedel inom idrotten. @se
definition: Mittel und Wege um den Drogengebrauch im Sport zu überprüfen @de
definition: Meios e formas de verificar o uso de drogas no desporto. @pt-pt
definition: Meios e formas de verificar o uso de drogas no esporte. @pt-br
definition: Test til undersøgelse af brugen af lovlige og ulovlige stoffer i sport. @dk
definition: 检测体育运动中使用违禁药物的手段和方法 @zh-hans
change note: Retired. Use medtop:20001104: drug use in sport instead
in scheme: Media Topic
created: 2009-10-22T02:00:00+00:00
retired: 2022-09-23T12:00:00+00:00
modified: 2022-09-23T12:00:00+00:00
broader: drug use in sport
broad match: http://cv.iptc.org/newscodes/subjectcode/15000000

medical drug use in sport
type: Concept
preferred label: Medicamentos autorizados en el deporte @es
preferred label: Medizinisches Doping @de
preferred label: Tillåtna läkemedel @se
preferred label: Traitements médicaux dans le sport @fr
preferred label: عقار طبي مستخدم في الرياضة @ar
preferred label: uso de medicamentos no desporto @pt-pt
preferred label: uso de medicamentos no esporte @pt-br
preferred label: medicinsk stofbrug i sport @dk
preferred label: 医用药物 @zh-hans
preferred label: tillatte legemiddel @no-nb
preferred label: tillatne legemiddel @no-nn
definition: Gebrauch von Drogen aus medizinischen Gründen durch Sport Regulatoren gestattet @de
definition: Use of drugs for medical reasons as permitted by sport regulators
definition: Användning av tillåtna läkemedel. @se
definition: Uso de medicamentos no desporto por razões médicas, de acordo com o estipulado pelos reguladores desportivos. @pt-pt
definition: Uso de medicamentos no esporte por razões médicas, de acordo com o estipulado pelos reguladores esportivos. @pt-br
definition: Brug af godkendte lægemidler. @dk
definition: 体育规则允许的医用药物 @zh-hans
change note: Retired. Use medtop:20001104: drug use in sport instead
in scheme: Media Topic
created: 2009-10-22T02:00:00+00:00
retired: 2022-09-23T12:00:00+00:00
modified: 2022-09-23T12:00:00+00:00
broader: drug use in sport
broad match: http://cv.iptc.org/newscodes/subjectcode/15000000

continental championship
type: Concept
preferred label: Championnat continental @fr
preferred label: Kontinentale Meisterschaft @de
preferred label: بطولة قارية @ar
preferred label: Kontinentala mästerskap @se
preferred label: Campeonato continental @es
preferred label: campeonato continental @pt-pt
preferred label: kontinentalt mesterskab (EM) @dk
preferred label: 洲际锦标赛 @zh-hans
preferred label: kontinentale mesterskap @no-nb
preferred label: kontinentale meisterskapar @no-nn
definition: Wettkampf, an dem die besten Wettkämpfer oder Teams eines Kontinents teilnehmen. Meisterschaft genannt @de
definition: Mästerskap där atleter eller lag från olika länder på en viss kontinent kan delta. @se
definition: A competition where individuals or teams from countries from one continent may participate. Called a *Championship*
definition: Competição em que podem participar indivíduos ou equipas de países de um continente. Designa-se por *Campeonato*. @pt-pt
definition: Competição em que podem participar indivíduos ou equipes de países de um continente. Designa-se por *Campeonato*. @pt-br
definition: Mesterskaber, hvor atleter eller hold fra forskellige lande på et bestemt kontinent kan deltage. @dk
definition: 州内国家之间的体育比赛，称为锦标赛 @zh-hans
note: Retired December 2021.
in scheme: Media Topic
created: 2009-10-22T02:00:00+00:00
retired: 2021-12-17T12:00:00+00:00
modified: 2021-12-17T12:00:00+00:00
broader: sport event
broad match: http://cv.iptc.org/newscodes/subjectcode/15073028

continental cup
type: Concept
preferred label: Kontinental cup @se
preferred label: Copa continental @es
preferred label: Kontinentaler Cup @de
preferred label: Coupe continentale @fr
preferred label: كأس قارية @ar
preferred label: taça continental @pt-pt
preferred label: copa continental @pt-br
preferred label: kontinental pokalturnering @dk
preferred label: 洲际杯赛 @zh-hans
preferred label: kontinentalcup @no-nb
definition: A competition where individuals or teams from countries from one continent may participate. Called a *Cup*
definition: Wettkampf, an dem die besten Wettkämpfer oder Teams eines Kontinents teilnehmen. Cup genannt @de
definition: Cup där atleter eller lag från olika länder på en viss kontinent kan delta. @se
definition: Competição em que podem participar indivíduos ou equipas de países de um continente. Designa-se por *Taça*. @pt-pt
definition: Competição em que podem participar indivíduos ou equipes de países de um continente. Designa-se por *Copa*. @pt-br
definition: Pokal, hvor atleter eller hold fra forskellige lande på et bestemt kontinent kan deltage. @dk
definition: 州内国家之间的杯赛 @zh-hans
note: Retired December 2021.
in scheme: Media Topic
created: 2009-10-22T02:00:00+00:00
retired: 2021-12-17T12:00:00+00:00
modified: 2021-12-17T12:00:00+00:00
broader: sport event

continental games
type: Concept
preferred label: Kontinentale Spiele @de
preferred label: Jeux continentaux @fr
preferred label: العاب قارية @ar
preferred label: Juegos continentales @es
preferred label: Kontinentala spel @se
preferred label: jogos continentais @pt-pt
preferred label: kontinentale lege @dk
preferred label: 洲际运动会 @zh-hans
preferred label: kontinentale leker @no-nb
preferred label: kontinentale leikar @no-nn
definition: A competition where individuals or teams from countries from one continent may participate. Called *Games*
definition: Wettkampf, an dem die besten Wettkämpfer oder Teams eines Kontinents teilnehmen. Spiele genannt @de
definition: Tävling där atleter eller lag från olika länder på en viss kontinent kan delta. @se
definition: Competição em que podem participar indivíduos ou equipas de países de um continente. Designa-se por *Jogos*. @pt-pt
definition: Competição em que podem participar indivíduos ou equipes de países de um continente. Designa-se por *Jogos*. @pt-br
definition: Konkurrence, hvor atleter eller hold fra forskellige lande på et bestemt kontinent kan deltage. @dk
definition: 州内国家队之间的运动会 @zh-hans
note: Retired December 2021.
in scheme: Media Topic
created: 2009-10-22T02:00:00+00:00
retired: 2021-12-17T12:00:00+00:00
modified: 2021-12-17T12:00:00+00:00
broader: sport event
broad match: http://cv.iptc.org/newscodes/subjectcode/15073000

international championship
type: Concept
preferred label: Championnat intercontinental @fr
preferred label: Campeonato internacional @es
preferred label: Internationella mästerskap @se
preferred label: Internationale Meisterschaft @de
preferred label: بطولة دولية @ar
preferred label: campeonato internacional @pt-pt
preferred label: internationalt mesterskab @dk
preferred label: 国际锦标赛 @zh-hans
preferred label: internasjonalt mesterskap @no-nb
preferred label: internasjonal meisterskap @no-nn
definition: Mästerskap där atleter eller lag från olika länder kan delta. @se
definition: Wettkampf, an dem die besten Wettkämpfer und Teams verschiedener Länder teilnehmen. Meisterschaft genannt @de
definition: A competition where individuals or teams from different countries may participate. Called a *Championship*
definition: Competição em que podem participar indivíduos ou equipas de diferentes países. Designa-se por *Campeonato*. @pt-pt
definition: Competição em que podem participar indivíduos ou equipes de diferentes países. Designa-se por *Campeonato*. @pt-br
definition: Mesterskaber, hvor atleter eller hold fra forskellige lande kan deltage. @dk
definition: 个人或团体代表国家参加的国际范围内的锦标赛 @zh-hans
note: Retired December 2021.
in scheme: Media Topic
created: 2009-10-22T02:00:00+00:00
retired: 2021-12-17T12:00:00+00:00
modified: 2021-12-17T12:00:00+00:00
broader: sport event
broad match: http://cv.iptc.org/newscodes/subjectcode/15073000

international cup
type: Concept
preferred label: Copa internacional @es
preferred label: Internationella cuper @se
preferred label: Internationaler Cup @de
preferred label: كأس دولية @ar
preferred label: Coupe internationale @fr
preferred label: taça internacional @pt-pt
preferred label: copa internacional @pt-br
preferred label: international pokal @dk
preferred label: 国际杯赛 @zh-hans
preferred label: internasjonal cup @no-nb
definition: Wettkampf, an dem die besten Wettkämpfer und Teams verschiedener Länder teilnehmen. Cup genannt @de
definition: A competition where individuals or teams from different countries may participate. Called a *Cup*
definition: Cup där atleter eller lag från olika länder kan delta. @se
definition: Competição em que podem participar indivíduos ou equipas de diferentes países. Designa-se por *Taça*. @pt-pt
definition: Competição em que podem participar indivíduos ou equipes de diferentes países. Designa-se por *Copa*. @pt-br
definition: Pokal, hvor atleter eller hold fra forskellige lande kan deltage. @dk
definition: 个人或团体代表国家参加的国际范围内的杯赛 @zh-hans
note: Retired December 2021.
in scheme: Media Topic
created: 2009-10-22T02:00:00+00:00
retired: 2021-12-17T12:00:00+00:00
modified: 2021-12-17T12:00:00+00:00
broader: sport event

international games
type: Concept
preferred label: العاب دولية @ar
preferred label: Juegos internacionales @es
preferred label: Jeux internationaux @fr
preferred label: Internationella spel @se
preferred label: Internationale Spiele @de
preferred label: jogos internacionais @pt-pt
preferred label: internationale lege @dk
preferred label: 国际运动会 @zh-hans
preferred label: Internasjonale leker @no-nb
preferred label: internasjonale leikar @no-nn
definition: Tävling där atleter eller lag från olika länder kan delta. @se
definition: Wettkampf, an dem die besten Wettkämpfer und Teams verschiedener Länder teilnehmen. Spiele genannt @de
definition: A competition where individuals or teams from different countries may participate. Called *Games*
definition: Competição em que podem participar indivíduos ou equipas de diferentes países. Designa-se por *Jogos*. @pt-pt
definition: Competição em que podem participar indivíduos ou equipes de diferentes países. Designa-se por *Jogos*. @pt-br
definition: Konkurrence, hvor atleter eller hold fra forskellige lande kan deltage. @dk
definition: 个人或团体代表国家参加的国际范围内的运动会 @zh-hans
note: Retired December 2021.
in scheme: Media Topic
created: 2009-10-22T02:00:00+00:00
retired: 2021-12-17T12:00:00+00:00
modified: 2021-12-17T12:00:00+00:00
broader: sport event
broad match: http://cv.iptc.org/newscodes/subjectcode/15073000

national championship
type: Concept
preferred label: بطولة وطنية @ar
preferred label: Championnat national @fr
preferred label: Nationale Meisterschaft @de
preferred label: Nationella mästerskap @se
preferred label: Campeonato nacional @es
preferred label: campeonato nacional @pt-pt
preferred label: nationalt mesterskab @dk
preferred label: 全国锦标赛 @zh-hans
preferred label: nasjonalt mesterskap @no-nb
preferred label: nasjonal meisterskap @no-nn
definition: Mästerskap där atleter eller lag från ett visst land kan delta. @se
definition: A competition where individuals or teams from one country may participate. Called a *Championship*
definition: Wettkampf, an dem die besten Wettkämpfer oder Teams eines Landes teilnehmen. Meisterschaft genannt @de
definition: Competição em que podem participar indivíduos ou equipas de um país. Designa-se por *Campeonato*. @pt-pt
definition: Competição em que podem participar indivíduos ou equipes de um país. Designa-se por *Campeonato*. @pt-br
definition: Mesterskaber, hvor atleter eller hold fra et bestemt land kan deltage. @dk
definition: 全国的个人或团体参加的本国家范围内的锦标赛 @zh-hans
note: Retired December 2021.
in scheme: Media Topic
created: 2009-10-22T02:00:00+00:00
retired: 2021-12-17T12:00:00+00:00
modified: 2021-12-17T12:00:00+00:00
broader: sport event
broad match: http://cv.iptc.org/newscodes/subjectcode/15073000

national cup
type: Concept
preferred label: Nationell cup @se
preferred label: Coupe nationale @fr
preferred label: Nationaler Cup @de
preferred label: Copa nacional @es
preferred label: كأس وطنية @ar
preferred label: taça nacional @pt-pt
preferred label: copa nacional @pt-br
preferred label: national pokalturnering @dk
preferred label: 全国杯赛 @zh-hans
preferred label: nasjonal cup @no-nb
definition: A competition where individuals or teams from one country may participate. Called a *Cup*
definition: Wettkampf, an dem die besten Wettkämpfer oder Teams eines Landes teilnehmen. Cup genannt @de
definition: Cup där atleter eller lag från ett visst land kan delta. @se
definition: Competição em que podem participar indivíduos ou equipas de um país. Designa-se por *Taça*. @pt-pt
definition: Competição em que podem participar indivíduos ou equipes de um país. Designa-se por *Copa*. @pt-br
definition: Pokal, hvor atleter eller hold fra et bestemt land kan deltage. @dk
definition: 全国的个人或团体参加本国家范围内的杯赛 @zh-hans
note: Retired December 2021.
in scheme: Media Topic
created: 2009-10-22T02:00:00+00:00
retired: 2021-12-17T12:00:00+00:00
modified: 2021-12-17T12:00:00+00:00
broader: sport event

national games
type: Concept
preferred label: Nationella spel @se
preferred label: العاب وطنية @ar
preferred label: Jeux nationaux @fr
preferred label: Juegos nacionales @es
preferred label: Nationale Spiele @de
preferred label: jogos nacionais @pt-pt
preferred label: nationale lege @dk
preferred label: 全国运动会 @zh-hans
preferred label: nasjonale leker @no-nb
preferred label: nasjonale leikar @no-nn
definition: Wettkampf, an dem die besten Wettkämpfer oder Teams eines Landes teilnehmen. Spiele genannt @de
definition: A competition where individuals or teams from one country may participate. Called *Games*
definition: Tävling där atleter eller lag från ett visst land kan delta. @se
definition: Competição em que podem participar indivíduos ou equipas de um país. Designa-se por *Jogos*. @pt-pt
definition: Competição em que podem participar indivíduos ou equipes de um país. Designa-se por *Jogos*. @pt-br
definition: Konkurrence, hvor atleter eller hold fra et bestemt land kan deltage. @dk
definition: 全国的个人或团体参加本国家范围内运动会 @zh-hans
note: Retired December 2021.
in scheme: Media Topic
created: 2009-10-22T02:00:00+00:00
retired: 2021-12-17T12:00:00+00:00
modified: 2021-12-17T12:00:00+00:00
broader: sport event
broad match: http://cv.iptc.org/newscodes/subjectcode/15073000

regional championship
type: Concept
preferred label: Regionale Meisterschaft @de
preferred label: Campeonato regional @es
preferred label: Distriktsmästerskap @se
preferred label: Championnat régional @fr
preferred label: بطولة اقليمية @ar
preferred label: campeonato regional @pt-pt
preferred label: regionalt mesterskab @dk
preferred label: 国内地区锦标赛 @zh-hans
preferred label: distriktsmesterskap @no-nb
preferred label: distriktsmeisterskap @no-nn
definition: Mästerskap där atleter eller lag från en viss del av landet kan delta. @se
definition: Wettkampf, an dem die besten Wettkämpfer oder Teams einer Region teilnehmen. Meisterschaft genannt @de
definition: A competition where individuals or teams from a region of a country may participate. Called a *Championship*
definition: Competição em que podem participar indivíduos ou equipas de uma região. Designa-se por *Campeonato*. @pt-pt
definition: Competição em que podem participar indivíduos ou equipes de uma região. Designa-se por *Campeonato*. @pt-br
definition: Mesterskaber, hvor atleter eller hold fra en bestemt del af landet kan deltage. @dk
definition: 国内某个地区的个人或团体参加的该地区的锦标赛 @zh-hans
note: Retired December 2021.
in scheme: Media Topic
created: 2009-10-22T02:00:00+00:00
retired: 2021-12-17T12:00:00+00:00
modified: 2021-12-17T12:00:00+00:00
broader: sport event

regional cup
type: Concept
preferred label: Coupe régionale @fr
preferred label: Regionaler Cup @de
preferred label: Copa regional @es
preferred label: Distriktscup @se
preferred label: كأس اقليمية @ar
preferred label: taça regional @pt-pt
preferred label: copa regional @pt-br
preferred label: regional pokal @dk
preferred label: 国内地区杯赛 @zh-hans
preferred label: distriktscup @no-nb
definition: Cup där atleter eller lag från en viss del av landet kan delta. @se
definition: Wettkampf, an dem die besten Wettkämpfer oder Teams einer Region teilnehmen. Cup genannt @de
definition: A competition where individuals or teams from a region of a country may participate. Called a *Cup*
definition: Competição em que podem participar indivíduos ou equipas de uma região. Designa-se por *Taça*. @pt-pt
definition: Competição em que podem participar indivíduos ou equipes de uma região. Designa-se por *Copa*. @pt-br
definition: Pokal, hvor atleter eller hold fra en bestemt del af landet kan deltage. @dk
definition: 国内某个地区的个人或团体参加的该地区的杯赛 @zh-hans
note: Retired December 2021.
in scheme: Media Topic
created: 2009-10-22T02:00:00+00:00
retired: 2021-12-17T12:00:00+00:00
modified: 2021-12-17T12:00:00+00:00
broader: sport event

regional games
type: Concept
preferred label: Juegos regionales @es
preferred label: Distriktstävlingar @se
preferred label: Jeux régionaux @fr
preferred label: Regionale Spiele @de
preferred label: العاب اقليمية @ar
preferred label: jogos regionais @pt-pt
preferred label: regionale lege @dk
preferred label: 国内地区运动会 @zh-hans
preferred label: distriktsleker @no-nb
preferred label: distriktsleikar @no-nn
definition: Wettkampf, an dem die besten Wettkämpfer oder Teams einer Region teilnehmen. Spiele genannt @de
definition: Tävling där atleter eller lag från en viss del av landet kan delta. @se
definition: A competition where individuals or teams from a region of a country may participate. Called *Games*
definition: Competição em que podem participar indivíduos ou equipas de uma região. Designa-se por *Jogos*. @pt-pt
definition: Competição em que podem participar indivíduos ou equipes de uma região. Designa-se por *Jogos*. @pt-br
definition: Konkurrence, hvor atleter eller hold fra en bestemt del af landet kan deltage. @dk
definition: 国内某个地区的个人或集体参加的该地区的运动会 @zh-hans
note: Retired December 2021.
in scheme: Media Topic
created: 2009-10-22T02:00:00+00:00
retired: 2021-12-17T12:00:00+00:00
modified: 2021-12-17T12:00:00+00:00
broader: sport event
broad match: http://cv.iptc.org/newscodes/subjectcode/15073000

world championship
type: Concept
preferred label: Championnat du monde @fr
preferred label: Världsmästerskap @se
preferred label: بطولة العالم @ar
preferred label: Campeonato mundial @es
preferred label: Weltmeisterschaft @de
preferred label: campeonato do mundo @pt-pt
preferred label: verdensmesterskab @dk
preferred label: 世界锦标赛 @zh-hans
preferred label: vm @no-nb
definition: Mästerskap där atleter eller lag från samtliga världsdelar kan delta. @se
definition: Wettkampf, an dem die besten Wettkämpfer oder Teams der fünf Kontinente teilnehmen. Meisterschaft genannt @de
definition: A competition where individuals or teams from the five continents may participate. Called *World Championship*
definition: Competição em que podem participar indivíduos ou equipas dos cinco continentes. Designa-se por *Campeonato do Mundo*. @pt-pt
definition: Competição em que podem participar indivíduos ou equipes dos cinco continentes. Designa-se por *Campeonato do Mundo*. @pt-br
definition: Mesterskaber, hvor atleter eller hold fra alle kontinenter kan deltage. @dk
definition: 世界五大洲运动员或运动队都可参加的竞标体育赛事 @zh-hans
note: Retired December 2021.
in scheme: Media Topic
created: 2009-10-22T02:00:00+00:00
retired: 2021-12-17T12:00:00+00:00
modified: 2021-12-17T12:00:00+00:00
broader: sport event

world cup
type: Concept
preferred label: Copa del mundo @es
preferred label: Weltcup @de
preferred label: Coupe du monde @fr
preferred label: Världscup @se
preferred label: كأس العالم @ar
preferred label: taça do mundo @pt-pt
preferred label: copa do mundo @pt-br
preferred label: World Cup @dk
preferred label: 世界杯赛 @zh-hans
preferred label: verdenscup @no-nb
preferred label: verdscup @no-nn
definition: A competition where individuals or teams from the five continents may participate. Called *World Cup*
definition: Wettkampf, an dem die besten Wettkämpfer oder Teams der fünf Kontinente teilnehmen. Weltcup genannt @de
definition: Cup där atleter eller lag från samtliga världsdelar kan delta. @se
definition: Competição em que podem participar indivíduos ou equipas dos cinco continentes. Designa-se por *Taça do Mundo*. @pt-pt
definition: Competição em que podem participar indivíduos ou equipes dos cinco continentes. Designa-se por *Copa do Mundo*. @pt-br
definition: Pokal, hvor atleter eller hold fra alle kontinenter kan deltage. @dk
definition: 五大洲运动员或运动队参加的杯赛 @zh-hans
note: Retired December 2021.
in scheme: Media Topic
created: 2009-10-22T02:00:00+00:00
retired: 2021-12-17T12:00:00+00:00
modified: 2021-12-17T12:00:00+00:00
broader: sport event

world games
type: Concept
preferred label: Juegos mundiales @es
preferred label: World Games @se
preferred label: العاب عالمية @ar
preferred label: Weltspiele @de
preferred label: Mondiaux @fr
preferred label: jogos mundiais @pt-pt
preferred label: verdenslege @dk
preferred label: 世界运动会 @zh-hans
preferred label: verdenslekene @no-nb
preferred label: verdsleikane @no-nn
definition: Wettkampf, an dem die besten Wettkämpfer oder Teams der fünf Kontinente teilnehmen. Weltspiele genannt @de
definition: A competition where individuals or teams from the five continents may participate. Called *World Games*
definition: Tävling där atleter eller lag från samtliga världsdelar kan delta. @se
definition: Competição em que podem participar indivíduos ou equipas dos cinco continentes. Designa-se por *Jogos Mundiais*. @pt-pt
definition: Competição em que podem participar indivíduos ou equipes dos cinco continentes. Designa-se por *Jogos Mundiais*. @pt-br
definition: Konkurrence, hvor atleter eller hold fra alle kontinenter kan deltage. @dk
definition: 五大州运动员或运动队参加的运动会 @zh-hans
note: Retired December 2021.
in scheme: Media Topic
created: 2009-10-22T02:00:00+00:00
retired: 2021-12-17T12:00:00+00:00
modified: 2021-12-17T12:00:00+00:00
broader: sport event

Olympic Games
type: Concept
preferred label: Olympiska spel @se
preferred label: jogos olímpicos @pt-pt
preferred label: Olympiske Lege (OL) @dk
preferred label: 奥林匹克运动会 @zh-hans
preferred label: olympiske leker (OL) @no-nb
preferred label: Olympische Spiele @de
preferred label: Jeux olympiques @fr
preferred label: Juegos Olímpicos @es
preferred label: دورة الألعاب الأولمبية @ar
preferred label: olympiske leikar (OL) @no-nn
definition: Internationella idrottstävlingar med antik förebild som arrangeras vart fjärde år. @se
definition: Games organised by the International Olympic Committee and held each 4 years in summer or winter.
definition: Evento desportivo internacional organizado pelo Comité Olímpico Internacional e realizado a cada 4 anos no verão ou inverno. @pt-pt
definition: Evento esportivo internacional organizado pelo Comitê Olímpico Internacional e realizado a cada 4 anos no verão ou inverno. @pt-br
definition: Sportslege arrangeret af Den Internationale Olympiske Komité og afholdt hvert 4. år om sommeren eller vinteren. @dk
definition: 国际奥林匹克运动委员会组织的每4年一次的夏季或秋季的运动会 @zh-hans
definition: Vom Internationalen Olympischen Komitee organisierte Spiele, die alle 4 Jahre im Sommer oder Winter stattfinden. @de
definition: Games organized by the International Olympic Committee and held each 4 years in summer or winter.
in scheme: Media Topic
created: 2016-08-24T12:00:00+00:00
modified: 2021-12-17T12:00:00+00:00
broader: sport event

Paralympic Games
type: Concept
preferred label: Paralympics @se
preferred label: jogos paraolímpicos @pt-pt
preferred label: Paralympiske Lege @dk
preferred label: 残疾人运动会 @zh-hans
preferred label: paralympics @no-nb
preferred label: Paralympische Spiele @de
preferred label: Jeux paralympiques @fr
preferred label: Juegos paralímpicos @es
preferred label: ألعاب بارالمبية @ar
preferred label: paralympiske leikar @no-nn
definition: Games for disabled athletes organised by the International Paralympic Committee and held each 4 years in winter or summer
definition: Internationella idrottstävlingar för elitidrottare med funktionsnedsättning. @se
definition: Evento desportivo internacional para atletas com deficiência organizado pelo Comité Paraolímpico Internacional e realizado a cada 4 anos no verão ou inverno. @pt-pt
definition: Evento esportivo internacional para atletas com deficiência organizado pelo Comitê Paraolímpico Internacional e realizado a cada 4 anos no verão ou inverno. @pt-br
definition: Sportslege for handicappede atleter arrangeret af Den Internationale Paralympiske Komité og afholdt hvert 4. år om vinteren eller sommeren. @dk
definition: 国际残疾人委员会为残疾运动员组织的运动会，每四年一次，冬季或夏季 @zh-hans
definition: Vom Internationalen Paralympischen Komitee organisierte Spiele für behinderte Sportler, die alle 4 Jahre im Winter oder Sommer stattfinden @de
definition: Games for disabled athletes organized by the International Paralympic Committee and held each 4 years in winter or summer
in scheme: Media Topic
created: 2016-08-24T12:00:00+00:00
modified: 2021-12-17T12:00:00+00:00
broader: sport event

regular competition
type: Concept
preferred label: seriespill og ranking @no-nb
preferred label: Seriespel @se
preferred label: seriespel og ranking @no-nn
preferred label: Temporada de deporte @es
preferred label: Saison sportive @fr
preferred label: موسم رياضي @ar
preferred label: Sportsaison @de
definition: A competitive sporting season where teams or individuals contend for a place in the standings or rankings
definition: Tävlingar under en säsong där lag eller individer kämpar om platser i tabell, eller ranking. @se
definition: Eine Wettkampfsaison, in der Mannschaften oder Einzelpersonen um einen Platz in der Tabelle oder Rangliste kämpfen @de
in scheme: Media Topic
created: 2021-12-17T12:00:00+00:00
modified: 2021-12-21T12:00:00+00:00
broader: sport event

playoff championship
type: Concept
preferred label: sluttspill @no-nb
preferred label: Slutspel @se
preferred label: sluttspel @no-nn
preferred label: Fase eliminatoria @es
preferred label: Série éliminatoire @fr
preferred label: أدوار إقصائية @ar
preferred label: Playoffs @de
definition: A competitive tournament, often played after the regular season of a sports league by the top competitors to determine the league champion or a similar accolade. Can also apply to an all-in elimination tournament meant to produce a final champion.
definition: Spelas efter seriespel med målsättning att utse slutlig vinnare eller lag/tävlande som flyttas upp eller ner mellan serier. @se
definition: Ein Wettbewerbsturnier, das oft nach der regulären Saison einer Sportliga von den besten Teilnehmern ausgetragen wird, um den Meister der Liga oder eine ähnliche Auszeichnung zu ermitteln. Kann sich auch auf ein All-in-Eliminationsturnier beziehen, bei dem ein endgültiger Champion ermittelt wird. @de
in scheme: Media Topic
created: 2021-12-17T12:00:00+00:00
modified: 2021-12-21T12:00:00+00:00
broader: sport event

final game
type: Concept
preferred label: finale @no-nb
preferred label: Final @se
preferred label: Final deportiva @es
preferred label: Finale @fr
preferred label: دراجات المضمار @ar
definition: Single game that determines the winner of a championship, such as the Super Bowl or Champions League Final
definition: Sista tävlingen som avgör vilket lag eller person som slutligen vinner. @se
definition: Einzelspiel, in dem der Sieger einer Meisterschaft ermittelt wird, z. B. der Super Bowl oder das Finale der Champions League @de
in scheme: Media Topic
created: 2021-12-17T12:00:00+00:00
modified: 2021-12-21T12:00:00+00:00
broader: sport event

trade show or expo
type: Concept
preferred label: Messe @de
preferred label: Mässor @se
preferred label: feira profissional @pt-pt
preferred label: messe @dk
preferred label: 贸易展览会 @zh-hans
preferred label: varemesse @no-nb
preferred label: Foires et salons @fr
preferred label: Ferias comerciales @es
preferred label: معرض تجاري @ar
definition: Marktplatz zum Ausstellen und Verkaufen von Waren oder Diensten @de
definition: Större utställning med viss typ av varor från flera olika försäljare, vanligtvis avsedd för återförsäljare. @se
definition: Market place to display and trade goods or services
definition: Exposição organizada para exibir e comercializar bens ou serviços de determinado setor profissional. @pt-pt
definition: Større udstilling med bestemt type varer fra flere forskellige leverandører, normalt beregnet til detailhandlere. @dk
definition: 展示和交易商品或服务的市场 @zh-hans
in scheme: Media Topic
created: 2012-10-04T12:00:00+00:00
modified: 2023-03-31T12:00:00+00:00
broader: business service

buy recommendation
type: Concept
preferred label: Köpråd @se
preferred label: Kaufen (Empfehlung) @de
preferred label: recomendação de compra @pt-pt
preferred label: købsanbefaling @dk
preferred label: 买入建议 @zh-hans
preferred label: kjøpsanbefaling @no-nb
preferred label: Recommandation d'achat (bourse) @fr
preferred label: Recomendación de compra @es
preferred label: توصية بالشراء (بورصة @ar
preferred label: kjøpstilråding @no-nn
definition: En analytikers rekommendation att köpa en specifik aktie. @se
definition: An analyst's recommendation to buy particular stocks. May include the analyst s price target for the stock.
definition: Empfehlung eines Analysten, bestimmte Aktien zu kaufen. Kann das Kursziel des Analysten für die Aktie beinhalten. @de
definition: Recomendação de um analista para comprar ações específicas. Pode incluir o preço-alvo do analista para uma ação. @pt-pt
definition: En analytikers anbefaling om at købe en bestemt aktie @dk
definition: 分析师购买特定股票的建议。可能包括分析师对该股的目标价 @zh-hans
definition: An analyst's recommendation to buy particular stocks. May include the analyst*s price target for the stock.
change note: Retired. Use medtop:20000396 stocks and/or genre:Analysis instead.
in scheme: Media Topic
created: 2012-10-04T12:00:00+00:00
retired: 2023-03-31T12:00:00+00:00
modified: 2023-03-31T12:00:00+00:00
broader: stock recommendation

hold recommendation
type: Concept
preferred label: Halten (Empfehlung) @de
preferred label: Råd att behålla @se
preferred label: recomendação para manter @pt-pt
preferred label: recomendação de manutenção @pt-br
preferred label: holdanbefaling @dk
preferred label: 持有建议 @zh-hans
preferred label: hold-anbefaling @no-nb
preferred label: Recommandation de conserver (bourse) @fr
preferred label: Recomendación de mantenimiento @es
preferred label: توصية بالاحتفاظ بأسهم (بورصة) @ar
preferred label: hald-tilråding @no-nn
definition: En analytikers rekommendation att behålla en specifik aktie. @se
definition: An analyst's recommendation to hold particular stocks. May include the analyst s price target for the stock.
definition: Empfehlung eines Analysten, bestimmte Aktien zu behalten. Kann das Kursziel des Analysten für die Aktie beinhalten. @de
definition: Recomendação de um analista para manter ações específicas. Pode incluir o preço-alvo do analista para uma ação. @pt-pt
definition: En analytikers anbefaling om at bevare en bestemt aktie. @dk
definition: 分析师持有特定股票的建议。可能包括分析师对该股的目标价 @zh-hans
definition: An analyst's recommendation to hold particular stocks. May include the analyst*s price target for the stock.
change note: Retired. Use medtop:20000396 stocks and/or genre:Analysis instead.
in scheme: Media Topic
created: 2012-10-04T12:00:00+00:00
retired: 2023-03-31T12:00:00+00:00
modified: 2023-03-31T12:00:00+00:00
broader: stock recommendation

sell recommendation
type: Concept
preferred label: Verkaufen (Empfehlung) @de
preferred label: Säljråd @se
preferred label: recomendação de venda @pt-pt
preferred label: salgsanbefaling @dk
preferred label: 卖出建议 @zh-hans
preferred label: Recommandation de vente (bourse) @fr
preferred label: Recomendación de venta @es
preferred label: توصية بالبيع (بورصة) @ar
preferred label: salstilråding @no-nn
definition: Empfehlung eines Analysten, bestimmte Aktien zu verkaufen. Kann das Kursziel des Analysten für die Aktie beinhalten. @de
definition: En analytikers rekommendation att sälja en specifik aktie. @se
definition: An analyst's recommendation to sell particular stocks. May include the analyst s price target for the stock.
definition: Recomendação de um analista para vender ações específicas. Pode incluir o preço-alvo do analista para uma ação. @pt-pt
definition: En analytikers anbefaling om at sælge en bestemt aktie. @dk
definition: 分析师卖出特定股票的建议。可能包括分析师对该股的目标价 @zh-hans
definition: An analyst's recommendation to sell particular stocks. May include the analyst*s price target for the stock.
change note: Retired. Use medtop:20000396 stocks and/or genre:Analysis instead.
in scheme: Media Topic
created: 2012-10-04T12:00:00+00:00
retired: 2023-03-31T12:00:00+00:00
modified: 2023-03-31T12:00:00+00:00
broader: stock recommendation

skateboarding
type: Concept
preferred label: Skateboard @se
preferred label: skate @pt-pt
preferred label: 滑板运动 @zh-hans
preferred label: Skateboarden @de
preferred label: Skateboarding @es
preferred label: لوح تزلج @ar
definition: De tävlande använder en liten platta med fyra hjul och åker runt och gör olika trick. @se
definition: Competitions involving stunts and acrobatic feats performed on a skateboard using various ramps and other obstacles
definition: Competições envolvendo manobras e acrobacias realizadas em skate usando várias rampas e outros obstáculos. @pt-pt
definition: Deltagerne bruger et skateboard (træplade med fire hjul) og udfører forskellige tricks på bane eller rampe. @dk
definition: 在具有不同坡度、障碍的赛道上使用滑板表演特技和杂技动作 @zh-hans
definition: Wettbewerbe mit Stunts und akrobatischen Kunststücken, die auf einem Skateboard unter Verwendung verschiedener Rampen und anderer Hindernisse ausgeführt werden @de
in scheme: Media Topic
created: 2014-11-07T12:00:00+00:00
modified: 2021-07-12T12:00:00+00:00
broader: roller sports

mixed martial arts
type: Concept
preferred label: mixed martial arts (MMA) @dk
preferred label: artes marciais mistas @pt-br
preferred label: MMA @se
preferred label: 散打 @zh-hans
preferred label: gemischte Kampfkünste @de
preferred label: Arts martiaux mixtes @fr
preferred label: Artes marciales mixtas @es
preferred label: فنون القتال المختلطة @ar
definition: En fuld kontaktkampsport ved hjælp af teknikker fra forskellige kampsportsdiscipliner, hvor stort set alt er tilladt. Foregår i et ottekantet bur. @dk
definition: A full-contact combat sport using techniques from various combat sports and martial arts
definition: Esporte de combate de contato total que usa técnicas de vários esportes de combate e artes marciais. @pt-br
definition: Desporto de combate de contacto total que usa técnicas de vários desportos de combate e artes marciais. @pt-pt
definition: (Mixed martial arts) Fullkontaktsport där utövarna får använda slag, kast, sparkar mm. Det är mer reglerat vad man inte får göra. @se
definition: 全身体接触的技击运动，可以使用各种格斗技术 @zh-hans
definition: Ein Vollkontakt-Kampfsport mit Techniken aus verschiedenen Kampfsportarten und Kampfsportarten @de
definition: Fullkontaktsport som gjer bruk av teknikkar frå ulike kampsportar. Stort sett alt er lov. Blir utøvd i eit åttekanta bur. @no-nn
definition: Fullkontaktsport bestående av teknikker fra forskjellige kampsporter. Stort sett alt er tillat. Foregår i et åttekantet bur. @no-nb
in scheme: Media Topic
created: 2019-04-06T12:00:00+00:00
modified: 2021-07-12T12:00:00+00:00
broader: martial arts

krav maga
type: Concept
preferred label: Krav maga @se
preferred label: 马伽术 @zh-hans
preferred label: Krav Maga @de
preferred label: كراف مغا @ar
definition: Fighting and self-defence sport that combines elements from aikido, boxing, judo, karate and wrestling
definition: Fighting and self-defense sport that combines elements from aikido, boxing, judo, karate and wrestling
definition: Kombination av flera andra saker som boxning, judo och karate både för självförsvar och tävling. @se
definition: Kampsport og selvforsvarsteknik, der indeholder elementer fra andre kampsportsgrene. @dk
definition: Sistema de luta e autodefesa que combina elementos do aikido, boxe, judo, caraté e luta livre. @pt-pt
definition: Sistema de luta e autodefesa que combina elementos do aikido, boxe, judô, caratê e luta livre. @pt-br
definition: 格斗和自卫运动，结合了合气道，拳击，柔道，空手道和摔跤的元素 @zh-hans
definition: Kampf- und Selbstverteidigungssport, der Elemente aus Aikido, Boxen, Judo, Karate und Ringen kombiniert @de
in scheme: Media Topic
created: 2021-02-18T12:00:00+00:00
modified: 2021-07-12T12:00:00+00:00
broader: martial arts

kickboxing
type: Concept
preferred label: kickboksing @no-nb
preferred label: Kickboxning @se
preferred label: kickboksning @dk
preferred label: 跆拳道 @zh-hans
preferred label: Kickboxen @de
preferred label: Kick-boxing @fr
preferred label: Kickboxing @es
preferred label: كيك بوكسينغ @ar
definition: Stand-up combat sport based on kicking and punching an opponent
definition: Upprättstående kontaktsport där de tävlande både för slå och sparka varandra. @se
definition: En kampsport, der foregår i en boksering, hvor man både må slå og sparke. @dk
definition: Desporto de combate em pé baseado em chutos e socos no adversário. @pt-pt
definition: Esporte de combate em pé baseado em chutes e socos no adversário. @pt-br
definition: 站立的以脚为主踢打对手的格斗运动 @zh-hans
definition: Stand-up-Kampfsportart, die auf Tritten und Schlägen gegen einen Gegner basiert @de
in scheme: Media Topic
created: 2021-02-18T12:00:00+00:00
modified: 2021-07-12T12:00:00+00:00
broader: martial arts

sambo (martial art)
type: Concept
preferred label: sombo (martial art)
preferred label: sambo @no-nb
preferred label: Sambo @se
preferred label: 桑搏 @zh-hans
preferred label: Sambo (art martial) @fr
preferred label: Sambo (arte marcial) @es
preferred label: قتال السامبو @ar
definition: Style of martial art originating in the Soviet Union that is recognised as a form of amateur wrestling
definition: Style of martial art originating in the Soviet Union that is recognized as a form of amateur wrestling
definition: Brottningsliknande sport med rötter i Sovjetunionen. @se
definition: Sovjettisk kampsport, der minder om brydning. @dk
definition: Estilo de arte marcial originário da União Soviética que é reconhecido como uma forma de luta livre amadora. @pt-pt
definition: 起源于苏联的一种武术形式，被认为是业余摔跤的一种形式 @zh-hans
definition: Aus der Sowjetunion stammender Kampfsportstil, der als eine Form des Amateur-Wrestlings anerkannt ist @de
in scheme: Media Topic
created: 2021-02-18T12:00:00+00:00
modified: 2021-07-12T12:00:00+00:00
broader: martial arts

asset management
type: Concept
preferred label: Kapitalförvaltare @se
preferred label: gestão de ativos @pt-pt
preferred label: kapitalforvaltning @dk
preferred label: 资产管理 @zh-hans
preferred label: Vermögensverwaltung @de
preferred label: Gestion d*actifs @fr
preferred label: Gestión de activos @es
preferred label: ادارة اصول @ar
definition: Managing investments on behalf of others
definition: Tjänster för att få tillgångar att växa genom investering i aktier, fonder och dylikt. @se
definition: Gestão de ativos ou de fundos para aumentar o rendimento, investindo em ações, títulos, fundos mútuos, fundos de cobertura, etc. @pt-pt
definition: Gestão de ativos ou de fundos para aumentar a renda, investindo em ações, títulos, fundos mútuos, fundos multimercado etc. @pt-br
definition: Tjenester til vækst af aktiver gennem investering i aktier, gensidige fonde og lignende. @dk
definition: 通过投资股票、债券、共同基金、对冲基金等方式进行资产或资金的管理，以增加收入 @zh-hans
definition: Verwaltung von Vermögenswerten oder Fonds zur Erhöhung der Einnahmen durch Investitionen in Aktien, Anleihen, Investmentfonds, Hedge-Fonds usw. @de
in scheme: Media Topic
created: 2016-04-04T12:00:00+00:00
modified: 2023-03-31T12:00:00+00:00
broader: financial service

payment service
type: Concept
preferred label: Betalningstjänster @se
preferred label: sistema de pagamento @pt-pt
preferred label: betalingstjeneste @dk
preferred label: 支付服务 @zh-hans
preferred label: betalingssystem @no-nb
preferred label: Zahlungsdienst @de
preferred label: Services de paiement @fr
preferred label: Servicios de pago @es
preferred label: خدمات المدفوعات @ar
definition: Tjänster för att genomföra betalningar, inklusive kontanter, checkar, betalkort, internetbanker och betalningar med hjälp av datorer eller mobiltelefoner. @se
definition: Services for executing payments including cash, cheque, credit card, debit card, direct debit, electronic funds transfer, internet banking, electronic and mobile payment.
definition: Serviços para a execução de pagamentos, incluindo dinheiro, cheque, cartão de crédito, cartão de débito, débito direto, transferência eletrónica de fundos, internet banking, pagamento eletrónico e móvel. @pt-pt
definition: Serviços para a execução de pagamentos, incluindo dinheiro, cheque, cartão de crédito, cartão de débito, débito direto, transferência eletrônica de fundos, internet banking, pagamento eletrônico e móvel. @pt-br
definition: Tjenester til udførelse af betalinger inklusive kontanter, check, kreditkort, betalingskort, direkte debet, elektronisk pengeoverførsel, internetbank, elektronisk og mobil betaling. @dk
definition: 执行支付的服务，包括现金、支票、信用卡、借记卡、直接借记、电子资金转帐、网上银行、电子和移动支付等支付方式 @zh-hans
definition: Dienstleistungen zur Ausführung von Zahlungen, einschließlich Bargeld, Schecks, Kreditkarten, Debitkarten, Lastschriften, elektronischer Geldtransfer, Internet-Banking, elektronische und mobile Zahlungen. @de
in scheme: Media Topic
created: 2016-04-04T12:00:00+00:00
modified: 2023-03-31T12:00:00+00:00
broader: business service

medical equipment
type: Concept
preferred label: Medicinsk utrustning @se
preferred label: equipamento médico @pt-pt
preferred label: medicinsk udstyr @dk
preferred label: 医疗设备 @zh-hans
preferred label: medisinsk utstyr @no-nb
preferred label: medizinische Ausrüstrung @de
preferred label: Équipement médical @fr
preferred label: Equipamiento médico @es
preferred label: معدات طبية @ar
definition: Tillverkning av medicinska eller kirurgiska produkter som används för diagnosticering och behandling av sjuka. @se
definition: Manufacture of medical and surgical devices for diagnosis and treatment such as optical and imaging equipment
definition: Fabrico de dispositivos médicos e cirúrgicos para diagnóstico e tratamento. @pt-pt
definition: Fabricação de dispositivos médicos e cirúrgicos para diagnóstico e tratamento. @pt-br
definition: Fremstilling af medicinske eller kirurgiske produkter, der anvendes til diagnose og behandling af syge. @dk
definition: 制造用于诊断和治疗的医疗和外科设备，如光学和成像设备 @zh-hans
definition: Herstellung von medizinischen und chirurgischen Geräten für Diagnose und Behandlung, wie optische und bildgebende Geräte. @de
in scheme: Media Topic
created: 2016-04-04T12:00:00+00:00
modified: 2023-03-31T12:00:00+00:00
broader: healthcare industry

influencers
type: Concept
preferred label: Influencers @se
preferred label: influenciadores @pt-pt
preferred label: influencer @dk
preferred label: 网络名人 @zh-hans
preferred label: influencere @no-nb
preferred label: Influencer @de
preferred label: Influenceurs @fr
preferred label: المؤثرون @ar
preferred label: influensarar @no-nn
definition: Personer som lägger ut saker på nätet, får många följare och därmed influerar dem. @se
definition: Persons who distribute content on internet forums and social media and are followed by many people thereby influencing them to buy and use products
definition: Pessoas que distribuem conteúdo em fóruns da Internet e redes sociais e são seguidas por muitas pessoas, influenciando-as para comprar e usar produtos. @pt-pt
definition: Pessoas que distribuem conteúdo em fóruns da Internet e mídias sociais e são seguidas por muitas pessoas, influenciando-as para comprar e usar produtos. @pt-br
definition: Personer, der udgiver noget online, får mange tilhængere og dermed påvirker dem. @dk
definition: 也称网红，在互联网论坛和社交媒体上发布内容的人，被很多人关注，并影响受众购买和使用产品 @zh-hans
definition: Personen, die Inhalte in Internetforen und sozialen Medien verbreiten und von vielen Menschen verfolgt werden, wodurch sie zum Kauf und zur Nutzung von Produkten beeinflusst werden @de
in scheme: Media Topic
created: 2019-04-06T12:00:00+00:00
modified: 2021-07-12T12:00:00+00:00
broader: social media

exercise and fitness
type: Concept
preferred label: Motion & hälsa @se
preferred label: exercício físico @pt-pt
preferred label: træning og fitness @dk
preferred label: 运动与健身 @zh-hans
preferred label: fysisk trening @no-nb
preferred label: Bewegung und Fitness @de
preferred label: Activité physique et fitness @fr
preferred label: Ejercicio físico y fitness @es
preferred label: تمارين جسدية ولياقة @ar
definition: Physical activity with the purpose to maintain and improve health and wellness, gain stamina or for enjoyment
definition: Fysiska aktiviteter som mest utförs för personens egen skull och inte för att utveckla idrottsliga färdigheter @se
definition: Atividade física com o objetivo de manter e melhorar a saúde e o bem-estar, ganhar resistência ou divertir-se. @pt-pt
definition: Atividade física com o objetivo de manter e melhorar a saúde e o bem-estar, ganhar resistência ou se divertir. @pt-br
definition: Fysisk aktivitet, som har til formål at forbedre en persons fysiske tilstand, men også fungerer som adspredelse. @dk
definition: 以保持和改善身体健康为目的的体育活动 @zh-hans
definition: Körperliche Aktivität mit dem Ziel, Gesundheit und Wohlbefinden zu erhalten und zu verbessern, Ausdauer zu gewinnen oder zum Vergnügen @de
in scheme: Media Topic
created: 2019-06-26T12:00:00+00:00
modified: 2021-12-17T12:00:00+00:00
broader: wellness

heating and cooling
type: Concept
preferred label: Värme och ventilation @se
preferred label: varme og ventilasjon @no-nb
preferred label: climatização @pt-pt
preferred label: fjernvarme og fjernkøling @dk
preferred label: 供热和制冷 @zh-hans
preferred label: Heizung und Kühlung @de
preferred label: Chauffage et climatisation @fr
preferred label: Calefacción y aire acondicionado @es
preferred label: تدفئة وتبريد @ar
definition: The business of supplying heat or cooling to private residences and commercial buildings
definition: Verksamhet som tillhandahåller värme, ventilation och luftkonditionering till privata hem och företag. @se
definition: Negócio de fornecimento de calor ou refrigeração para residências privadas e edifícios comerciais. @pt-pt
definition: Levering af varme eller køling til private eller offentlige ejendomme. @dk
definition: 为住宅或商业楼宇提供热制冷服务 @zh-hans
definition: Das Geschäft der Wärme- oder Kälteversorgung von Privatwohnungen und gewerblichen Gebäuden @de
definition: The business of supplying heat, cooling and ventilation to private residences and commercial buildings
in scheme: Media Topic
created: 2020-08-05T12:00:00+00:00
modified: 2023-03-31T12:00:00+00:00
broader: utilities

tattooing
type: Concept
preferred label: piercing @dk
preferred label: tatuagem @pt-br
preferred label: Tatuering @se
preferred label: 纹身 @zh-hans
preferred label: tatovering @no-nb
preferred label: Tätowierung @de
preferred label: Tatouage @fr
preferred label: Tatuaje @es
preferred label: وشم @ar
definition: En form for kropsudsmykning, hvor man gennemhuller eller skærer i dele af den menneskelige krop. @dk
definition: A form of body modification where a design is made by inserting ink, dyes and pigments into the dermis layer of the skin to permanently change the pigment
definition: Tipo de modificação corporal em que se cria um desenho ou texto inserindo tinta, corantes e pigmentos na camada da derme da pele para alterar permanentemente o pigmento da pele. @pt-br
definition: Dekorering av den egna kroppen genom att bläck förs in i skinnet och bildar en permanent bild eller text. @se
definition: 身体修饰的一种形式，通过将墨水、染料和颜料插入皮肤的真皮层以永久改变颜料来进行设计 @zh-hans
definition: Eine Form der Körpermodifikation, bei der ein Design durch Einbringen von Tinte, Farbstoffen und Pigmenten in die Dermisschicht der Haut hergestellt wird, um das Pigment dauerhaft zu verändern @de
in scheme: Media Topic
created: 2019-07-30T12:00:00+00:00
modified: 2021-07-12T12:00:00+00:00
broader: body modification

piercing
type: Concept
preferred label: tatovering @dk
preferred label: Piercing @se
preferred label: 穿孔 @zh-hans
preferred label: ثقوب الجسم @ar
definition: En form for kropsudsmykning, hvor man tilfører huden blæk med det formål at ændre dens farve permanent. @dk
definition: A form of body modification involving the puncturing or cutting of a part of the human body, creating an opening in which jewellery may be worn or where an implant could be inserted
definition: Tipo de modificação corporal que envolve a perfuração ou corte de uma parte do corpo humano, criando uma abertura na qual se podem inserir joias ou implantes. @pt-br
definition: Dekorering av den egna kroppen genom att hål tas där smycken placeras. @se
definition: 身体修饰的一种形式，包括刺穿或切割人体的一部分，创造一个可以佩戴珠宝或植入物的开口 @zh-hans
definition: Eine Form der Körpermodifikation, bei der ein Teil des menschlichen Körpers punktiert oder durchtrennt wird, wodurch eine Öffnung geschaffen wird, in der Schmuck getragen oder ein Implantat eingesetzt werden kann. @de
definition: A form of body modification involving the puncturing or cutting of a part of the human body, creating an opening in which jewelry may be worn or where an implant could be inserted
in scheme: Media Topic
created: 2019-07-30T12:00:00+00:00
modified: 2021-07-12T12:00:00+00:00
broader: body modification

sports record
type: Concept
preferred label: idrettsrekord @no-nb
preferred label: Rekord (sport och idrott) @se
preferred label: sportsrekord @dk
preferred label: recorde desportivo @pt-pt
preferred label: recorde esportivo @pt-br
preferred label: 运动记录 @zh-hans
preferred label: Rekord @de
preferred label: Record sportif @fr
preferred label: Récord deportivo @es
preferred label: رقم قياسي رياضي @ar
definition: The best performance to date by an athlete or team in a sport discipline
definition: Bästa resultat i världen eller annat område, säsongsbästa osv. @se
definition: Den hidtil bedste præstation til dato blandt alle atleter eller hold. @dk
definition: O melhor desempenho de um atleta em determinada área. @pt-pt
definition: 运动员在某一特定领域迄今为止最好的表现 @zh-hans
definition: Die bisher beste Leistung eines Sportlers in einem bestimmten Bereich @de
in scheme: Media Topic
created: 2021-02-18T12:00:00+00:00
modified: 2022-09-23T12:00:00+00:00
broader: sport achievement

sports medal and trophy
type: Concept
preferred label: idrettsmedalje @no-nb
preferred label: Medaljer @se
preferred label: sportsmedalje @dk
preferred label: medalha desportiva @pt-pt
preferred label: medalha esportiva @pt-br
preferred label: 体育奖牌 @zh-hans
preferred label: Medaille @de
preferred label: Médaille sportive @fr
preferred label: Medalla deportiva @es
preferred label: ميدالية رياضية @ar
definition: Award given to an athlete or team for placing in a sports competition, such as a gold medal at the Olympics or the Stanley Cup in ice hockey
definition: Medaljer från OS, VM osv. Sammanställningar av medaljskörd per nation. @se
definition: Æresbevisning eller hæder, som tildeles en atlet eller et hold , der har placeret sig blandt de bedste i en konkurrence. @dk
definition: Honra concedida a um atleta ou a uma equipa pelo lugar alcançado numa competição desportiva, como os Jogos Olímpicos. @pt-pt
definition: Honra concedida a um atleta ou a uma equipe pelo lugar alcançado em uma competição esportiva, como os Jogos Olímpicos. @pt-br
definition: 运动员因参加体育比赛而获得的荣誉，如奥运会奖牌 @zh-hans
definition: Ehre, die einem Sportler für eine Platzierung in einem sportlichen Wettbewerb, z. B. bei den Olympischen Spielen, zuteil wird @de
in scheme: Media Topic
created: 2021-02-18T12:00:00+00:00
modified: 2022-09-23T12:00:00+00:00
broader: sport achievement
broad match: Q15229207

sports honour
type: Concept
preferred label: sports honor
preferred label: idrettsutmerkelse @no-nb
preferred label: Sportutmärkelser @se
preferred label: sportskåring @dk
preferred label: prémio desportivo @pt-pt
preferred label: prêmio esportivo @pt-br
preferred label: 体育奖 @zh-hans
preferred label: sportliche Preise @de
preferred label: Prix sportif @fr
preferred label: Premio deportivo @es
preferred label: جائزة رياضية @ar
preferred label: idrettsutmerking @no-nn
definition: Honour given to a player for achievements over a career, season or single event, unrelated to event outcome, usually awarded by a panel of judges or a popular vote. Examples include player of the game, most valuable player award or hall of fame induction.
definition: Honor given to a player for achievements over a career, season or single event, unrelated to event outcome, usually awarded by a panel of judges or a popular vote. Examples include player of the game, most valuable player award or hall of fame induction.
definition: Erkännande av en idrottspersons framgångar som årets idrottare, eller inval i någon Hall of fame. @se
definition: Æresbevisning eller hæder, som tildeles en atlet eller et hold på baggrund af dennes præstationer. @dk
definition: Prémio ou honra atribuídos a um atleta em reconhecimento da sua carreira. @pt-pt
definition: Prêmio ou honra atribuídos a um atleta em reconhecimento de sua carreira. @pt-br
definition: 对运动员职业生涯的认可，如进入名人堂 @zh-hans
definition: Anerkennung der Karriere eines Sportlers, wie z. B. die Aufnahme in eine Ruhmeshalle @de
in scheme: Media Topic
created: 2021-02-18T12:00:00+00:00
modified: 2022-09-23T12:00:00+00:00
broader: sport achievement

mental wellbeing
type: Concept
preferred label: psykisk velvære @no-nb
preferred label: Mentalt välbefinnande @se
preferred label: Bienestar mental @es
preferred label: Bien-être mental @fr
preferred label: رفاهية عقلية @ar
preferred label: Geistiges Wohlbefinden @de
definition: The personal pursuit of mental health through activities such as meditation, stress reduction, technology detoxes and journalling
definition: The personal pursuit of mental health through activities such as meditation, stress reduction, technology detoxes and journaling
definition: Aktiviteter som meditation och stresshantering för att öka mentalt välbefinnande. @se
definition: Das persönliche Streben nach geistiger Gesundheit durch Aktivitäten wie Meditation, Stressabbau, Technologieentgiftung und Tagebuchschreiben @de
in scheme: Media Topic
created: 2021-12-17T12:00:00+00:00
modified: 2021-12-21T12:00:00+00:00
broader: wellness

physical security
type: Concept
definition: Private security measures, such as guards, access barriers, and surveillance cameras, and the companies that provide them
in scheme: Media Topic
created: 2026-07-02T12:00:00+00:00
modified: 2026-07-02T12:00:00+00:00
broader: business service

missing in action
type: Concept
preferred label: Saknad i krig @se
preferred label: savnet i strid @no-nb
preferred label: savna i strid @no-nn
preferred label: Kriegsvermisste @de
definition: A member of the armed forces who cannot be located and has not been confirmed as either alive or dead
definition: Militär personal som saknas i strid och inte är bekräftat döda eller återfunna. @se
definition: Ein Angehöriger der Streitkräfte, der nicht auffindbar ist und dessen Tod nicht bestätigt wurde @de
change note: Duplicate of medtop:20000061, added in error. Please do not use.
in scheme: Media Topic
created: 2024-03-28T12:00:00+00:00
retired: 2024-07-01T12:00:00+00:00
modified: 2024-03-28T12:00:00+00:00
broader: war victims