Rights Property
type: ConceptScheme
pref scheme alias: rightsprop
authority: http://www.iptc.org
rights holder: IPTC, International Press Telecommunications Council - https://iptc.org
licence link: http://creativecommons.org/licenses/by/4.0/
date released: 2024-09-26T12:00:00+00:00
date submitted: 2024-09-26T12:00:00+00:00
definition: Metadata property for data regarding rights
has top concept: Copyright Year
has top concept: Encoded Rights Expression
has top concept: Licensor
has top concept: Minor Model Age Disclosure
has top concept: Model Release Id
has top concept: Model Release Status
has top concept: Property Release Id
has top concept: Property Release Status

Copyright Year
type: Concept
definition: Year of origin of the media asset, usually appearing in the copyright notice as a numeric value
in scheme: Rights Property
created: 2024-09-26T12:00:00+00:00
modified: 2024-09-26T12:00:00+00:00

Encoded Rights Expression
type: Concept
definition: A rights expression using any rights expression language.
in scheme: Rights Property
created: 2017-12-05T12:00:00+00:00
modified: 2017-12-05T12:00:00+00:00

Licensor
type: Concept
definition: Party granting the license
in scheme: Rights Property
created: 2017-12-05T12:00:00+00:00
modified: 2017-12-05T12:00:00+00:00

Minor Model Age Disclosure
type: Concept
definition: Age of the youngest model depicted in the media asset, at the time that the asset was made.
in scheme: Rights Property
created: 2017-12-05T12:00:00+00:00
modified: 2017-12-05T12:00:00+00:00

Model Release Id
type: Concept
definition: Identifier of a Model Release document
in scheme: Rights Property
created: 2017-12-05T12:00:00+00:00
modified: 2017-12-05T12:00:00+00:00

Model Release Status
type: Concept
definition: Summarises the availability and scope of model releases authorising usage of the likenesses of persons appearing in the media.
in scheme: Rights Property
created: 2017-12-05T12:00:00+00:00
modified: 2017-12-05T12:00:00+00:00

Property Release Id
type: Concept
definition: Identifier of a Property Release document
in scheme: Rights Property
created: 2017-12-05T12:00:00+00:00
modified: 2017-12-05T12:00:00+00:00

Property Release Status
type: Concept
definition: Summarises the availability and scope of property releases authorising usage of the properties appearing in the media asset
in scheme: Rights Property
created: 2017-12-05T12:00:00+00:00
modified: 2017-12-05T12:00:00+00:00