tourada
type: Concept
preferred label: toros @es
preferred label: bullfighting @en-gb
preferred label: Corrida @it
preferred label: Tauromachie @fr
preferred label: Stierkampf @de
preferred label: 闘牛 @ja-jp
definition: Tauromachie, combat entre un homme et un taureau @fr
definition: Clasico enfrentamiento entre Toro y Hombre. @es
definition: Klassischer Wettkampf Mann gegen Stier. @de
definition: Classical contest pitting man against the bull @en-gb
definition: Tradizionale combattimento fra uomo e toro @it
definition: Espetáculo tradicional de Portugal, Espanha e França, também popular em alguns países da América do Sul, que consiste na lide de touros bravos.
definition: 人間を雄牛と戦わせる伝統的な競技 @ja-jp
definition: Combate clássico entre homem e touro.
note: nessuno @it
in scheme: subjectcode
created: 2000-10-30T12:00:00+00:00
modified: 2010-12-15T17:01:09+00:00
broader: http://cv.iptc.org/newscodes/subjectcode/01000000