Cinema
type: Concept
preferred label: cinema @pt-pt
preferred label: 映画 @ja-jp
preferred label: cine @es
preferred label: Film @de
preferred label: Cinéma @fr
definition: Historias relacionadas al cine como arte y entretención @es
definition: Histórias relativas ao cinema como arte e entretenimento. @pt-br
definition: Cinema as art and entertainment @en-gb
definition: Procédé d'enregistrement et de projection de vues photographiques animées et art de réaliser des films @fr
definition: Ideazione, produzione, realizzazione di storie attraverso la pellicola cinematografica e fruizione da parte del pubblico
definition: 芸術や娯楽としての映画と関連した記事 @ja-jp
definition: Film im künstlerischen und unterhaltenden Sinn @de
note: nessuno
in scheme: subjectcode
created: 2000-10-30T12:00:00+00:00
modified: 2010-12-15T17:01:09+00:00
broader: http://cv.iptc.org/newscodes/subjectcode/01000000
narrower: http://cv.iptc.org/newscodes/subjectcode/01005001