dança
type: Concept
preferred label: Danse @fr
preferred label: dance @en-gb
preferred label: ダンス @ja-jp
preferred label: Tanz @de
preferred label: Ballo @it
preferred label: danza @es
definition: The expression of emotion or message through movement @en-gb
definition: Expressão de emoções ou mensagens através do movimento do corpo.
definition: Der Ausdruck von Gefühlen durch Bewegung. @de
definition: Expressão de emoções ou mensagens através do movimento.
definition: Suite de mouvements rythmés exprimant un message ou une émotion @fr
definition: Comunicazione di un'emozione o messaggio attraverso il movimento. @it
definition: La expresion de emociones o mensajes a través del movimiento @es
definition: 身体動作による感情やメッセージの表現 @ja-jp
note: nessuno @it
in scheme: subjectcode
created: 2000-10-30T12:00:00+00:00
modified: 2010-12-15T17:01:09+00:00
broader: http://cv.iptc.org/newscodes/subjectcode/01000000