Gioielli
type: Concept
preferred label: joias @pt-br
preferred label: Joaillerie @fr
preferred label: joyas @es
preferred label: Schmuck @de
preferred label: アクセサリー @ja-jp
preferred label: jewelry @en-gb
definition: Accessori ornamentali da indossare, di solito realizzati con metalli o altri materiali nobili ma anche la bigiotteria
definition: Joias como acessórios de roupa. @pt-br
definition: Accessories to clothing @en-gb
definition: Accessoires zur Kleidung. @de
definition: Accesorios de vestimentas @es
definition: 衣服に付けるアクセサリー @ja-jp
definition: Joyaux et bijoux accessoires à l'habillement @fr
note: nessuno
in scheme: subjectcode
created: 2004-10-13T12:00:00+00:00
modified: 2012-07-10T12:00:00+00:00
broader: http://cv.iptc.org/newscodes/subjectcode/01007000