Biblioteche, musei
type: Concept
preferred label: bibliotecas e museus @pt-br
preferred label: Bibliothèque et musée @fr
preferred label: bibliotecas y museos @es
preferred label: 図書館・博物館 @ja-jp
preferred label: library and museum @en-gb
preferred label: Bibliothek und Museum @de
definition: 公共の使用や展示を目的とする、過去から現代までの本、音楽、芸術、あるいはオブジェクトの収集を収容するために使われる建造物 @ja-jp
definition: Edifices used to house collections of books, music, art, or objects from the past and present for public use and display @en-gb
definition: Collezioni di libri, musica, arte, o oggetti del passato e del presente per fruizione da parte del pubblico o per esposizione.
definition: Bâtiments ouverts au public pour la consultation de livres et de disques ou l'exposition de collections d'objets d'arts @fr
definition: Edifícios utilizados para albergar coleções de livros, música, arte ou objetos do passado e do presente para uso público e exibição. @pt-br
definition: Edificios utilizados para albergar colecciones de libros, música, arte u objetos del pasado y presente para su exhibición pública. @es
definition: Gebäude, die Sammlungen von Büchern, Musik, Kunst oder Objekte aus Vergangenheit und Gegenwart, zur öffentlichen Nutzung und Ansicht bereitstellen. @de
note: nessuno
in scheme: subjectcode
created: 2000-10-30T12:00:00+00:00
modified: 2010-12-15T17:01:09+00:00
broader: http://cv.iptc.org/newscodes/subjectcode/01000000