Letteratura
type: Concept
preferred label: literature @en-gb
preferred label: 文学 @ja-jp
preferred label: literatura @es
preferred label: Literatur @de
preferred label: Littérature @fr
definition: Ensemble des œuvres écrites @fr
definition: 思想、物語あるいはその他のメッセージを大衆に伝えるためのパンフレット、本あるいはその他の印刷物の使用 @ja-jp
definition: El uso de panfletos, libros u otro material impreso para comunicar ideas, historias u otros mensajes al público. @es
definition: Uso de panfletos, livros ou outros materiais impressos para transmitir ideias, histórias ou mensagens ao público. @pt-br
definition: Die Nutzung von Broschüren, Büchern oder anderen Printmedien, um Ideen, Geschichten oder andere Botschaften in der Öffentlichkeit zu verbreiten. @de
definition: Opuscoli, libri o altro materiale stampato per comunicare al pubblico idee, storie o altri messaggi.
definition: The use of pamphlets, books or other printed matter to convey ideas, stories or other messages for the public @en-gb
note: nessuno
in scheme: subjectcode
created: 2000-10-30T12:00:00+00:00
modified: 2010-12-15T17:01:09+00:00
broader: http://cv.iptc.org/newscodes/subjectcode/01000000
narrower: http://cv.iptc.org/newscodes/subjectcode/01010001
narrower: http://cv.iptc.org/newscodes/subjectcode/01010002