Poesia
type: Concept
preferred label: poesia @pt-pt
preferred label: Poesie @de
preferred label: Poésie @fr
preferred label: poesía @es
preferred label: 詩 @ja-jp
preferred label: poetry @en-gb
definition: Kunst, Struktur und Formen des poetischen Ausdrucks. @de
definition: 芸術、構成、詩的な表現の形式 @ja-jp
definition: Arte, estrutura e formas de expressão poética. @pt-br
definition: Art, structure et formes de l'expresion poétique @fr
definition: El arte, estructuras, y formas de expresón poética. @es
definition: Arte, struttura e forme dell'espressione poetica
definition: The art, structure, forms of poetic expression @en-gb
note: nessuno
in scheme: subjectcode
created: 2004-10-13T12:00:00+00:00
modified: 2012-07-10T12:00:00+00:00
broader: http://cv.iptc.org/newscodes/subjectcode/01010000