Musica
type: Concept
preferred label: Musique @fr
preferred label: música @pt-pt
preferred label: Musik @de
preferred label: 音楽 @ja-jp
preferred label: music @en-gb
definition: Expressão de emoções ou mensagens através de instrumentos ou voz, usando diferentes sons, tons e harmonias. @pt-br
definition: Ausdruck von Gefühlen oder Botschaften durch Instrumente oder Stimmen, die unterschiedliche Klänge, Töne, Harmonien und ähnliches erzeugen. @de
definition: 異なる音量、音質、調和などを使い、楽器又は音声を通じて感情やメッセージを表現すること @ja-jp
definition: Expresar emociones o mensajes a través de instrumentos o voz usando diferentes sonidos, tonos y harmonías smiliares. @es
definition: Expressing emotion or message through instruments or voice using different sounds, tones, harmonies and the like @en-gb
definition: Espressione di un'emozione o di un messaggio attraverso l'uso di strumenti e/o della voce per mezzo di differenti suoni, toni, armonie
definition: Art de combiner les sons au moyen d'instruments ou de la voix @fr
note: nessuno
in scheme: subjectcode
created: 2000-10-30T12:00:00+00:00
modified: 2010-12-15T17:01:09+00:00
broader: http://cv.iptc.org/newscodes/subjectcode/01000000
narrower: http://cv.iptc.org/newscodes/subjectcode/01011001
narrower: http://cv.iptc.org/newscodes/subjectcode/01011002
narrower: http://cv.iptc.org/newscodes/subjectcode/01011003
narrower: http://cv.iptc.org/newscodes/subjectcode/01011004
narrower: http://cv.iptc.org/newscodes/subjectcode/01011005
narrower: http://cv.iptc.org/newscodes/subjectcode/01011006
narrower: http://cv.iptc.org/newscodes/subjectcode/01011007