música popular
type: Concept
preferred label: ポピュラー @ja-jp
preferred label: Pop @fr
preferred label: popular music @en-gb
definition: La dernière mode musicale, généralement destinée aux jeunes @fr
definition: A última moda em música, geralmente destinada à geração mais jovem. @pt-br
definition: Genere musicale in cui rientrano in particolare le ultime novità discografiche, in contrapposizione ad altri generi considerati colti, destinato soprattutto alle giovani generazioni @it
definition: 一般に、若い世代向けの、最新の流行音楽 @ja-jp
definition: Der neuste Trend in der Musik, meist für die jüngere Generation. @de
definition: La ultima moda en música generalmente dirigida a la juventud
definition: The latest fad in music, generally aimed at the younger generation @en-gb
note: nessuno @it
in scheme: subjectcode
created: 2003-04-05T12:00:00+00:00
modified: 2012-07-10T12:00:00+00:00
broader: http://cv.iptc.org/newscodes/subjectcode/01011000