Country
type: Concept
preferred label: country @pt-br
preferred label: música country @es
preferred label: country music @en-gb
preferred label: カントリー @ja-jp
definition: Música característica dos Estados Unidos. @pt-br
definition: Parecidas al Música Fol., pero es única de Estados Unidos, y no habla tanto de buscar y perder amor @es
definition: Musique populaire spécifique aux USA @fr
definition: Genere musicale tipico degli Usa, con caratterizzazione analoga al Folk e con la presenza di forme musicali della tradizione americana come la ballata
definition: フォークに類似しているが、米国特有なもので、物語よりはむしろ求愛や失恋についての音楽 @ja-jp
definition: Similar to folk but is unique to the United States and is less about story telling than about loves sought and lost @en-gb
definition: Vergleichbar mit Folk, weniger erzählend, handelt eher von der Suche nach Liebe und deren Verlust und kommt ausschließlich aus den USA. @de
note: nessuno
in scheme: subjectcode
created: 2003-04-05T12:00:00+00:00
modified: 2012-07-10T12:00:00+00:00
broader: http://cv.iptc.org/newscodes/subjectcode/01011000