Rock and roll
type: Concept
preferred label: rock @pt-br
preferred label: rock and roll music @en-gb
preferred label: Rock and Roll @de
preferred label: música rock and roll @es
preferred label: ロック @ja-jp
preferred label: Rock @fr
definition: Popular dance music developed in the 1950s @en-gb
definition: Música popular de dança desenvolvida na década de 1950. @pt-br
definition: Populäre Tanzmusik aus den 1950-er Jahren. @de
definition: 1950年代に発展したポピュラーなダンス音楽 @ja-jp
definition: Popolare genere di musica da ballo nato negli anni '50 negli Usa e poi diffusosi nel mondo. Da esso sono derivati vari altri generi, di solito indicati con l'abbreviazione ‘Rock'
definition: Baile popular desamolda a mediados de los años cincuenta @es
definition: Musique populaire caractérisée par une large amplification électrique et par l'accentuation des deuxième et quatrième temps de la mesure @fr
note: nessuno
in scheme: subjectcode
created: 2003-04-05T12:00:00+00:00
modified: 2012-07-10T12:00:00+00:00
broader: http://cv.iptc.org/newscodes/subjectcode/01011000