Radio
type: Concept
preferred label: radio @en-gb
preferred label: ラジオ番組 @ja-jp
preferred label: rádio @pt-pt
definition: Hörfunk im künstlerischen und unterhaltenden Sinn
definition: Histórias relativas à rádio como arte e entretenimento. @pt-br
definition: Radio as art and entertainment @en-gb
definition: Média parlé en tant qu'instrument de distraction @fr
definition: Historias relacionadas a la radio como arte y entretención @es
definition: Strumento di comunicazione di massa, notizie collegate ad esso come arte e spettacolo @it
definition: 芸術と娯楽としてのラジオと関連した記事 @ja-jp
note: nessuno @it
in scheme: subjectcode
created: 2000-10-30T12:00:00+00:00
modified: 2010-12-15T17:01:09+00:00
broader: http://cv.iptc.org/newscodes/subjectcode/01000000