Musica a Teatro
type: Concept
preferred label: オペラ・ミュージカル @ja-jp
preferred label: teatro musical @es
preferred label: Musique scénique @fr
preferred label: Musiktheater @de
preferred label: music theatre @en-gb
definition: Ópera, opereta, revistas musicais, music halls. @pt-br
definition: Opéra, opérettes et music hall @fr
definition: Opera, operetta, music revues etc @en-gb
definition: Opera, operetta, varietà musicale, musical, rivista ecc.
definition: Opera, operetta, variedades musicales. @es
definition: Oper, Operette, Musicals etc. @de
definition: 歌劇、オペレッタ、音楽レビューなど @ja-jp
note: nessuno
in scheme: subjectcode
created: 2004-10-13T12:00:00+00:00
modified: 2012-07-10T12:00:00+00:00
broader: http://cv.iptc.org/newscodes/subjectcode/01017000