Istituzioni - ANNULLATO
type: Concept
preferred label: instituição-INATIVO @pt-br
preferred label: Institutions-DEPRECATED @fr
preferred label: institución-ANULADO @es
preferred label: 制度・組織－使用不可 @ja-jp
preferred label: institution-DEPRECATED @en-gb
preferred label: Institution-GELÖSCHT @de
definition: NA @en-gb
definition: --- @de
definition: Estabelecimento, organização de caráter social, religioso, educativo ou sistema similar, como hospital, escola, prisão-INATIVO @pt-br
definition: ANNULLATO
definition: ANULADO @es
definition: Etablissement, organisation à caractère social, religieux, éducatif, ou autre système à but similaire DEPRECATED @fr
definition: 確立された法律、業務、体制、あるいは病院、学校、刑務所のように、社会的/宗教的/教育的に同じ目的を持っている組織 @ja-jp
note: DEPRECATED in V 14 - term moved to 04018001 @fr
note: ANNULLATO in V 14 - Termine spostato al numero 04018001
note: Begriff nach 04018001 verschoben @de
in scheme: subjectcode
created: 2004-08-27T12:00:00+00:00
modified: 2012-07-10T12:00:00+00:00
retired: 2004-08-27T00:00:00+00:00
broader: http://cv.iptc.org/newscodes/subjectcode/01018000