entretenimento (prémios)
type: Concept
preferred label: 芸能関連賞 @ja-jp
preferred label: entertainment award @en-gb
preferred label: Premi @it
preferred label: Kulturelle Auszeichnung @de
definition: Premi e cerimonie di premiazione nel mondo dello spettacolo e dell'industria dell'intrattenimento: Oscar, Grammy, ecc. @it
definition: Prémios da indústria de entretenimento, como os Óscares do cinema, o Prémio Booker de Literatura e os Grammys para a música.
definition: 映画のオスカー、文学のブッカー賞、音楽のグラミー賞あるいは殿堂入りなど娯楽産業における業績に与えられる賞 @ja-jp
definition: Awards for achievement in the entertainment industry, such as the Oscars for film, the Booker Prize for Literature, the Grammys for music, or induction into halls of fame. @en-gb
definition: Prêmios da indústria de entretenimento, como Oscars, Booker Prize, Grammys, etc.
definition: Preis für Leistungen in der Unterhaltungsindustrie, wie z.B Oskar beim Film, Buchpreis in der Literatur, der Grammy in der Musikindustrie oder die Einladung in die *Halls of fame*. @de
note: nessuno @it
in scheme: subjectcode
created: 2006-08-21T12:00:00+00:00
modified: 2012-07-10T12:00:00+00:00
broader: http://cv.iptc.org/newscodes/subjectcode/01021000
broad match: http://cv.iptc.org/newscodes/mediatopic/20000002