Cultura (generico)
type: Concept
preferred label: cultura (geral) @pt-pt
preferred label: Kultur @de
preferred label: Culture @fr
preferred label: 文化（一般） @ja-jp
preferred label: cultura (general) @es
preferred label: culture (general) @en-gb
definition: Insieme delle idee, costumi, arti, attitudini di un determinato gruppo o di una determinata società.
definition: Ideias, costumes, artes, competências de um grupo em particular. @pt-pt
definition: 特定の集団の思想、習慣、芸術、技術 @ja-jp
definition: The ideas, customs, arts, skills of a particular group @en-gb
definition: L'ensemble des connaissances assimilées par une société donnée @fr
definition: Las ideas, costumbres, artes, aptitudes de un grupo en particular @es
definition: Die Ideen, Bräuche, Künste, Fertigkeiten einer bestimmten Gruppe. @de
note: nessuno
in scheme: subjectcode
created: 2000-10-30T12:00:00+00:00
modified: 2010-12-15T17:01:09+00:00
broader: http://cv.iptc.org/newscodes/subjectcode/01000000
narrower: http://cv.iptc.org/newscodes/subjectcode/01022001