desenvolvimento cultural
type: Concept
preferred label: Histoire de la culture @fr
preferred label: 文化史 @ja-jp
preferred label: cultural development @en-gb
preferred label: desarrollo cultural @es
preferred label: Kulturgeschichte @de
preferred label: Sviluppo culturale @it
definition: História do desenvolvimento de artes e culturas, tais como pinturas rupestres, arte pré-colombiana, confecção de papel chinês.
definition: La historia del desarrollo de las artes y culturas tales como las pinturas rupestres, arte pre'colombino, la confección de papel chino. Cualquier cosa no política. @es
definition: Histoire du développement de l'art et de la culture @fr
definition: Storia dello sviluppo artistico e culturale @it
definition: História do desenvolvimento de artes e culturas, tais como pinturas rupestres, arte pré-colombiana ou confeção de papel chinês.
definition: 政治的には関係ない洞窟壁画、コロンビア芸術、中国製紙の起源のような芸術や文化の発達の歴史 @ja-jp
definition: The history of the development of art and culture such as the rise of cave paintings, pre-Colombian art, Chinese paper-making, anything non-political @en-gb
definition: Die Geschichte der Entwicklung von Kunst und Kultur, wie beispielsweise die Entstehung der Höhlenmalerei, der vorkolumbianischen Kunst oder der chinesische Papierkunst, alles Unpolitische. @de
note: nessuno @it
in scheme: subjectcode
created: 2004-04-22T12:00:00+00:00
modified: 2012-07-10T12:00:00+00:00
broader: http://cv.iptc.org/newscodes/subjectcode/01022000