animação
type: Concept
preferred label: Dessin animé @fr
preferred label: animation @en-gb
preferred label: Animation/Zeichentrick @de
preferred label: Animazione @it
preferred label: animación @es
preferred label: アニメ @ja-jp
definition: Cartoni animati, lungo e cortometraggi, artisti e commercializzazione di oggetti collegati a personaggi di cartoni animati @it
definition: Animação, incluindo longas e curtas-metragens, artistas e comercialização de produtos com personagens de animação.
definition: Animation, including full-length and short cinema, artists and merchandising of goods featuring animation characters. @en-gb
definition: Notícias referentes à técnica que permite dar a desenhos ou bonecos a ilusão de movimento, aos artistas envolvidos e à comercialização de produtos com personagens dos filmes daí resultantes.
definition: Zeichentrickfilm, auch Kurzfilmkino, Künstler und Vermarktung von Produkten rund um Zeichentrickfiguren. @de
definition: Dessins animés de toutes sortes @fr
definition: Animaciones incluidas cine de larga y corta duración, artistas y merchandising de artículos de las figuras animadas. @es
definition: アニメーションムービーに関する、長編･短編の作品、作家、そしてキャラクター商品の販売 @ja-jp
note: nessuno @it
in scheme: subjectcode
created: 2000-10-30T12:00:00+00:00
modified: 2010-12-15T17:01:09+00:00
broader: http://cv.iptc.org/newscodes/subjectcode/01000000