Periodici
type: Concept
preferred label: 定期刊行物 @ja-jp
preferred label: Zeitschrift @de
preferred label: periódicos @es
preferred label: Périodiques @fr
preferred label: periodicals @en-gb
definition: Pubblicazioni periodiche o riviste con cadenza settimanale, quindicinale, mensile o altro
definition: Material escrito que se publica semanal, quinzenal, mensal ou anualmente. @pt-br
definition: Journaux et magazines périodiques : hebdomadaire, bi-hebdo, mensuel, bi-mensuel, bimestriel, trimestriel, semestriel, annuel @fr
definition: Written material that is usually published weekly, bi-weekly, monthly or annually for a long time @en-gb
definition: 週ごと、隔週ごと、月ごと、年ごとに、長期にわたって定期的に発刊される書物 @ja-jp
definition: Geschriebenes, was über einen längeren Zeitraum meist wöchentlich, vierzehntägig, monatlich oder jährlich veröffentlicht wird. @de
definition: Material escrito que generalmente se publica semanal, mensual anualmente durante un largo tiempo @es
note: nessuno
in scheme: subjectcode
created: 2003-04-05T12:00:00+00:00
modified: 2012-07-10T12:00:00+00:00
broader: http://cv.iptc.org/newscodes/subjectcode/01026000