órgãos noticiosos
type: Concept
preferred label: Mezzi informazione @it
preferred label: Radio-tv @fr
preferred label: mídia noticiosa
preferred label: medios informativos @es
preferred label: Nachrichtensender @de
preferred label: news media @en-gb
preferred label: ニュースメディア @ja-jp
definition: テレビ、ワイヤーサービス、ラジオ。出来事について事実を集め、それをもとに、視聴者/読者に対して全体の話として作り上げて紹介する @ja-jp
definition: Televisione, servizi via cavo, radio e altro con la raccolta di notizie e informazioni e la presentazione di esse al pubblico @it
definition: Órgãos de comunicação que se dedicam à difusão pública de notícias, incluindo as publicações impressas (jornais e revistas), a rádio e a televisão e, mais recentemente, os serviços de notícias eletrónicos.
definition: Televisão, rádio, serviços de notícias que recolhem fatos sobre incidentes, desenvolvendo e fazendo sua apresentação ao público como uma história completa.
definition: Televisión, servicios de telex, radio que recogen hechos acerca de incidentes, desarrollando y presentándolos a la audiencia como toda una historia @es
definition: Television, wire services, radio that collect facts about incidents, developing and presenting them to audiences as a whole story @en-gb
definition: Fernsehen, Radio und Telekommunikationsdienstleister, die Fakten über Ereignisse sammeln und diese für die Öffentlichkeit aufbereiten. @de
definition: Agence de presse, radio, télévision @fr
note: nessuno @it
in scheme: subjectcode
created: 2003-04-05T12:00:00+00:00
modified: 2012-07-10T12:00:00+00:00
broader: http://cv.iptc.org/newscodes/subjectcode/01026000