jornais
type: Concept
preferred label: newspapers @en-gb
preferred label: 新聞 @ja-jp
preferred label: diarios y revistas @es
preferred label: Journaux @fr
preferred label: Zeitung @de
preferred label: Giornali @it
definition: Pubblicazioni quotidiane o settimanali di notizie o con servizi speciali @it
definition: Publicações diárias ou semanais que apresentam histórias do dia a dia, do mundo, filmes, quadrinhos, etc.
definition: Tägliche oder wöchentliche Publikationen, die das tägliche Weltgeschehen darstellen, wie Reportagen, Berichte, Comics etc. @de
definition: Publicações diárias ou semanais que apresentam em geral notícias e informações atualizadas, nacionais e internacionais, sobre um amplo número de assuntos e destinadas ao público em geral.
definition: Publicaciones dirías o semanales que presentan día a día noticias, películas y comics, etc. @es
definition: Daily or weekly publications that present the day to day history of the world, as well as features, comics etc @en-gb
definition: Journaux quotidiens et hebdomadaires @fr
definition: 日刊あるいは週刊の刊行物。特集や漫画などだけでなく、世界で日々起こっている歴史を紹介する @ja-jp
note: nessuno @it
in scheme: subjectcode
created: 2003-04-05T12:00:00+00:00
modified: 2012-07-10T12:00:00+00:00
broader: http://cv.iptc.org/newscodes/subjectcode/01026000