Internet
type: Concept
preferred label: インターネット @ja-jp
preferred label: internet @es
definition: Internet as art and entertainment @en-gb
definition: Il web e le sue potenzialità nel mondo della comunicazione e nell'intrattenimento @it
definition: Historias relacionadas con Internet, como arte y entretenimiento. @es
definition: Histoires liées à l'internet comme instrument d'art et de distraction
definition: Histórias relativas à Internet como arte e entretenimento. @pt-br
definition: Internet im künstlerischen und unterhaltenden Sinn @de
definition: 芸術や芸能に関するインターネットの記事 @ja-jp
note: nessuno @it
in scheme: subjectcode
created: 2003-11-26T12:00:00+00:00
modified: 2012-07-10T12:00:00+00:00
broader: http://cv.iptc.org/newscodes/subjectcode/01000000