história
type: Concept
preferred label: 歴史 @ja-jp
preferred label: Historisches @de
preferred label: Storia @it
preferred label: history @en-gb
definition: *Assuntos relacionados ao passado; descobertas, restauro, conservação e exibição de artefatos; comemorações de eventos históricos.*
definition: 過去や発見、修復、保存、営造物の展示、歴史的出来事の記念などに関わる問題 @ja-jp
definition: Issues connected with the past; discoveries, repair, conservation or display of artifacts; anniversaries of historic events @en-gb
definition: *Assuntos relacionados com o passado; descobertas, restauro, conservação e exibição de artefactos; comemorações de eventos históricos.*
definition: Artikel, die sich auf die Vergangenheit beziehen; Entdeckungen, Restauration, Aufbewahrung und Ausstellung altertümlicher (Kunst)Gegenständen; Jahrestage historischer Ereignisse. @de
definition: Fatti connessi con il passato: scoperte, conservazione o scoperte di manufatti, anniversari di eventi di portata storica @it
note: nessuno @it
in scheme: subjectcode
created: 2006-08-21T12:00:00+00:00
modified: 2012-07-10T12:00:00+00:00
broader: http://cv.iptc.org/newscodes/subjectcode/01000000