Criminalità
type: Concept
preferred label: Criminalité @fr
preferred label: criminalidad @es
preferred label: crime @pt-pt
preferred label: 犯罪 @ja-jp
preferred label: Kriminalität @de
definition: Violation of established laws by individuals, companies or organizations @en-gb
definition: Insieme degli atti compiuti da soggetti, gruppi o organizzazioni che contravvengono alle leggi vigenti.
definition: La violación de las leyes establecidas por parte de individuos, compañias u organizaciones @es
definition: Violação das leis por indivíduos, empresas ou organizações. @pt-br
definition: 人、会社、組織による法律違反 @ja-jp
definition: Ensemble des actes contrevenant aux lois @fr
definition: Verletzung von etablierten Gesetzen durch Individuen, Firmen und Organisationen. @de
note: nessuno
in scheme: subjectcode
created: 2000-10-30T12:00:00+00:00
modified: 2010-12-15T17:01:09+00:00
broader: http://cv.iptc.org/newscodes/subjectcode/02000000
narrower: http://cv.iptc.org/newscodes/subjectcode/02001001
narrower: http://cv.iptc.org/newscodes/subjectcode/02001002
narrower: http://cv.iptc.org/newscodes/subjectcode/02001003
narrower: http://cv.iptc.org/newscodes/subjectcode/02001004
narrower: http://cv.iptc.org/newscodes/subjectcode/02001005
narrower: http://cv.iptc.org/newscodes/subjectcode/02001006
narrower: http://cv.iptc.org/newscodes/subjectcode/02001007
narrower: http://cv.iptc.org/newscodes/subjectcode/02001008
narrower: http://cv.iptc.org/newscodes/subjectcode/02001009
narrower: http://cv.iptc.org/newscodes/subjectcode/02001010