Aggressioni (generico)
type: Concept
preferred label: assalto @pt-pt
preferred label: assault (general) @en-gb
preferred label: Agression @fr
preferred label: asalto (general) @es
preferred label: 暴行（一般） @ja-jp
preferred label: Gewalt (allgemein) @de
definition: Battery, slugfests, brawls and threatening behaviour @en-gb
definition: Estropicio, puñetazos, reyertas y comportamiento amenzador. @es
definition: 殴打、殴り合い、口論(けんか)や脅迫的な行動 @ja-jp
definition: Körperverletzung, Prügeleien, Streit und bedrohliches Verhalten. @de
definition: Comportamenti violenti o quelli atti ad intimidire qualcuno, le risse, violenze personali, percosse, lesioni
definition: Agressão física, briga, rixa e comportamento ameaçador. @pt-br
definition: Coups et blessures, bagarre et comportement menaçant @fr
note: nessuno
in scheme: subjectcode
created: 2004-10-13T12:00:00+00:00
modified: 2012-07-10T12:00:00+00:00
broader: http://cv.iptc.org/newscodes/subjectcode/02001000