incêndio criminoso
type: Concept
preferred label: incendio premeditado @es
preferred label: 放火 @ja-jp
preferred label: fogo posto
preferred label: arson @en-gb
preferred label: Incendi dolosi @it
preferred label: Incendie criminel @fr
preferred label: Brandstiftung @de
definition: Mettre le feu de manière intentionnelle @fr
definition: Incêndio intencional, de origem criminosa.
definition: 犯行目的で意図的に火をつけること @ja-jp
definition: Absichtliches in Brand stecken mit krimineller Intention. @de
definition: Inicio intencional de un fuego con intentos criminales @es
definition: Incendi appiccati con premeditazione e intenzionalmente con un intento criminale @it
definition: Intentional setting of fires with criminal intent @en-gb
note: nessuno @it
in scheme: subjectcode
created: 2004-10-13T12:00:00+00:00
modified: 2012-07-10T12:00:00+00:00
broader: http://cv.iptc.org/newscodes/subjectcode/02001000