Forze Ordine
type: Concept
preferred label: Police @fr
preferred label: policía @es
preferred label: police @en-gb
preferred label: 警察 @ja-jp
preferred label: Polizei @de
preferred label: polícia @pt-br
definition: Agents of the legal system set up enforce the laws @en-gb
definition: 法律を実行するために準備された合法的な組織 @ja-jp
definition: Agents de la force publique dont la mission est notamment le maintien de l'ordre @fr
definition: Agentes del sistema legal establecido para aplicar la ley. @es
definition: Complesso delle forze a disposizione dello stato per prevenire i reati, individuarne gli autori e tutelare l'ordine pubblico; gli organismi di rappresentanza
definition: Mitarbeiter des rechtsgültigen Systems (Staat), die zur Einhaltung der Gesetze eingesetzt werden. @de
definition: Agentes do sistema legal cuja missão é a aplicação das leis para a manutenção da ordem. @pt-br
definition: Agentes do estado que têm por missão zelar pelo cumprimento da lei, proteger as pessoas e a propriedade e manter a ordem pública. @pt-pt
note: nessuno
in scheme: subjectcode
created: 2000-10-30T12:00:00+00:00
modified: 2010-12-15T17:01:09+00:00
broader: http://cv.iptc.org/newscodes/subjectcode/02000000
narrower: http://cv.iptc.org/newscodes/subjectcode/02003001
narrower: http://cv.iptc.org/newscodes/subjectcode/02003002
narrower: http://cv.iptc.org/newscodes/subjectcode/02003003