Corpi Polizia
type: Concept
preferred label: law enforcement @en-gb
preferred label: 法執行機関 @ja-jp
preferred label: Sicherheitskräfte (BGS, LKA, BKA) @de
preferred label: autoridades @es
preferred label: forças policiais @pt-br
preferred label: Forces de l'ordre @fr
definition: Police et gendarmerie, chargés de faire respecter la loi d'un pays @fr
definition: I vari corpi, agenzie, direzioni, dipartimenti impegnati nella prevenzione di azioni delittuose o nell'esecuzione di provvedimenti dell'autorità giudiziaria
definition: Tätigkeitesbereiche, die eingebunden sind in Präventivmaßnahmen zur Verhinderung von Verstößen gegen gültige Gesetze, oder die Gesetzesbrecher vor Gericht zu bringen. @de
definition: Agencias que previenen que se desobedezcan las leyes establecidas, y llevar a juicio a quienes tratan de violarlas. @es
definition: 制定された法律に違反しないようにしたり、法律に服従しないものを公正に導くことに関係している政府機関 @ja-jp
definition: Agências envolvidas na prevenção da desobediência às leis estabelecidas e em levar a tribunal os que desobedecem a essas leis. @pt-br
definition: Agencies involved in attempts to prevent disobedience to established laws, or to bring to justice those that disobey those laws @en-gb
note: nessuno
in scheme: subjectcode
created: 2003-04-05T12:00:00+00:00
modified: 2012-07-10T12:00:00+00:00
broader: http://cv.iptc.org/newscodes/subjectcode/02003000