Pena
type: Concept
preferred label: punishment @en-gb
preferred label: punição / sentença @pt-br
preferred label: 刑罰 @ja-jp
preferred label: Strafverfolgung @de
preferred label: Peines @fr
preferred label: penas @es
definition: 法を破った者に与えられる懲罰 @ja-jp
definition: The retribution handed out to those who break the laws @en-gb
definition: Sentenças impostas àqueles que infringem as leis. @pt-br
definition: Provvedimento giudiziario imposto con sentenza a seguito di processo davanti ad un giudice
definition: Strafe, die gegen Gesetzesbrecher verhängt wird. @de
definition: Sentencias impuestas a aquellos que quebrantan la ley. @es
definition: Condamnation à laquelle on s'expose en enfreignant la loi @fr
note: nessuno
in scheme: subjectcode
created: 2000-10-30T12:00:00+00:00
modified: 2010-12-15T17:01:09+00:00
broader: http://cv.iptc.org/newscodes/subjectcode/02000000
narrower: http://cv.iptc.org/newscodes/subjectcode/02004001
narrower: http://cv.iptc.org/newscodes/subjectcode/02004002