prisão
type: Concept
preferred label: 刑務所 @ja-jp
preferred label: Strafvollzug @de
preferred label: Prison @fr
preferred label: cárcel @es
preferred label: prison @en-gb
preferred label: Carceri @it
definition: Auch bekannt als Gefängnis, Knast, Haft etc. um Gesetzesbrecher von der Gesellschaft fernzuhalten. @de
definition: Prisão, casa de detenção, presídio onde são encarcerados os infratores condenados pela justiça.
definition: 社会から法律違反者を隔離するためのもの。例えば刑務所、留置所、拘置所など @ja-jp
definition: Prison, maison d'arrêt, géôle où sont enfermées les personnes condamnées @fr
definition: Also know as jails, lockups, calaboose, etc. for keeping law breakers from society @en-gb
definition: Edificação onde são encarcerados os infratores condenados pela justiça.
definition: Strutture in cui è rinchiuso chi è privato della libertà personale a seguito di una condanna o per un provvedimento cautelare @it
definition: También conocida como prisión, encierro, calabozo, etc., para mantener lejos de la sociedads, a los que quebrantan las leyes. @es
note: nessuno @it
in scheme: subjectcode
created: 2000-10-30T12:00:00+00:00
modified: 2010-12-15T17:01:09+00:00
broader: http://cv.iptc.org/newscodes/subjectcode/02000000