Civile
type: Concept
preferred label: civil @en-gb
preferred label: Bürgerliches Gesetzbuch @de
preferred label: 民法 @ja-jp
preferred label: Droit civil @fr
definition: Sistema do código civil. @pt-pt
definition: 民法典体系 @ja-jp
definition: Sistema del codice e della procedura civile
definition: Les droits individuels @fr
definition: System der zivilen Vergehen und Delikte. @de
definition: The civil code system @en-gb
definition: Sistema del código civil @es
note: nessuno
in scheme: subjectcode
created: 2004-10-13T12:00:00+00:00
modified: 2012-07-10T12:00:00+00:00
broader: http://cv.iptc.org/newscodes/subjectcode/02006000