Giustizia e diritti
type: Concept
preferred label: Droits @fr
preferred label: Rechtsprechung @de
preferred label: justiça e direitos @pt-br
preferred label: justice and rights @en-gb
preferred label: 司法と権利 @ja-jp
preferred label: justicia y derechos @es
definition: 法や規則の公正な執行 @ja-jp
definition: Administração equitativa de leis e regulamentos. @pt-pt
definition: The equitable administration of laws and regulations @en-gb
definition: Die gerechte Anwendung von Gesetzen und Regularien. @de
definition: Administration équitable des lois et des réglements @fr
definition: La administración equitativa de las leyes y regulaciones. @es
definition: Equa amministrazione di leggi e normative
note: nessuno
in scheme: subjectcode
created: 2000-10-30T12:00:00+00:00
modified: 2010-12-15T17:01:09+00:00
broader: http://cv.iptc.org/newscodes/subjectcode/02000000
narrower: http://cv.iptc.org/newscodes/subjectcode/02007001