Diritti civili
type: Concept
preferred label: Zivilrecht @de
preferred label: 公民権 @ja-jp
preferred label: direitos cívicos @pt-br
preferred label: Droits civils @fr
preferred label: civil rights @en-gb
preferred label: derechos civiles @es
definition: Rechte des Einzelnen im Bürgerlichen Recht. @de
definition: Diritti degli individui sotto la legge
definition: Direitos dos indivíduos no plano civil. @pt-br
definition: Droits des citoyens sur le plan civil @fr
definition: Rights of individuals under civil law @en-gb
definition: Derechos de los individuos bajo la ley civil. @es
definition: 民法上の個人の権利 @ja-jp
note: nessuno
in scheme: subjectcode
created: 2003-04-05T12:00:00+00:00
modified: 2012-07-10T12:00:00+00:00
broader: http://cv.iptc.org/newscodes/subjectcode/02007000