julgamentos
type: Concept
preferred label: trials @en-gb
preferred label: Processo @it
preferred label: juicios @es
preferred label: 裁判 @ja-jp
preferred label: Procès @fr
preferred label: Prozess/Gericht @de
definition: 有罪か無罪か、または正しいか間違っているかを決定され宣告される手続き @ja-jp
definition: El proceso mediante el cual culpable o inocente, o correcto o incorrecto es determinado y juzgado. @es
definition: Processo mediante o qual culpado ou inocente, certo ou errado é determinado e julgado.
definition: The process by which guilt or innocence, or right or wrong is determined and adjudged @en-gb
definition: Passage devant un tribunal pour régler un différend entre deux ou plusieurs parties @fr
definition: Processo mediante o qual se determina e julga a culpa ou a inocência, o certo e o errado.
definition: Vorgang, bei dem Schuld oder Unschuld, richtig oder falsch festgesetzt und geklärt wird. @de
definition: Procedimento giudiziario mediante il quale vengono stabilite e giudicate la colpevolezza o l'innocenza, la ragione o il torto @it
note: nessuno @it
in scheme: subjectcode
created: 2000-10-30T12:00:00+00:00
modified: 2010-12-15T17:01:09+00:00
broader: http://cv.iptc.org/newscodes/subjectcode/02000000
narrower: http://cv.iptc.org/newscodes/subjectcode/02008001
narrower: http://cv.iptc.org/newscodes/subjectcode/02008002
narrower: http://cv.iptc.org/newscodes/subjectcode/02008003