Causa
type: Concept
preferred label: litigios @es
preferred label: litígio @pt-pt
preferred label: Rechtsstreit @de
preferred label: Litige @fr
preferred label: litigation @en-gb
preferred label: 訴訟 @ja-jp
definition: Llevar a la corte por medio de un juez o jurado asuntos que se disputan @es
definition: Streitigkeiten, die vor Gericht gebracht werden, um von einer Jury entschieden zu werden. @de
definition: Presentazione degli argomenti di una controversia davanti ad un giudice per una risoluzione
definition: Levar a tribunal assuntos que se disputam para resolução por meio de juiz e/ou júri. @pt-pt
definition: Action en justice pour régler un litige @fr
definition: 係争点を裁判官そして/あるいは陪審員が解決するために裁判を起こす @ja-jp
definition: Taking disputed issues to court for settlement by judge and/or jury @en-gb
note: nessuno
in scheme: subjectcode
created: 2003-04-05T12:00:00+00:00
modified: 2012-07-10T12:00:00+00:00
broader: http://cv.iptc.org/newscodes/subjectcode/02008000