Imputato
type: Concept
preferred label: acusado @es
preferred label: Accusé @fr
preferred label: réu @pt-br
preferred label: 被告 @ja-jp
preferred label: defendant @en-gb
preferred label: Angeklagter @de
definition: La persona en juicio. @es
definition: Indivíduo que está sendo julgado em tribunal. @pt-br
definition: Indivíduo que está a ser julgado em tribunal. @pt-pt
definition: Chi nel processo penale viene accusato di aver commesso un reato.
definition: 公判中の人 @ja-jp
definition: The person on trial @en-gb
definition: Die Person, die vor Gericht steht. @de
definition: Une personne qui est accusée lors d'un procès @fr
note: nessuno
in scheme: subjectcode
created: 2004-04-22T12:00:00+00:00
modified: 2012-07-10T12:00:00+00:00
broader: http://cv.iptc.org/newscodes/subjectcode/02009000