Teste
type: Concept
preferred label: testemunha @pt-pt
preferred label: witness @en-gb
preferred label: Zeuge @de
preferred label: Témoin @fr
preferred label: testigo @es
preferred label: 証人 @ja-jp
definition: A person who testifies @en-gb
definition: Eine Person, die etwas bezeugt. @de
definition: Chi viene chiamato rendere testimonianza
definition: 証言する人 @ja-jp
definition: Indivíduo que testemunha. @pt-br
definition: Una persona que testifica. @es
definition: Une personne qui témoigne @fr
note: nessuno
in scheme: subjectcode
created: 2004-04-22T12:00:00+00:00
modified: 2012-07-10T12:00:00+00:00
broader: http://cv.iptc.org/newscodes/subjectcode/02009000