crime de guerra
type: Concept
preferred label: Crimini Guerra @it
preferred label: Kriegsverbrechen @de
preferred label: crimen de guerra @es
preferred label: 戦争犯罪 @ja-jp
preferred label: war crime @en-gb
preferred label: Crime de guerre @fr
definition: 戦争または武力紛争の間に通常民間人や捕虜に対して犯される犯罪。そのような犯罪の告発・起訴を含む @ja-jp
definition: Kriminelle Handlungen und deren Strafverfolgung, die während eines Krieges oder bewaffneten Konfliktes begangen werden, gewöhnlich gegen Zivilisten oder Kriegsgefangene. @de
definition: Crimes cometidos durante uma guerra ou conflito armado, geralmente contra civis ou prisioneiros de guerra, incluindo a perseguição dos seus autores.
definition: Crímenes cometidos durante una guerra o conflicto armado, generalmente contra civiles o prisioneros de guerra, lo que incluye la condena de tales crímenes. @es
definition: Crimes committed during a war or armed conflict, usually against civilians or POW's, including the prosecution of such crimes @en-gb
definition: Crimes de guerre y compris les poursuites contre leurs auteurs @fr
definition: Crimes cometidos durante uma guerra ou conflito armado, geralmente contra civis ou prisioneiros de guerra, incluindo a perseguição de seus autores.
definition: Crimini commessi durante una guerra o un conflitto armato, generalmente contro civili o prigionieri di guerra e i processi istruiti contro tali crimini @it
note: nessuno @it
in scheme: subjectcode
created: 2003-11-26T12:00:00+00:00
modified: 2012-07-10T12:00:00+00:00
broader: http://cv.iptc.org/newscodes/subjectcode/02000000