Carestia
type: Concept
preferred label: fome @pt-pt
preferred label: 飢饉 @ja-jp
preferred label: Hunger @de
preferred label: Famine @fr
preferred label: hambruna @es
preferred label: famine @en-gb
definition: Grave falta de comida para a população. @pt-br
definition: Grave mancanza di cibo o comunque di sostentamento in un'area geografica o per una popolazione e per un lungo periodo di tempo
definition: Disète de vivres @fr
definition: Severe lack of food for a large population @en-gb
definition: Schwerer Mangel an Nahrungsmitteln für eine große Bevölkerung. @de
definition: Falta severa de comida entre la población. @es
definition: 多くの人々がひどい食料不足になること @ja-jp
note: nessuno
in scheme: subjectcode
created: 2000-10-30T12:00:00+00:00
modified: 2010-12-15T17:01:09+00:00
broader: http://cv.iptc.org/newscodes/subjectcode/03000000