Inondazione
type: Concept
preferred label: Inondation @fr
preferred label: inundações @pt-br
preferred label: flood @en-gb
preferred label: inundaciones @es
preferred label: Hochwasser @de
preferred label: 洪水 @ja-jp
definition: Excesso de água, causado por chuvas intensas ou por neve derretida. @pt-br
definition: Débordement des eaux qui submergent le sol @fr
definition: Exceso de agua causado por intensas lluvias o derretimiento de nieve, usualmenete en lugares donde no es deseado. @es
definition: Übermaß an Wasser, verursacht durch schwere Regenfälle oder Schneeschmelze, in der Regel an Orten, wo es nicht gewünscht ist. @de
definition: Surfeit of water, caused by heavy rains or melting snow, usually in places where it's not wanted @en-gb
definition: 通常は望まれない場所で、豪雨や雪解けにより引き起こされる水の氾濫 @ja-jp
definition: Allagamento di un territorio o zona geografica determinato da piogge intense o scioglimento di nevi che possono provocare la rottura di argini e la tracimazione di corsi d'acqua
note: nessuno
in scheme: subjectcode
created: 2000-10-30T12:00:00+00:00
modified: 2010-12-15T17:01:09+00:00
broader: http://cv.iptc.org/newscodes/subjectcode/03000000