Incidente industriale
type: Concept
preferred label: 事故（構造物） @ja-jp
preferred label: accidente industrial @es
preferred label: acidente industrial @pt-pt
preferred label: Accident industriel @fr
preferred label: Industrieunglück @de
preferred label: industrial accident @en-gb
definition: Unfall in einer Fabrik, einem Shop oder einem Büro, meist gefährlich für Menschen. @de
definition: A mishap in a factory, a shop or an office, potentially harmful to humans @en-gb
definition: Una desgracia en una fábrica, negocio u oficina, potencialmente dañino para los humanos. @es
definition: Acidente em fábrica, loja ou oficina, potencialmente perigoso. @pt-pt
definition: Disgrazia o Incidente avvenuti in una fabbrica, in uno stabilimento o comunque in un luogo di produzione, con possibili conseguenze sulla salute degli esseri viventi; Incidente lavoro
definition: 工場、店、オフィスで起こる災難で、潜在的に人に有害な場合もある @ja-jp
definition: Accident industriel @fr
note: nessuno
in scheme: subjectcode
created: 2000-10-30T12:00:00+00:00
modified: 2010-12-15T17:01:09+00:00
broader: http://cv.iptc.org/newscodes/subjectcode/03000000
narrower: http://cv.iptc.org/newscodes/subjectcode/03006001