tempestade
type: Concept
preferred label: Tempête @fr
preferred label: tormentas de viento @es
preferred label: 暴風 @ja-jp
preferred label: Orkan @de
preferred label: tempestade ciclónica
preferred label: windstorms @en-gb
preferred label: Tempeste vento @it
definition: Sturm mit hoher Geschwindigkeit, aber ohne das gewaltige Tempo eines Hurrikans, mit wenig oder ohne Regen oder Hagel. Meistens stark zerstörerisch. @de
definition: Tempeste dovute al maltempo ma senza la forza degli uragani, con presenza o meno di pioggia o grandine e dagli effetti quasi sempre altamente distruttivi @it
definition: 雨やあられを伴うことは少ない高風速の嵐で、ハリケーンとは異なる。破壊力はきわめて大きい @ja-jp
definition: Tormenta de alta velocidad sin los movimientos de un huracán con poca lluvia y granizos. A menudo muy destructivo. @es
definition: Fenómeno atmosférico caracterizado por ventos fortes, geralmente com pouca chuva, que pode ser altamente destrutivo.
definition: Tempestade de grande velocidade mas sem furacões e com pouca chuva ou granizo. Altamente destrutiva.
definition: A storm of high velocity but non-hurricane force movements of air with little or no rain or hail. Often highly destructive @en-gb
definition: Orages, tempêtes mais pas ouragan @fr
note: nessuno @it
in scheme: subjectcode
created: 2003-04-05T12:00:00+00:00
modified: 2012-07-10T12:00:00+00:00
broader: http://cv.iptc.org/newscodes/subjectcode/03007000