Incidenti nucleari
type: Concept
preferred label: Atomunglück @de
preferred label: acidente nuclear @pt-pt
preferred label: accidente nuclear @es
preferred label: 放射線事故 @ja-jp
preferred label: Accident nucléaire @fr
preferred label: nuclear accident @en-gb
definition: Sciagura o incidente con la liberazione di sostanze radioattive
definition: Accident nucléaire @fr
definition: Unglück im Zusammenhang mit radioaktiven Materialien. @de
definition: Una tragedia que envuelve materiales radioactivos. @es
definition: 放射性物質を含んだ災害 @ja-jp
definition: A mishap involving radioactive materials @en-gb
definition: Acidente envolvendo materiais radioativos. @pt-pt
note: nessuno
in scheme: subjectcode
created: 2000-10-30T12:00:00+00:00
modified: 2010-12-15T17:01:09+00:00
broader: http://cv.iptc.org/newscodes/subjectcode/03000000