Inquinamento
type: Concept
preferred label: poluição @pt-pt
preferred label: pollution @en-gb
preferred label: Pollution @fr
preferred label: contaminación @es
preferred label: 公害 @ja-jp
preferred label: Umweltverschmutzung @de
definition: Nuisance contribuant à la dégradation de l'environnement @fr
definition: Emissão de materiais indesejados em áreas onde pode ser prejudicial. @pt-pt
definition: Emissions of unwanted materials in areas where it can be harmful @en-gb
definition: 有害物質をある地域に放出すること @ja-jp
definition: Emisión de materiales no deseados en áreas donde puede ser dañino. @es
definition: Emissione o liberazione di sostanze o anche di particolari effetti dannosa per l'ambiente e per l'equilibrio tra esso e le specie viventi
definition: Verschmutzung mit unerwünschtem Material, in Gebieten in denen es gefährlich werden kann. @de
note: nessuno
in scheme: subjectcode
created: 2000-10-30T12:00:00+00:00
modified: 2010-12-15T17:01:09+00:00
broader: http://cv.iptc.org/newscodes/subjectcode/03000000